{
  "outputs": [
    {
      "name": "_CORPORATION",
      "type": "http://127.0.0.1/ontology/finance_th_web.owl#corporation",
      "desc": "Output of service OccupationFinder"
    },
    {
      "name": "_SKILLEDOCCUPATION",
      "type": "http://127.0.0.1/ontology/Mid-level-ontology.owl#SkilledOccupation",
      "desc": "Output of service OccupationFinder"
    }
  ],
  "capability": "atomic",
  "file": "geopolitical-entity_corporationskilledoccupation_service.owls",
  "provider": {
    "type": "webservice"
  },
  "inputs": [
    {
      "name": "_GEOPOLITICAL-ENTITY",
      "type": "http://127.0.0.1/ontology/portal.owl#Geographical-Region",
      "desc": "Input of service OccupationFinder"
    }
  ],
  "name": "OccupationFinder",
  "description": "This service finds skilled occupation positions in a geopolitical entity, and also returns corporation who offers that job.",
  "domains": [
    {
      "name": "Industry",
      "url": "http://www.surf.scss.tcd.ie/cityOntology/#Industry"
    }
  ],
  "id": "industry/geopolitical-entity_corporationskilledoccupation_service",
  "state": true,
  "url": "http://surf.scss.tcd.ie/_provider_/industry/geopolitical-entity_corporationskilledoccupation_service"
}