{
  "outputs": [
    {
      "name": "_MAXPRICE",
      "type": "http://127.0.0.1/ontology/concept.owl#MaxPrice",
      "desc": "Output of service CheapCar 1PersonBicycle MaxPrice service"
    }
  ],
  "capability": "atomic",
  "file": "cheapcar1personbicycle_maxprice_service.owls",
  "provider": {
    "type": "asp"
  },
  "inputs": [
    {
      "name": "_1PERSONBICYCLE",
      "type": "http://127.0.0.1/ontology/my_ontology.owl#OnePersonBicycle",
      "desc": "Input of service CheapCar 1PersonBicycle MaxPrice service"
    },
    {
      "name": "_CHEAPCAR",
      "type": "http://127.0.0.1/ontology/my_ontology.owl#CheapCar",
      "desc": "Input of service CheapCar 1PersonBicycle MaxPrice service"
    }
  ],
  "name": "CheapCar 1PersonBicycle MaxPrice service",
  "description": "This service returns max purchase prices of the given pair of a cheap car model and one person bicycle model.",
  "id": "economy/cheapcar1personbicycle_maxprice_service",
  "state": true,
  "url": "http://surf.scss.tcd.ie/_provider_/economy/cheapcar1personbicycle_maxprice_service"
}