{
  "outputs": [
    {
      "name": "_TAXEDPRICE",
      "type": "http://127.0.0.1/ontology/concept.owl#TaxedPrice",
      "desc": "Output of service MediaPlayer TaxedPrice service"
    }
  ],
  "capability": "atomic",
  "file": "mediaplayer_taxedprice_service.owls",
  "provider": {
    "type": "wsdn"
  },
  "inputs": [
    {
      "name": "_MEDIAPLAYER",
      "type": "http://127.0.0.1/ontology/my_ontology.owl#MediaPlayer",
      "desc": "Input of service MediaPlayer TaxedPrice service"
    }
  ],
  "name": "MediaPlayer TaxedPrice service",
  "description": "This service returns the taxed price of a given media player model.",
  "domains": [
    {
      "name": "Technology",
      "url": "http://www.surf.scss.tcd.ie/cityOntology/#Technology"
    }
  ],
  "id": "technology/mediaplayer_taxedprice_service",
  "state": true,
  "url": "http://surf.scss.tcd.ie/_provider_/technology/mediaplayer_taxedprice_service"
}