{
  "outputs": [
    {
      "name": "EBook",
      "type": "http://127.0.0.1/ontology/books.owl#Book",
      "desc": "Output of service EBookOrder2"
    }
  ],
  "capability": "atomic",
  "file": "EBookOrder2.owls",
  "provider": {
    "type": "wsdn"
  },
  "inputs": [
    {
      "name": "EBookRequest",
      "type": "http://127.0.0.1/ontology/books.owl#Title",
      "desc": "Input of service EBookOrder2"
    },
    {
      "name": "UserAccount",
      "type": "http://127.0.0.1/ontology/books.owl#User",
      "desc": "Input of service EBookOrder2"
    }
  ],
  "name": "EBookOrder2",
  "description": "An e-book order web service, where an ebook request is given by title and the required book is placed into the users shopping cart. The service also checks availability of the book in the stock and verifies user\u0027s account.",
  "domains": [
    {
      "name": "Entertainment_Products",
      "url": "http://www.surf.scss.tcd.ie/cityOntology/#Entertainment_Products"
    },
    {
      "name": "Educational",
      "url": "http://www.surf.scss.tcd.ie/cityOntology/#Educational"
    }
  ],
  "id": "books/EBookOrder2",
  "state": true,
  "url": "http://surf.scss.tcd.ie/_provider_/books/EBookOrder2"
}