{
    "capability": "atomic",
    "description": "This service returns Spainish tax in euros on the given prepared food.",
    "domains": [
        {
            "name": "Food_and_Drinks",
            "url": "http://www.surf.scss.tcd.ie/cityOntology/#Food_and_Drinks"
        }
    ],
    "file": "preparedfood_SpainishTax_service.owls",
    "id": "food/preparedfood_taxedpriceineuro_service",
    "inputs": [
        {
            "desc": "Input of service SpainishTax on PrepardFood",
            "name": "_PREPAREDFOOD",
            "type": "http://127.0.0.1/ontology/Mid-level-ontology.owl#PreparedFood"
        }
    ],
    "name": "SpainishTax on PrepardFood",
    "outputs": [
        {
            "desc": "Output of service SpainishTax on PrepardFood",
            "name": "_TAXEDPRICEINEURO",
            "type": "http://127.0.0.1/ontology/concept.owl#TaxedPriceInEuro"
        }
    ],
    "provider": {
        "type": "asp"
    },
    "state": true,
    "url": "http://surf.scss.tcd.ie/_provider_/food/preparedfood_taxedpriceineuro_service"
}