{
  "outputs": [
    {
      "name": "_PRICE",
      "type": "http://127.0.0.1/ontology/concept.owl#Price",
      "desc": "Output of service B-co FoodPriceService"
    }
  ],
  "capability": "atomic",
  "file": "food_price_AnimalFoodservice.owls",
  "provider": {
    "type": "asp"
  },
  "inputs": [
    {
      "name": "_FOOD",
      "type": "http://127.0.0.1/ontology/SUMO.owl#Food",
      "desc": "Input of service B-co FoodPriceService"
    }
  ],
  "name": "B-co FoodPriceService",
  "description": "B-co service returns price of given animal food item, or seeds that are used as animal food.",
  "domains": [
    {
      "name": "Food_and_Drinks",
      "url": "http://www.surf.scss.tcd.ie/cityOntology/#Food_and_Drinks"
    }
  ],
  "id": "food/food_price_AnimalFoodservice",
  "state": true,
  "url": "http://surf.scss.tcd.ie/_provider_/food/food_price_AnimalFoodservice"
}