{
  "outputs": [
    {
      "name": "_SKILLEDOCCUPATION",
      "type": "http://127.0.0.1/ontology/Mid-level-ontology.owl#SkilledOccupation",
      "desc": "Output of service Profit-Organization SkilledOccupation service"
    }
  ],
  "capability": "atomic",
  "file": "profit-organization_skilledoccupation_service.owls",
  "provider": {
    "type": "asp"
  },
  "inputs": [
    {
      "name": "_PROFIT-ORGANIZATION",
      "type": "http://127.0.0.1/ontology/portal.owl#Profit-Organization",
      "desc": "Input of service Profit-Organization SkilledOccupation service"
    }
  ],
  "name": "Profit-Organization SkilledOccupation service",
  "description": "You can search a skilled occupation position in a given profit-organization.",
  "domains": [
    {
      "name": "Educational",
      "url": "http://www.surf.scss.tcd.ie/cityOntology/#Educational"
    }
  ],
  "id": "education/profit-organization_skilledoccupation_service",
  "state": true,
  "url": "http://surf.scss.tcd.ie/_provider_/education/profit-organization_skilledoccupation_service"
}