{
  "outputs": [
    {
      "name": "_PRODUCTS",
      "type": "http://www.surf.scss.tcd.ie/IoTservices.owl#products",
      "desc": "Output of service check_fridge_products"
    }
  ],
  "provider": {
    "type": "wsdn"
  },
  "inputs": [
    {
      "name": "_FRIDGEDATA",
      "type": "http://www.surf.scss.tcd.ie/IoTservices.owl#fridgeData",
      "desc": "Input of service check_fridge_products"
    }
  ],
  "name": "check_fridge_products",
  "description": "This is the service check_fridge_products",
  "domains": [
    {
      "name": "Food_and_Drinks",
      "url": "http://www.surf.scss.tcd.ie/cityOntology/#Food_and_Drinks"
    }
  ],
  "id": "food/68_check_fridge_products",
  "state": true,
  "url": "http://surf.scss.tcd.ie/_provider_/food/68_check_fridge_products"
}