{
    "capability": "atomic",
    "description": "Hallo service is a primere service to get cola for a given price.",
    "domains": [
        {
            "name": "Food_and_Drinks",
            "url": "http://www.surf.scss.tcd.ie/cityOntology/#Food_and_Drinks"
        }
    ],
    "file": "price_cola_Halloservice.owls",
    "id": "food/price_cola_service",
    "inputs": [
        {
            "desc": "Input of service Hallo ColaService",
            "name": "_PRICE",
            "type": "http://127.0.0.1/ontology/concept.owl#Price"
        }
    ],
    "name": "Hallo ColaService",
    "outputs": [
        {
            "desc": "Output of service Hallo ColaService",
            "name": "_COLA",
            "type": "http://127.0.0.1/ontology/my_ontology.owl#Cola"
        }
    ],
    "provider": {
        "type": "wsdn"
    },
    "state": true,
    "url": "http://surf.scss.tcd.ie/_provider_/food/price_cola_service"
}