{
    "capability": "atomic",
    "description": "This service returns the types of experiments organized by a certain given medical clinic.",
    "domains": [
        {
            "name": "Health",
            "url": "http://www.surf.scss.tcd.ie/cityOntology/#Health"
        }
    ],
    "file": "medicalclinic_experimenting_service.owls",
    "id": "medical/medicalclinic_experimenting_service",
    "inputs": [
        {
            "desc": "Input of service MedicalClinic Experiment service",
            "name": "_MEDICALCLINIC",
            "type": "http://127.0.0.1/ontology/Mid-level-ontology.owl#MedicalClinic"
        }
    ],
    "name": "MedicalClinic Experiment service",
    "outputs": [
        {
            "desc": "Output of service MedicalClinic Experiment service",
            "name": "_EXPERIMENTING",
            "type": "http://127.0.0.1/ontology/SUMO.owl#Experimenting"
        }
    ],
    "provider": {
        "type": "webservice"
    },
    "state": true,
    "url": "http://surf.scss.tcd.ie/_provider_/medical/medicalclinic_experimenting_service"
}