{
  "outputs": [
    {
      "name": "_PRICE",
      "type": "http://127.0.0.1/ontology/concept.owl#RecommendedPrice",
      "desc": "Output of service CheapCar RecommendedPrice Color service"
    },
    {
      "name": "_COLOR",
      "type": "http://127.0.0.1/ontology/my_ontology.owl#Color",
      "desc": "Output of service CheapCar RecommendedPrice Color service"
    }
  ],
  "capability": "atomic",
  "file": "cheapcar_recommendedpricecolor_service.owls",
  "provider": {
    "type": "wsdn"
  },
  "inputs": [
    {
      "name": "_CHEAPCAR",
      "type": "http://127.0.0.1/ontology/my_ontology.owl#CheapCar",
      "desc": "Input of service CheapCar RecommendedPrice Color service"
    }
  ],
  "name": "CheapCar RecommendedPrice Color service",
  "description": "This service provides a list of recommended purchase prices of cheapcar with its color.",
  "id": "economy/cheapcar_pricecolor_service",
  "state": true,
  "url": "http://surf.scss.tcd.ie/_provider_/economy/cheapcar_pricecolor_service"
}