{
  "outputs": [
    {
      "name": "_RECOMMENDEDPRICE",
      "type": "http://127.0.0.1/ontology/concept.owl#RecommendedPrice",
      "desc": "Output of service FastCar RecommendedPrice Color service"
    },
    {
      "name": "_COLOR",
      "type": "http://127.0.0.1/ontology/my_ontology.owl#Color",
      "desc": "Output of service FastCar RecommendedPrice Color service"
    }
  ],
  "capability": "atomic",
  "file": "fastcar_recommendedpricecolor_service.owls",
  "provider": {
    "type": "webservice"
  },
  "inputs": [
    {
      "name": "_FASTCAR",
      "type": "http://127.0.0.1/ontology/my_ontology.owl#FastCar",
      "desc": "Input of service FastCar RecommendedPrice Color service"
    }
  ],
  "name": "FastCar RecommendedPrice Color service",
  "description": "This service provides a list of recommended purchase prices of given fast car model with its available colors.",
  "domains": [
    {
      "name": "Vehicle_Sale_and_Rent",
      "url": "http://www.surf.scss.tcd.ie/cityOntology/#Vehicle_Sale_and_Rent"
    }
  ],
  "id": "vehicle/fastcar_recommendedpricecolor_service",
  "state": true,
  "url": "http://surf.scss.tcd.ie/_provider_/vehicle/fastcar_recommendedpricecolor_service"
}