{
  "outputs": [
    {
      "name": "_PRICE",
      "type": "http://127.0.0.1/ontology/concept.owl#Price",
      "desc": "Output of service AutoPrice"
    }
  ],
  "capability": "atomic",
  "file": "auto_price_service.owls",
  "provider": {
    "type": "asp"
  },
  "inputs": [
    {
      "name": "_AUTO",
      "type": "http://127.0.0.1/ontology/my_ontology.owl#Auto",
      "desc": "Input of service AutoPrice"
    }
  ],
  "name": "AutoPrice",
  "description": "A wonderful list of purchase prices for given auto(car) brand/model is provided with this service. The list includes prices of used and brand new models.",
  "domains": [
    {
      "name": "Vehicle_Sale_and_Rent",
      "url": "http://www.surf.scss.tcd.ie/cityOntology/#Vehicle_Sale_and_Rent"
    }
  ],
  "id": "vehicle/auto_price_service",
  "state": true,
  "url": "http://surf.scss.tcd.ie/_provider_/vehicle/auto_price_service"
}