{
    "capability": "atomic",
    "description": "This service returns the funding, specially for the PhD academic degree, provided by the given government,",
    "domains": [
        {
            "name": "Educational",
            "url": "http://www.surf.scss.tcd.ie/cityOntology/#Educational"
        }
    ],
    "file": "government_funding_ForPhDservice.owls",
    "id": "education/government_funding_service",
    "inputs": [
        {
            "desc": "Input of service GovernmentFundingService",
            "name": "_GOVERNMENT",
            "type": "http://127.0.0.1/ontology/SUMO.owl#Government"
        }
    ],
    "name": "GovernmentFundingService",
    "outputs": [
        {
            "desc": "Output of service GovernmentFundingService",
            "name": "_FUNDING",
            "type": "http://127.0.0.1/ontology/SUMO.owl#Funding"
        }
    ],
    "provider": {
        "type": "webservice"
    },
    "state": true,
    "url": "http://surf.scss.tcd.ie/_provider_/education/government_funding_service"
}