{
  "outputs": [
    {
      "name": "_PRICE",
      "type": "http://127.0.0.1/ontology/concept.owl#Price",
      "desc": "Output of service FastCar Price Color service"
    },
    {
      "name": "_COLOR",
      "type": "http://127.0.0.1/ontology/my_ontology.owl#Color",
      "desc": "Output of service FastCar Price Color service"
    }
  ],
  "capability": "atomic",
  "file": "fastcar_pricecolor_service.owls",
  "provider": {
    "type": "webservice"
  },
  "inputs": [
    {
      "name": "_FASTCAR",
      "type": "http://127.0.0.1/ontology/my_ontology.owl#FastCar",
      "desc": "Input of service FastCar Price Color service"
    }
  ],
  "name": "FastCar Price Color service",
  "description": "This service provides a list of purchase prices of given fast car models with its available colors.",
  "domains": [
    {
      "name": "Vehicle_Sale_and_Rent",
      "url": "http://www.surf.scss.tcd.ie/cityOntology/#Vehicle_Sale_and_Rent"
    }
  ],
  "id": "vehicle/fastcar_pricecolor_service",
  "state": true,
  "url": "http://surf.scss.tcd.ie/_provider_/vehicle/fastcar_pricecolor_service"
}