{
  "outputs": [
    {
      "name": "_postal-address",
      "type": "string",
      "desc": "Output of service Researcher postal address service"
    }
  ],
  "provider": {
    "type": "asp"
  },
  "inputs": [
    {
      "name": "_researcher",
      "type": "string",
      "desc": "Input of service Researcher postal address service"
    }
  ],
  "name": "Researcher postal address service",
  "description": "This service returns postal address of a researcher.",
  "domains": [
    {
      "name": "Medicines",
      "url": "http://www.surf.scss.tcd.ie/cityOntology/#Medicines"
    }
  ],
  "id": "educational/researcher_postal-address_service",
  "state": true,
  "url": "http://surf.scss.tcd.ie/_provider_/educational/researcher_postal-address_service"
}