{
  "outputs": [
    {
      "name": "_PRICE",
      "type": "http://127.0.0.1/ontology/concept.owl#Price",
      "desc": "Output of service AuthorisedPersonBookPrice"
    }
  ],
  "capability": "atomic",
  "file": "bookpersoncreditcardaccount_price_service.owls",
  "provider": {
    "type": "webservice"
  },
  "inputs": [
    {
      "name": "_PERSON",
      "type": "http://127.0.0.1/ontology/books.owl#Person",
      "desc": "Input of service AuthorisedPersonBookPrice"
    },
    {
      "name": "_BOOK",
      "type": "http://127.0.0.1/ontology/books.owl#Book",
      "desc": "Input of service AuthorisedPersonBookPrice"
    },
    {
      "name": "_CREDITCARDACCOUNT",
      "type": "http://127.0.0.1/ontology/Mid-level-ontology.owl#CreditCardAccount",
      "desc": "Input of service AuthorisedPersonBookPrice"
    }
  ],
  "name": "AuthorisedPersonBookPrice",
  "description": "This service varify account of an authorised person andreturns current purchase price of the given book with title. The price of books is different for every user and it\u0027s based on his history of purchasing books.",
  "domains": [
    {
      "name": "Entertainment_Products",
      "url": "http://www.surf.scss.tcd.ie/cityOntology/#Entertainment_Products"
    }
  ],
  "id": "books/creditcardaccountbookperson_price_service",
  "state": true,
  "url": "http://surf.scss.tcd.ie/_provider_/books/creditcardaccountbookperson_price_service"
}