{
  "outputs": [
    {
      "name": "_RECOMMENDEDPRICEINDOLLAR",
      "type": "http://127.0.0.1/ontology/concept.owl#RecommendedPriceInDollar",
      "desc": "Output of service BookRecommendedPriceService"
    }
  ],
  "capability": "atomic",
  "file": "book_recommendedpriceindollar_service.owls",
  "provider": {
    "type": "wsdn"
  },
  "inputs": [
    {
      "name": "_BOOK",
      "type": "http://127.0.0.1/ontology/books.owl#Book",
      "desc": "Input of service BookRecommendedPriceService"
    }
  ],
  "name": "BookRecommendedPriceService",
  "description": "This is a popular service to return recommended purchase price in dollars of a given book title.",
  "domains": [
    {
      "name": "Entertainment_Products",
      "url": "http://www.surf.scss.tcd.ie/cityOntology/#Entertainment_Products"
    }
  ],
  "id": "books/book_recommendedpriceindollar_service",
  "state": true,
  "url": "http://surf.scss.tcd.ie/_provider_/books/book_recommendedpriceindollar_service"
}