{
  "outputs": [
    {
      "name": "_WEATHERSYSTEM",
      "type": "http://127.0.0.1/ontology/Mid-level-ontology.owl#WeatherSystem",
      "desc": "Output of service GRWF Service"
    }
  ],
  "capability": "atomic",
  "file": "geographical-region_weathersystem_service.owls",
  "provider": {
    "type": "webservice"
  },
  "inputs": [
    {
      "name": "_GEOGRAPHICAL-REGION",
      "type": "http://127.0.0.1/ontology/portal.owl#Geographical-Region",
      "desc": "Input of service GRWF Service"
    }
  ],
  "name": "GRWF Service",
  "description": "GRWF service is used to get weather system of a particular geographical region.",
  "domains": [
    {
      "name": "Travel",
      "url": "http://www.surf.scss.tcd.ie/cityOntology/#Travel"
    }
  ],
  "id": "travel/geographical-region_weathersystem_service",
  "state": true,
  "url": "http://surf.scss.tcd.ie/_provider_/travel/geographical-region_weathersystem_service"
}