{
    "capability": "atomic",
    "description": "This service returns full time positions offering for professions in a given country.",
    "domains": [
        {
            "name": "Industry",
            "url": "http://www.surf.scss.tcd.ie/cityOntology/#Industry"
        }
    ],
    "file": "country_professionfulltimeposition_service.owls",
    "id": "education/country_professionfulltimeposition_service",
    "inputs": [
        {
            "desc": "Input of service Country Profession FullTimePosition Service",
            "name": "_COUNTRY",
            "type": "http://127.0.0.1/ontology/portal.owl#Country"
        }
    ],
    "name": "Country Profession FullTimePosition Service",
    "outputs": [
        {
            "desc": "Output of service Country Profession FullTimePosition Service",
            "name": "_PROFESSION",
            "type": "http://127.0.0.1/ontology/Mid-level-ontology.owl#Profession"
        },
        {
            "desc": "Output of service Country Profession FullTimePosition Service",
            "name": "_FULLTIMEPOSITION",
            "type": "http://127.0.0.1/ontology/Mid-level-ontology.owl#FullTimePosition"
        }
    ],
    "provider": {
        "type": "wsdn"
    },
    "state": true,
    "url": "http://surf.scss.tcd.ie/_provider_/education/country_professionfulltimeposition_service"
}