{
  "outputs": [
    {
      "name": "_CAMERA",
      "type": "http://127.0.0.1/ontology/extendedCamera.owl#Camera",
      "desc": "Output of service ShoppingMallCameraPriceService"
    },
    {
      "name": "_PRICE",
      "type": "http://127.0.0.1/ontology/concept.owl#Price",
      "desc": "Output of service ShoppingMallCameraPriceService"
    }
  ],
  "capability": "atomic",
  "file": "shoppingmall_cameraprice_service.owls",
  "provider": {
    "type": "webservice"
  },
  "inputs": [
    {
      "name": "_SHOPPINGMALL",
      "type": "http://127.0.0.1/ontology/Mid-level-ontology.owl#ShoppingMall",
      "desc": "Input of service ShoppingMallCameraPriceService"
    }
  ],
  "name": "ShoppingMallCameraPriceService",
  "description": "This service returns list of analog and digital camera brands/types and their prices available in a given shopping-mall.",
  "domains": [
    {
      "name": "Technology",
      "url": "http://www.surf.scss.tcd.ie/cityOntology/#Technology"
    }
  ],
  "id": "technology/shoppingmall_cameraprice_service",
  "state": true,
  "url": "http://surf.scss.tcd.ie/_provider_/technology/shoppingmall_cameraprice_service"
}