{
  "outputs": [
    {
      "name": "_PRICE",
      "type": "http://127.0.0.1/ontology/concept.owl#Price",
      "desc": "Output of service Cheapest Book Service"
    }
  ],
  "capability": "atomic",
  "file": "book_Cheapestprice_service.owls",
  "provider": {
    "type": "webservice"
  },
  "inputs": [
    {
      "name": "_BOOK",
      "type": "http://127.0.0.1/ontology/books.owl#Book",
      "desc": "Input of service Cheapest Book Service"
    }
  ],
  "name": "Cheapest Book Service",
  "description": "A service that searches the cheapest Price for a given book title.",
  "domains": [
    {
      "name": "Entertainment_Products",
      "url": "http://www.surf.scss.tcd.ie/cityOntology/#Entertainment_Products"
    },
    {
      "name": "Educational",
      "url": "http://www.surf.scss.tcd.ie/cityOntology/#Educational"
    }
  ],
  "id": "books/book_Cheapestprice_service",
  "state": true,
  "url": "http://surf.scss.tcd.ie/_provider_/books/book_Cheapestprice_service"
}