{
    "description": "This is the service presentation_patient_status",
    "domains": [
        {
            "name": "Health",
            "url": "http://www.surf.scss.tcd.ie/cityOntology/#Health"
        }
    ],
    "id": "health/91_presentation_patient_status",
    "inputs": [
        {
            "desc": "Input of service presentation_patient_status",
            "name": "_PATIENTREADINGS",
            "type": "http://www.surf.scss.tcd.ie/IoTservices.owl#patientReadings"
        },
        {
            "desc": "Input of service presentation_patient_status",
            "name": "_PATIENTVIDEO",
            "type": "http://www.surf.scss.tcd.ie/IoTservices.owl#patientVideo"
        }
    ],
    "name": "presentation_patient_status",
    "outputs": [
        {
            "desc": "Output of service presentation_patient_status",
            "name": "_PATIENTPRESENTATION",
            "type": "http://www.surf.scss.tcd.ie/IoTservices.owl#patientPresentation"
        }
    ],
    "provider": {
        "type": "asp"
    },
    "state": true,
    "url": "http://surf.scss.tcd.ie/_provider_/health/91_presentation_patient_status"
}