{
  "outputs": [
    {
      "name": "_PRICE",
      "type": "http://127.0.0.1/ontology/concept.owl#Price",
      "desc": "Output of service Cheap car price service"
    }
  ],
  "capability": "atomic",
  "file": "cheapcar_price_service.owls",
  "provider": {
    "type": "asp"
  },
  "inputs": [
    {
      "name": "_CHEAPCAR",
      "type": "http://127.0.0.1/ontology/my_ontology.owl#CheapCar",
      "desc": "Input of service Cheap car price service"
    }
  ],
  "name": "Cheap car price service",
  "description": "This service gives good opinion to buy a cheap car by providing the best price.",
  "id": "economy/cheapcar_price_service",
  "state": true,
  "url": "http://surf.scss.tcd.ie/_provider_/economy/cheapcar_price_service"
}