{
    "description": "This is the service route_configurator",
    "domains": [
        {
            "name": "Transport_and_Mobility",
            "url": "http://www.surf.scss.tcd.ie/cityOntology/#Transport_and_Mobility"
        }
    ],
    "id": "transportandmobility/1_route_configurator",
    "inputs": [
        {
            "desc": "Input of service route_configurator",
            "name": "_FROM",
            "type": "http://www.surf.scss.tcd.ie/IoTservices.owl#from"
        },
        {
            "desc": "Input of service route_configurator",
            "name": "_TO",
            "type": "http://www.surf.scss.tcd.ie/IoTservices.owl#to"
        }
    ],
    "name": "route_configurator",
    "outputs": [
        {
            "desc": "Output of service route_configurator",
            "name": "_ROUTEPARAMETERS",
            "type": "http://www.surf.scss.tcd.ie/IoTservices.owl#routeParameters"
        }
    ],
    "provider": {
        "type": "ws"
    },
    "state": true,
    "url": "http://surf.scss.tcd.ie/_provider_/transportandmobility/1_route_configurator"
}