{
  "outputs": [
    {
      "name": "_TAXEDPRICE",
      "type": "http://127.0.0.1/ontology/concept.owl#TaxedPrice",
      "desc": "Output of service PreparedFood TaxedPrice Service"
    }
  ],
  "capability": "atomic",
  "file": "preparedfood_taxedprice_service.owls",
  "provider": {
    "type": "webservice"
  },
  "inputs": [
    {
      "name": "_PREPAREDFOOD",
      "type": "http://127.0.0.1/ontology/Mid-level-ontology.owl#PreparedFood",
      "desc": "Input of service PreparedFood TaxedPrice Service"
    }
  ],
  "name": "PreparedFood TaxedPrice Service",
  "description": "This service returns taxed price of certain prepared food.",
  "domains": [
    {
      "name": "Food_and_Drinks",
      "url": "http://www.surf.scss.tcd.ie/cityOntology/#Food_and_Drinks"
    }
  ],
  "id": "food/preparedfood_taxedprice_service",
  "state": true,
  "url": "http://surf.scss.tcd.ie/_provider_/food/preparedfood_taxedprice_service"
}