{
    "capability": "atomic",
    "description": "TaxPCW Service offers a whiskey and a coffe for a tax free price.",
    "domains": [
        {
            "name": "Food_and_Drinks",
            "url": "http://www.surf.scss.tcd.ie/cityOntology/#Food_and_Drinks"
        }
    ],
    "file": "taxfreeprice_whiskeycoffee_service.owls",
    "id": "food/taxfreeprice_whiskeycoffee_service",
    "inputs": [
        {
            "desc": "Input of service TaxPCW Service",
            "name": "_TAXFREEPRICE",
            "type": "http://127.0.0.1/ontology/concept.owl#TaxFreePrice"
        }
    ],
    "name": "TaxPCW Service",
    "outputs": [
        {
            "desc": "Output of service TaxPCW Service",
            "name": "_WHISKEY",
            "type": "http://127.0.0.1/ontology/my_ontology.owl#Whiskey"
        },
        {
            "desc": "Output of service TaxPCW Service",
            "name": "_COFFEE",
            "type": "http://127.0.0.1/ontology/my_ontology.owl#Coffee"
        }
    ],
    "provider": {
        "type": "webservice"
    },
    "state": true,
    "url": "http://surf.scss.tcd.ie/_provider_/food/taxfreeprice_whiskeycoffee_service"
}