{
  "outputs": [
    {
      "name": "_WATERPOLLUTIONINFO",
      "type": "http://www.surf.scss.tcd.ie/IoTservices.owl#waterPollutionInfo",
      "desc": "Output of service water_pollution"
    }
  ],
  "provider": {
    "type": "wsdn"
  },
  "inputs": [
    {
      "name": "_ZONE",
      "type": "http://www.surf.scss.tcd.ie/IoTservices.owl#zone",
      "desc": "Input of service water_pollution"
    }
  ],
  "name": "water_pollution",
  "description": "This is the service water_pollution",
  "domains": [
    {
      "name": "Nature",
      "url": "http://www.surf.scss.tcd.ie/cityOntology/#Nature"
    }
  ],
  "id": "nature/108_water_pollution",
  "state": true,
  "url": "http://surf.scss.tcd.ie/_provider_/nature/108_water_pollution"
}