{
  "outputs": [
    {
      "name": "_PRICE",
      "type": "http://127.0.0.1/ontology/concept.owl#Price",
      "desc": "Output of service Datefruit Price Service"
    }
  ],
  "capability": "atomic",
  "file": "datefruit_price_service.owls",
  "provider": {
    "type": "webservice"
  },
  "inputs": [
    {
      "name": "_DATEFRUIT",
      "type": "http://127.0.0.1/ontology/Mid-level-ontology.owl#DateFruit",
      "desc": "Input of service Datefruit Price Service"
    }
  ],
  "name": "Datefruit Price Service",
  "description": "This service informs the purhcase price of certain datefruit. The price is for 1Kg of datefruit.",
  "domains": [
    {
      "name": "Food_and_Drinks",
      "url": "http://www.surf.scss.tcd.ie/cityOntology/#Food_and_Drinks"
    }
  ],
  "id": "food/datefruit_price_service",
  "state": true,
  "url": "http://surf.scss.tcd.ie/_provider_/food/datefruit_price_service"
}