{
  "outputs": [
    {
      "name": "_COFFEEWITHWHISKEY",
      "type": "http://127.0.0.1/ontology/my_ontology.owl#CoffeeWithWhiskey",
      "desc": "Output of service CoffeewithWhiskeyPrice Service"
    }
  ],
  "capability": "atomic",
  "file": "price_coffeewithwhiskey_service.owls",
  "provider": {
    "type": "webservice"
  },
  "inputs": [
    {
      "name": "_PRICE",
      "type": "http://127.0.0.1/ontology/concept.owl#Price",
      "desc": "Input of service CoffeewithWhiskeyPrice Service"
    }
  ],
  "name": "CoffeewithWhiskeyPrice Service",
  "description": "This service returns a coffee with whiskey for the given price.",
  "domains": [
    {
      "name": "Food_and_Drinks",
      "url": "http://www.surf.scss.tcd.ie/cityOntology/#Food_and_Drinks"
    }
  ],
  "id": "food/price_coffeewithwhiskey_service",
  "state": true,
  "url": "http://surf.scss.tcd.ie/_provider_/food/price_coffeewithwhiskey_service"
}