{
  "outputs": [
    {
      "name": "_FUNDING",
      "type": "http://127.0.0.1/ontology/SUMO.owl#Funding",
      "desc": "Output of service GovernmentFundingService"
    }
  ],
  "capability": "atomic",
  "file": "government_funding_Missileservice.owls",
  "provider": {
    "type": "asp"
  },
  "inputs": [
    {
      "name": "_GOVERNMENT",
      "type": "http://127.0.0.1/ontology/SUMO.owl#Government",
      "desc": "Input of service GovernmentFundingService"
    }
  ],
  "name": "GovernmentFundingService",
  "description": "This service returns the funding, specially for the missiles, provided by the given government,",
  "domains": [
    {
      "name": "Defense",
      "url": "http://www.surf.scss.tcd.ie/cityOntology/#Defense"
    }
  ],
  "id": "defense/government_funding_Missileservice",
  "state": true,
  "url": "http://surf.scss.tcd.ie/_provider_/defense/government_funding_Missileservice"
}