{
  "outputs": [
    {
      "name": "_FINANCING",
      "type": "http://127.0.0.1/ontology/Mid-level-ontology.owl#Financing",
      "desc": "Output of service ChinaMissilesFinancingService"
    }
  ],
  "capability": "atomic",
  "file": "missile_financing_Chinaservice.owls",
  "provider": {
    "type": "webservice"
  },
  "inputs": [
    {
      "name": "_MISSILE",
      "type": "http://127.0.0.1/ontology/Mid-level-ontology.owl#Missile",
      "desc": "Input of service ChinaMissilesFinancingService"
    }
  ],
  "name": "ChinaMissilesFinancingService",
  "description": "This service informs about the amount of financing for a given Missiles types used by the Chinese government.",
  "domains": [
    {
      "name": "Government_and_Planning",
      "url": "http://www.surf.scss.tcd.ie/cityOntology/#Government_and_Planning"
    }
  ],
  "id": "weapon/missile_financing_service",
  "state": true,
  "url": "http://surf.scss.tcd.ie/_provider_/weapon/missile_financing_service"
}