{
  "outputs": [
    {
      "name": "_SKILLEDOCCUPATION",
      "type": "http://127.0.0.1/ontology/Mid-level-ontology.owl#SkilledOccupation",
      "desc": "Output of service Geopolitical-Entity SkilledOccupation TimeMeasure service"
    },
    {
      "name": "_TIMEMEASURE",
      "type": "http://127.0.0.1/ontology/SUMO.owl#TimeMeasure",
      "desc": "Output of service Geopolitical-Entity SkilledOccupation TimeMeasure service"
    }
  ],
  "capability": "atomic",
  "file": "geopolitical-entity_skilledoccupationtimemeasure_service.owls",
  "provider": {
    "type": "webservice"
  },
  "inputs": [
    {
      "name": "_GEOPOLITICAL-ENTITY",
      "type": "http://127.0.0.1/ontology/portal.owl#Geopolitical-Entity",
      "desc": "Input of service Geopolitical-Entity SkilledOccupation TimeMeasure service"
    }
  ],
  "name": "Geopolitical-Entity SkilledOccupation TimeMeasure service",
  "description": "This service returns skilledoccupation job in a given geopolitical-entity and its timemeasure (duration).",
  "domains": [
    {
      "name": "Industry",
      "url": "http://www.surf.scss.tcd.ie/cityOntology/#Industry"
    }
  ],
  "id": "industry/geopolitical-entity_skilledoccupationtimemeasure_service",
  "state": true,
  "url": "http://surf.scss.tcd.ie/_provider_/industry/geopolitical-entity_skilledoccupationtimemeasure_service"
}