{
    "capability": "atomic",
    "description": "This service returns some special kind of tea, useful for stomach problems, obtainable from a given drugstore.",
    "domains": [
        {
            "name": "Food_and_Drinks",
            "url": "http://www.surf.scss.tcd.ie/cityOntology/#Food_and_Drinks"
        }
    ],
    "file": "drugstore_tea_service.owls",
    "id": "food/drugstore_tea_service",
    "inputs": [
        {
            "desc": "Input of service DrugStoreTeaService",
            "name": "_DRUGSTORE",
            "type": "http://127.0.0.1/ontology/Mid-level-ontology.owl#DrugStore"
        }
    ],
    "name": "DrugStoreTeaService",
    "outputs": [
        {
            "desc": "Output of service DrugStoreTeaService",
            "name": "_TEA",
            "type": "http://127.0.0.1/ontology/Mid-level-ontology.owl#Tea"
        }
    ],
    "provider": {
        "type": "webservice"
    },
    "state": true,
    "url": "http://surf.scss.tcd.ie/_provider_/food/drugstore_tea_service"
}