{
  "outputs": [
    {
      "name": "_COFFEE",
      "type": "http://127.0.0.1/ontology/my_ontology.owl#Coffee",
      "desc": "Output of service CWT service"
    },
    {
      "name": "_WHISKEY",
      "type": "http://127.0.0.1/ontology/my_ontology.owl#Whiskey",
      "desc": "Output of service CWT service"
    },
    {
      "name": "_TIMEMEASURE",
      "type": "http://127.0.0.1/ontology/SUMO.owl#TimeMeasure",
      "desc": "Output of service CWT service"
    }
  ],
  "capability": "atomic",
  "file": "price_coffeewhiskeytimemeasure_service.owls",
  "provider": {
    "type": "asp"
  },
  "inputs": [
    {
      "name": "_PRICE",
      "type": "http://127.0.0.1/ontology/concept.owl#Price",
      "desc": "Input of service CWT service"
    }
  ],
  "name": "CWT service",
  "description": "This service returns whiskey and coffee for a given priceand also informs you that how old the whiskey.",
  "domains": [
    {
      "name": "Food_and_Drinks",
      "url": "http://www.surf.scss.tcd.ie/cityOntology/#Food_and_Drinks"
    }
  ],
  "id": "food/price_coffeewhiskeytimemeasure_service",
  "state": true,
  "url": "http://surf.scss.tcd.ie/_provider_/food/price_coffeewhiskeytimemeasure_service"
}