{
    "capability": "atomic",
    "description": "This service returns part time positions offering for skilledoccupations in a given geopolitical-entity.",
    "domains": [
        {
            "name": "Industry",
            "url": "http://www.surf.scss.tcd.ie/cityOntology/#Industry"
        }
    ],
    "file": "geopolitical-entity_skilledoccupationparttimeposition_service.owls",
    "id": "education/geopolitical-entity_skilledoccupationparttimeposition_service",
    "inputs": [
        {
            "desc": "Input of service Geopolitical-Entity SkilledOccupation PartTimePosition Service",
            "name": "_GEOPOLITICAL-ENTITY",
            "type": "http://127.0.0.1/ontology/portal.owl#Geopolitical-Entity"
        }
    ],
    "name": "Geopolitical-Entity SkilledOccupation PartTimePosition Service",
    "outputs": [
        {
            "desc": "Output of service Geopolitical-Entity SkilledOccupation PartTimePosition Service",
            "name": "_SKILLEDOCCUPATION",
            "type": "http://127.0.0.1/ontology/Mid-level-ontology.owl#SkilledOccupation"
        },
        {
            "desc": "Output of service Geopolitical-Entity SkilledOccupation PartTimePosition Service",
            "name": "_PARTTIMEPOSITION",
            "type": "http://127.0.0.1/ontology/Mid-level-ontology.owl#PartTimePosition"
        }
    ],
    "provider": {
        "type": "webservice"
    },
    "state": true,
    "url": "http://surf.scss.tcd.ie/_provider_/education/geopolitical-entity_skilledoccupationparttimeposition_service"
}