{
  "outputs": [
    {
      "name": "_COLA",
      "type": "http://127.0.0.1/ontology/my_ontology.owl#Cola",
      "desc": "Output of service AvailableColaService"
    }
  ],
  "capability": "atomic",
  "file": "maxprice_cola_service.owls",
  "provider": {
    "type": "wsdn"
  },
  "inputs": [
    {
      "name": "_MAXPRICE",
      "type": "http://127.0.0.1/ontology/concept.owl#MaxPrice",
      "desc": "Input of service AvailableColaService"
    }
  ],
  "name": "AvailableColaService",
  "description": "This service returns available cola brand for the given maximum price.",
  "domains": [
    {
      "name": "Food_and_Drinks",
      "url": "http://www.surf.scss.tcd.ie/cityOntology/#Food_and_Drinks"
    }
  ],
  "id": "food/maxprice_cola_service",
  "state": true,
  "url": "http://surf.scss.tcd.ie/_provider_/food/maxprice_cola_service"
}