{
  "outputs": [
    {
      "name": "_OCCUPATIONALTRADE",
      "type": "http://127.0.0.1/ontology/Mid-level-ontology.owl#OccupationalTrade",
      "desc": "Output of service Municipal-Unit OccupationalTrade FullTimePosition Service"
    },
    {
      "name": "_FULLTIMEPOSITION",
      "type": "http://127.0.0.1/ontology/Mid-level-ontology.owl#FullTimePosition",
      "desc": "Output of service Municipal-Unit OccupationalTrade FullTimePosition Service"
    }
  ],
  "capability": "atomic",
  "file": "municipal-unit_occupationaltradefulltimeposition_service.owls",
  "provider": {
    "type": "wsdn"
  },
  "inputs": [
    {
      "name": "_GEOPOLITICAL-ENTITY",
      "type": "http://127.0.0.1/ontology/portal.owl#Municipal-Unit",
      "desc": "Input of service Municipal-Unit OccupationalTrade FullTimePosition Service"
    }
  ],
  "name": "Municipal-Unit OccupationalTrade FullTimePosition Service",
  "description": "This service returns full time positions offering for occupationaltrades in a given municipal-unit.",
  "domains": [
    {
      "name": "Government_and_Planning",
      "url": "http://www.surf.scss.tcd.ie/cityOntology/#Government_and_Planning"
    }
  ],
  "id": "governmentandplanning/municipal-unit_occupationaltradefulltimeposition_service",
  "state": true,
  "url": "http://surf.scss.tcd.ie/_provider_/governmentandplanning/municipal-unit_occupationaltradefulltimeposition_service"
}