{
  "outputs": [
    {
      "name": "_WEATHERPROCESS",
      "type": "http://127.0.0.1/ontology/SUMO.owl#WeatherProcess",
      "desc": "Output of service GRWeatherProcessService"
    }
  ],
  "capability": "atomic",
  "file": "geographical-region_weatherprocess_service.owls",
  "provider": {
    "type": "asp"
  },
  "inputs": [
    {
      "name": "_GEOGRAPHICAL-REGION",
      "type": "http://127.0.0.1/ontology/portal.owl#Geographical-Region",
      "desc": "Input of service GRWeatherProcessService"
    }
  ],
  "name": "GRWeatherProcessService",
  "description": "This service returns the weather condition in a given geographical region.",
  "domains": [
    {
      "name": "Travel",
      "url": "http://www.surf.scss.tcd.ie/cityOntology/#Travel"
    },
    {
      "name": "Weather",
      "url": "http://www.surf.scss.tcd.ie/cityOntology/#Weather"
    }
  ],
  "id": "weather/geographical-region_weatherprocess_service",
  "state": true,
  "url": "http://surf.scss.tcd.ie/_provider_/weather/geographical-region_weatherprocess_service"
}