{
    "capability": "atomic",
    "description": "AUS is the most used service to know about a good destination for surfing activities.",
    "domains": [
        {
            "name": "Activity",
            "url": "http://www.surf.scss.tcd.ie/cityOntology/#Activity"
        }
    ],
    "file": "surfing_destination_AUSservice.owls",
    "id": "travel/surfing_destination_service",
    "inputs": [
        {
            "desc": "Input of service AUS SurfingDestinationService",
            "name": "_SURFING",
            "type": "http://127.0.0.1/ontology/travel.owl#Surfing"
        }
    ],
    "name": "AUS SurfingDestinationService",
    "outputs": [
        {
            "desc": "Output of service AUS SurfingDestinationService",
            "name": "_DESTINATION",
            "type": "http://127.0.0.1/ontology/travel.owl#Destination"
        }
    ],
    "provider": {
        "type": "asp"
    },
    "state": true,
    "url": "http://surf.scss.tcd.ie/_provider_/travel/surfing_destination_service"
}