{
    "capability": "atomic",
    "description": "This service returns the student experiments, and its time duration also, organized by the certain organization.",
    "domains": [
        {
            "name": "Health",
            "url": "http://www.surf.scss.tcd.ie/cityOntology/#Health"
        }
    ],
    "file": "organization_experimentingtimeduration_service.owls",
    "id": "medical/organization_experimentingtimeduration_service",
    "inputs": [
        {
            "desc": "Input of service OrganizationExp service",
            "name": "_ORGANIZATION",
            "type": "http://127.0.0.1/ontology/SUMO.owl#Organization"
        }
    ],
    "name": "OrganizationExp service",
    "outputs": [
        {
            "desc": "Output of service OrganizationExp service",
            "name": "_EXPERIMENTING",
            "type": "http://127.0.0.1/ontology/SUMO.owl#Experimenting"
        },
        {
            "desc": "Output of service OrganizationExp service",
            "name": "_TIMEDURATION",
            "type": "http://127.0.0.1/ontology/SUMO.owl#TimeDuration"
        }
    ],
    "provider": {
        "type": "webservice"
    },
    "state": true,
    "url": "http://surf.scss.tcd.ie/_provider_/medical/organization_experimentingtimeduration_service"
}