{
  "outputs": [
    {
      "name": "_BEDANDBREAKFAST",
      "type": "http://127.0.0.1/ontology/travel.owl#BedAndBreakfast",
      "desc": "Output of service Geographical-Region BedAndBreakfast Service"
    }
  ],
  "capability": "atomic",
  "file": "geographical-region_bedandbreakfast_service.owls",
  "provider": {
    "type": "webservice"
  },
  "inputs": [
    {
      "name": "_GEOGRAPHICAL-REGION",
      "type": "http://127.0.0.1/ontology/portal.owl#Geographical-Region",
      "desc": "Input of service Geographical-Region BedAndBreakfast Service"
    }
  ],
  "name": "Geographical-Region BedAndBreakfast Service",
  "description": "This service informs about the available bedandbreakfast in a geographical region.",
  "domains": [
    {
      "name": "Travel",
      "url": "http://www.surf.scss.tcd.ie/cityOntology/#Travel"
    }
  ],
  "id": "travel/geographical-region_bedandbreakfast_service",
  "state": true,
  "url": "http://surf.scss.tcd.ie/_provider_/travel/geographical-region_bedandbreakfast_service"
}