{
  "outputs": [
    {
      "name": "_MAXPRICE",
      "type": "http://127.0.0.1/ontology/concept.owl#MaxPrice",
      "desc": "Output of service Food MaxPrice Physical-Quantity Service"
    },
    {
      "name": "_PHYSICAL-QUANTITY",
      "type": "http://127.0.0.1/ontology/support.owl#Physical-Quantity",
      "desc": "Output of service Food MaxPrice Physical-Quantity Service"
    }
  ],
  "capability": "atomic",
  "file": "food_maxpricephysical-quantity_Aldiservice.owls",
  "provider": {
    "type": "webservice"
  },
  "inputs": [
    {
      "name": "_FOOD",
      "type": "http://127.0.0.1/ontology/SUMO.owl#Food",
      "desc": "Input of service Food MaxPrice Physical-Quantity Service"
    }
  ],
  "name": "Food MaxPrice Physical-Quantity Service",
  "description": "This service provides information about the physical-quantity of afood and its approximately maximum price of a given food item.",
  "domains": [
    {
      "name": "Food_and_Drinks",
      "url": "http://www.surf.scss.tcd.ie/cityOntology/#Food_and_Drinks"
    }
  ],
  "id": "food/food_maxpricephysical-quantity_Aldiservice",
  "state": true,
  "url": "http://surf.scss.tcd.ie/_provider_/food/food_maxpricephysical-quantity_Aldiservice"
}