{
  "outputs": [
    {
      "name": "_DESTINATION",
      "type": "http://127.0.0.1/ontology/travel.owl#Destination",
      "desc": "Output of service SurfingGenericAgentDestinationService"
    }
  ],
  "capability": "atomic",
  "file": "generic-agentsports_destination_service.owls",
  "provider": {
    "type": "asp"
  },
  "inputs": [
    {
      "name": "_SPORTS",
      "type": "http://127.0.0.1/ontology/travel.owl#Sports",
      "desc": "Input of service SurfingGenericAgentDestinationService"
    },
    {
      "name": "_GENERIC-AGENT",
      "type": "http://127.0.0.1/ontology/portal.owl#Generic-Agent",
      "desc": "Input of service SurfingGenericAgentDestinationService"
    }
  ],
  "name": "SurfingGenericAgentDestinationService",
  "description": "This service returns destination of a reputable generic agent who is responsiblefor given sports types, especially surfing.",
  "domains": [
    {
      "name": "Travel",
      "url": "http://www.surf.scss.tcd.ie/cityOntology/#Travel"
    }
  ],
  "id": "travel/generic-agentsports_destination_service",
  "state": true,
  "url": "http://surf.scss.tcd.ie/_provider_/travel/generic-agentsports_destination_service"
}