{
  "outputs": [
    {
      "name": "_address",
      "type": "string",
      "desc": "Output of service Academic Address Service"
    }
  ],
  "provider": {
    "type": "wsdn"
  },
  "inputs": [
    {
      "name": "_academic",
      "type": "string",
      "desc": "Input of service Academic Address Service"
    }
  ],
  "name": "Academic Address Service",
  "description": "This service returns an address of an academic of a university.",
  "domains": [
    {
      "name": "Social_Security",
      "url": "http://www.surf.scss.tcd.ie/cityOntology/#Social_Security"
    }
  ],
  "id": "educational/academic_address_service",
  "state": true,
  "url": "http://surf.scss.tcd.ie/_provider_/educational/academic_address_service"
}