{
  "outputs": [
    {
      "name": "_backpackersdestination",
      "type": "string",
      "desc": "Output of service Hiking BackpackersDestination Service"
    }
  ],
  "provider": {
    "type": "wsdn"
  },
  "inputs": [
    {
      "name": "_hiking",
      "type": "string",
      "desc": "Input of service Hiking BackpackersDestination Service"
    }
  ],
  "name": "Hiking BackpackersDestination Service",
  "description": "This service returns backpackersdestination for hiking.",
  "domains": [
    {
      "name": "Transport_and_Mobility",
      "url": "http://www.surf.scss.tcd.ie/cityOntology/#Transport_and_Mobility"
    }
  ],
  "id": "tourism/hiking_backpackersdestination_service",
  "state": true,
  "url": "http://surf.scss.tcd.ie/_provider_/tourism/hiking_backpackersdestination_service"
}