{
  "outputs": [
    {
      "name": "_PRICE",
      "type": "http://127.0.0.1/ontology/concept.owl#Price",
      "desc": "Output of service BicycleAuto_Price_service"
    }
  ],
  "capability": "atomic",
  "file": "bicycleauto_price_service.owls",
  "provider": {
    "type": "asp"
  },
  "inputs": [
    {
      "name": "_AUTO",
      "type": "http://127.0.0.1/ontology/my_ontology.owl#Auto",
      "desc": "Input of service BicycleAuto_Price_service"
    },
    {
      "name": "_BICYCLE",
      "type": "http://127.0.0.1/ontology/my_ontology.owl#Bicycle",
      "desc": "Input of service BicycleAuto_Price_service"
    }
  ],
  "name": "BicycleAuto_Price_service",
  "description": "This service returns latest purchase market price of the requested pair of an auto modeland a bicycle model.",
  "domains": [
    {
      "name": "Vehicle_Sale_and_Rent",
      "url": "http://www.surf.scss.tcd.ie/cityOntology/#Vehicle_Sale_and_Rent"
    }
  ],
  "id": "vehicle/bicycleauto_price_service",
  "state": true,
  "url": "http://surf.scss.tcd.ie/_provider_/vehicle/bicycleauto_price_service"
}