{
  "outputs": [
    {
      "name": "_BUTTER",
      "type": "http://127.0.0.1/ontology/Mid-level-ontology.owl#Butter",
      "desc": "Output of service SoldButterService"
    },
    {
      "name": "_SELLING",
      "type": "http://127.0.0.1/ontology/SUMO.owl#Selling",
      "desc": "Output of service SoldButterService"
    }
  ],
  "capability": "atomic",
  "file": "grocerystore_butterselling_service.owls",
  "provider": {
    "type": "asp"
  },
  "inputs": [
    {
      "name": "_GROCERYSTORE",
      "type": "http://127.0.0.1/ontology/Mid-level-ontology.owl#GroceryStore",
      "desc": "Input of service SoldButterService"
    }
  ],
  "name": "SoldButterService",
  "description": "This service informs about selling of a certain butter item in a given grocerystore.",
  "domains": [
    {
      "name": "Food_and_Drinks",
      "url": "http://www.surf.scss.tcd.ie/cityOntology/#Food_and_Drinks"
    }
  ],
  "id": "food/grocerystore_butterselling_service",
  "state": true,
  "url": "http://surf.scss.tcd.ie/_provider_/food/grocerystore_butterselling_service"
}