{
  "outputs": [
    {
      "name": "_PRICE",
      "type": "http://127.0.0.1/ontology/concept.owl#Price",
      "desc": "Output of service AuthorisedPersonObjectPriceService"
    }
  ],
  "capability": "atomic",
  "file": "objectpersoncreditaccount_price_service.owls",
  "provider": {
    "type": "webservice"
  },
  "inputs": [
    {
      "name": "_CREDITACCOUNT",
      "type": "http://127.0.0.1/ontology/Mid-level-ontology.owl#CreditAccount",
      "desc": "Input of service AuthorisedPersonObjectPriceService"
    },
    {
      "name": "_OBJECT",
      "type": "http://127.0.0.1/ontology/simplified_sumo.owl#Object",
      "desc": "Input of service AuthorisedPersonObjectPriceService"
    },
    {
      "name": "_PERSON",
      "type": "http://127.0.0.1/ontology/books.owl#Person",
      "desc": "Input of service AuthorisedPersonObjectPriceService"
    }
  ],
  "name": "AuthorisedPersonObjectPriceService",
  "description": "This service varify account of an authorised person andreturns recommended price of an object.",
  "domains": [
    {
      "name": "Payment_and_Delivery",
      "url": "http://www.surf.scss.tcd.ie/cityOntology/#Payment_and_Delivery"
    }
  ],
  "id": "payment/personobjectcreditaccount_price_service",
  "state": true,
  "url": "http://surf.scss.tcd.ie/_provider_/payment/personobjectcreditaccount_price_service"
}