{
  "outputs": [
    {
      "name": "_DIAGNOSTICPROCESS",
      "type": "http://127.0.0.1/ontology/SUMO.owl#DiagnosticProcess",
      "desc": "Output of service MedicalClinic DiagnosticProcess Service"
    }
  ],
  "capability": "atomic",
  "file": "medicalclinic_diagnosticprocess_service.owls",
  "provider": {
    "type": "webservice"
  },
  "inputs": [
    {
      "name": "_MEDICALCLINIC",
      "type": "http://127.0.0.1/ontology/Mid-level-ontology.owl#MedicalClinic",
      "desc": "Input of service MedicalClinic DiagnosticProcess Service"
    }
  ],
  "name": "MedicalClinic DiagnosticProcess Service",
  "description": "This service returns certain type diagnostic process available in the certain given medical clinic.",
  "domains": [
    {
      "name": "Health",
      "url": "http://www.surf.scss.tcd.ie/cityOntology/#Health"
    }
  ],
  "id": "medical/medicalclinic_diagnosticprocess_service",
  "state": true,
  "url": "http://surf.scss.tcd.ie/_provider_/medical/medicalclinic_diagnosticprocess_service"
}