{
  "outputs": [
    {
      "name": "_PROFESSION",
      "type": "http://127.0.0.1/ontology/Mid-level-ontology.owl#Profession",
      "desc": "Output of service Profit-Organization Profession service"
    }
  ],
  "capability": "atomic",
  "file": "profit-organization_profession_service.owls",
  "provider": {
    "type": "wsdn"
  },
  "inputs": [
    {
      "name": "_PROFIT-ORGANIZATION",
      "type": "http://127.0.0.1/ontology/portal.owl#Profit-Organization",
      "desc": "Input of service Profit-Organization Profession service"
    }
  ],
  "name": "Profit-Organization Profession service",
  "description": "You can search positions for professionals in a given profit-organization.",
  "domains": [
    {
      "name": "Industry",
      "url": "http://www.surf.scss.tcd.ie/cityOntology/#Industry"
    }
  ],
  "id": "industry/profit-organization_profession_service",
  "state": true,
  "url": "http://surf.scss.tcd.ie/_provider_/industry/profit-organization_profession_service"
}