{
  "outputs": [
    {
      "name": "_PRICE",
      "type": "http://127.0.0.1/ontology/concept.owl#Price",
      "desc": "Output of service 4WheeledCar 1PersonBicycle Price service"
    }
  ],
  "capability": "atomic",
  "file": "4wheeledcar1personbicycle_price_service.owls",
  "provider": {
    "type": "wsdn"
  },
  "inputs": [
    {
      "name": "_1PERSONBICYCLE",
      "type": "http://127.0.0.1/ontology/my_ontology.owl#OnePersonBicycle",
      "desc": "Input of service 4WheeledCar 1PersonBicycle Price service"
    },
    {
      "name": "_4WHEELEDCAR",
      "type": "http://127.0.0.1/ontology/my_ontology.owl#FourWheeledCar",
      "desc": "Input of service 4WheeledCar 1PersonBicycle Price service"
    }
  ],
  "name": "4WheeledCar 1PersonBicycle Price service",
  "description": "This service returns price of the pair of a given four wheeled car model and one person bicycle model.",
  "id": "economy/4wheeledcar1personbicycle_price_service",
  "state": true,
  "url": "http://surf.scss.tcd.ie/_provider_/economy/4wheeledcar1personbicycle_price_service"
}