{
  "outputs": [
    {
      "name": "_ICON",
      "type": "http://127.0.0.1/ontology/SUMO.owl#Icon",
      "desc": "Output of service LocationLocationIcon Service"
    }
  ],
  "capability": "atomic",
  "file": "locationlocation_icon_service.owls",
  "provider": {
    "type": "webservice"
  },
  "inputs": [
    {
      "name": "_LOCATION1",
      "type": "http://127.0.0.1/ontology/portal.owl#Location",
      "desc": "Input of service LocationLocationIcon Service"
    },
    {
      "name": "_LOCATION2",
      "type": "http://127.0.0.1/ontology/portal.owl#Location",
      "desc": "Input of service LocationLocationIcon Service"
    }
  ],
  "name": "LocationLocationIcon Service",
  "description": "This service returns an icon to indicate roadway signs between two locations",
  "domains": [
    {
      "name": "Travel",
      "url": "http://www.surf.scss.tcd.ie/cityOntology/#Travel"
    }
  ],
  "id": "travel/locationlocation_icon_service",
  "state": true,
  "url": "http://surf.scss.tcd.ie/_provider_/travel/locationlocation_icon_service"
}