{
  "outputs": [
    {
      "name": "_price",
      "type": "string",
      "desc": "Output of service KAHN BookFinderPriceService"
    },
    {
      "name": "_book",
      "type": "string",
      "desc": "Output of service KAHN BookFinderPriceService"
    }
  ],
  "provider": {
    "type": "webservice"
  },
  "inputs": [
    {
      "name": "_title",
      "type": "string",
      "desc": "Input of service KAHN BookFinderPriceService"
    }
  ],
  "name": "KAHN BookFinderPriceService",
  "description": "KAHN is a recommended service to find high valuable bookswith their price on the given title.",
  "domains": [
    {
      "name": "Government_and_Planning",
      "url": "http://www.surf.scss.tcd.ie/cityOntology/#Government_and_Planning"
    }
  ],
  "id": "retail/title_pricebook_service",
  "state": true,
  "url": "http://surf.scss.tcd.ie/_provider_/retail/title_pricebook_service"
}