{
  "outputs": [
    {
      "name": "_TEA",
      "type": "http://127.0.0.1/ontology/Mid-level-ontology.owl#Tea",
      "desc": "Output of service DrugStoreTeaService"
    }
  ],
  "capability": "atomic",
  "file": "drugstore_tea_service.owls",
  "provider": {
    "type": "webservice"
  },
  "inputs": [
    {
      "name": "_DRUGSTORE",
      "type": "http://127.0.0.1/ontology/Mid-level-ontology.owl#DrugStore",
      "desc": "Input of service DrugStoreTeaService"
    }
  ],
  "name": "DrugStoreTeaService",
  "description": "This service returns some special kind of tea, useful for stomach problems, obtainable from a given drugstore.",
  "domains": [
    {
      "name": "Food_and_Drinks",
      "url": "http://www.surf.scss.tcd.ie/cityOntology/#Food_and_Drinks"
    }
  ],
  "id": "food/drugstore_tea_service",
  "state": true,
  "url": "http://surf.scss.tcd.ie/_provider_/food/drugstore_tea_service"
}