{
    "capability": "atomic",
    "description": "GRWF service is used to get weatherfront of a particular geographical region.",
    "domains": [
        {
            "name": "Travel",
            "url": "http://www.surf.scss.tcd.ie/cityOntology/#Travel"
        }
    ],
    "file": "geographical-region_weatherfront_service.owls",
    "id": "travel/geographical-region_weatherfront_service",
    "inputs": [
        {
            "desc": "Input of service GRWF Service",
            "name": "_GEOGRAPHICAL-REGION",
            "type": "http://127.0.0.1/ontology/portal.owl#Geographical-Region"
        }
    ],
    "name": "GRWF Service",
    "outputs": [
        {
            "desc": "Output of service GRWF Service",
            "name": "_WEATHERFRONT",
            "type": "http://127.0.0.1/ontology/Mid-level-ontology.owl#WeatherFront"
        }
    ],
    "provider": {
        "type": "wsdn"
    },
    "state": true,
    "url": "http://surf.scss.tcd.ie/_provider_/travel/geographical-region_weatherfront_service"
}