{
  "outputs": [
    {
      "name": "_DROUGHT",
      "type": "http://127.0.0.1/ontology/Mid-level-ontology.owl#Drought",
      "desc": "Output of service Geographical-Region Drought Service"
    }
  ],
  "capability": "atomic",
  "file": "geographical-region_drought_service.owls",
  "provider": {
    "type": "wsdn"
  },
  "inputs": [
    {
      "name": "_GEOGRAPHICAL-REGION",
      "type": "http://127.0.0.1/ontology/portal.owl#Geographical-Region",
      "desc": "Input of service Geographical-Region Drought Service"
    }
  ],
  "name": "Geographical-Region Drought Service",
  "description": "This service informs about droughts of a given geographical region.",
  "domains": [
    {
      "name": "Travel",
      "url": "http://www.surf.scss.tcd.ie/cityOntology/#Travel"
    }
  ],
  "id": "travel/geographical-region_drought_service",
  "state": true,
  "url": "http://surf.scss.tcd.ie/_provider_/travel/geographical-region_drought_service"
}