{
  "outputs": [
    {
      "name": "_recommendedpriceineuro",
      "type": "string",
      "desc": "Output of service car Recommended price service"
    }
  ],
  "provider": {
    "type": "wsdn"
  },
  "inputs": [
    {
      "name": "_car",
      "type": "string",
      "desc": "Input of service car Recommended price service"
    }
  ],
  "name": "car Recommended price service",
  "description": "you can acquire recommended price in Euro for a car.",
  "domains": [
    {
      "name": "Foundations_and_Charity",
      "url": "http://www.surf.scss.tcd.ie/cityOntology/#Foundations_and_Charity"
    }
  ],
  "id": "retail/car_recommendedpriceineuro_service",
  "state": true,
  "url": "http://surf.scss.tcd.ie/_provider_/retail/car_recommendedpriceineuro_service"
}