{
  "outputs": [
    {
      "name": "_publication-reference",
      "type": "string",
      "desc": "Output of service ResearchFellowPublicationReferences  service"
    }
  ],
  "provider": {
    "type": "asp"
  },
  "inputs": [
    {
      "name": "_research-fellow-in-academia",
      "type": "string",
      "desc": "Input of service ResearchFellowPublicationReferences  service"
    }
  ],
  "name": "ResearchFellowPublicationReferences  service",
  "description": "This service returns publication references of a research fellow.",
  "domains": [
    {
      "name": "Government_and_Planning",
      "url": "http://www.surf.scss.tcd.ie/cityOntology/#Government_and_Planning"
    }
  ],
  "id": "educational/research-fellow-in-academia_publication-reference_service",
  "state": true,
  "url": "http://surf.scss.tcd.ie/_provider_/educational/research-fellow-in-academia_publication-reference_service"
}