{
  "outputs": [
    {
      "name": "_diet",
      "type": "string",
      "desc": "Output of service MerkelD Service"
    },
    {
      "name": "_price",
      "type": "string",
      "desc": "Output of service MerkelD Service"
    }
  ],
  "provider": {
    "type": "webservice"
  },
  "inputs": [
    {
      "name": "_preparedfood",
      "type": "string",
      "desc": "Input of service MerkelD Service"
    }
  ],
  "name": "MerkelD Service",
  "description": "MerkelD is a german firm and presents a service that returns not only price of a givenpreparedfood, but also informs the usage of the food in certain type of diet.",
  "domains": [
    {
      "name": "Foundations_and_Charity",
      "url": "http://www.surf.scss.tcd.ie/cityOntology/#Foundations_and_Charity"
    }
  ],
  "id": "retail/preparedfood_dietprice_service",
  "state": true,
  "url": "http://surf.scss.tcd.ie/_provider_/retail/preparedfood_dietprice_service"
}