{
  "outputs": [
    {
      "name": "_PRICE",
      "type": "http://127.0.0.1/ontology/concept.owl#Price",
      "desc": "Output of service Auto Cycle Price service"
    }
  ],
  "capability": "atomic",
  "file": "autocycle_price_service.owls",
  "provider": {
    "type": "asp"
  },
  "inputs": [
    {
      "name": "_CYCLE",
      "type": "http://127.0.0.1/ontology/my_ontology.owl#Cycle",
      "desc": "Input of service Auto Cycle Price service"
    },
    {
      "name": "_AUTO",
      "type": "http://127.0.0.1/ontology/my_ontology.owl#Auto",
      "desc": "Input of service Auto Cycle Price service"
    }
  ],
  "name": "Auto Cycle Price service",
  "description": "This service returns weekly renting price of the given pair of an auto modeland a cycle model.",
  "id": "economy/autocycle_price_service",
  "state": true,
  "url": "http://surf.scss.tcd.ie/_provider_/economy/autocycle_price_service"
}