{
  "outputs": [
    {
      "name": "_BOOK",
      "type": "http://127.0.0.1/ontology/portal.owl#Book",
      "desc": "Output of service ABN/ISBN Booksearch"
    }
  ],
  "capability": "atomic",
  "file": "publication-number_book_service.owls",
  "provider": {
    "type": "wsdn"
  },
  "inputs": [
    {
      "name": "_PUBLICATION-NUMBER",
      "type": "http://127.0.0.1/ontology/portal.owl#Publication-Number",
      "desc": "Input of service ABN/ISBN Booksearch"
    }
  ],
  "name": "ABN/ISBN Booksearch",
  "description": "Searches for a book if either the academic book number or the ISBN is avaible",
  "domains": [
    {
      "name": "Educational",
      "url": "http://www.surf.scss.tcd.ie/cityOntology/#Educational"
    },
    {
      "name": "Entertainment_Products",
      "url": "http://www.surf.scss.tcd.ie/cityOntology/#Entertainment_Products"
    }
  ],
  "id": "books/publication-number_book_service",
  "state": true,
  "url": "http://surf.scss.tcd.ie/_provider_/books/publication-number_book_service"
}