{
  "outputs": [
    {
      "name": "_PROFESSION",
      "type": "http://127.0.0.1/ontology/Mid-level-ontology.owl#Profession",
      "desc": "Output of service Country Profession FullTimePosition Service"
    },
    {
      "name": "_FULLTIMEPOSITION",
      "type": "http://127.0.0.1/ontology/Mid-level-ontology.owl#FullTimePosition",
      "desc": "Output of service Country Profession FullTimePosition Service"
    }
  ],
  "capability": "atomic",
  "file": "country_professionfulltimeposition_service.owls",
  "provider": {
    "type": "wsdn"
  },
  "inputs": [
    {
      "name": "_COUNTRY",
      "type": "http://127.0.0.1/ontology/portal.owl#Country",
      "desc": "Input of service Country Profession FullTimePosition Service"
    }
  ],
  "name": "Country Profession FullTimePosition Service",
  "description": "This service returns full time positions offering for professions in a given country.",
  "domains": [
    {
      "name": "Industry",
      "url": "http://www.surf.scss.tcd.ie/cityOntology/#Industry"
    }
  ],
  "id": "industry/country_professionfulltimeposition_service",
  "state": true,
  "url": "http://surf.scss.tcd.ie/_provider_/industry/country_professionfulltimeposition_service"
}