{
  "outputs": [
    {
      "name": "_OCCUPATIONALTRADE",
      "type": "http://127.0.0.1/ontology/Mid-level-ontology.owl#OccupationalTrade",
      "desc": "Output of service Country OccupationalTrade TimeDuration service"
    },
    {
      "name": "_TIMEDURATION",
      "type": "http://127.0.0.1/ontology/SUMO.owl#TimeDuration",
      "desc": "Output of service Country OccupationalTrade TimeDuration service"
    }
  ],
  "capability": "atomic",
  "file": "country_occupationaltradetimeduration_Service.owls",
  "provider": {
    "type": "webservice"
  },
  "inputs": [
    {
      "name": "_COUNTRY",
      "type": "http://127.0.0.1/ontology/portal.owl#Country",
      "desc": "Input of service Country OccupationalTrade TimeDuration service"
    }
  ],
  "name": "Country OccupationalTrade TimeDuration service",
  "description": "This service returns occupational trade jobs in a given company and its time duration.",
  "domains": [
    {
      "name": "Industry",
      "url": "http://www.surf.scss.tcd.ie/cityOntology/#Industry"
    }
  ],
  "id": "industry/country_occupationaltradetimeduration_Service",
  "state": true,
  "url": "http://surf.scss.tcd.ie/_provider_/industry/country_occupationaltradetimeduration_Service"
}