{
  "outputs": [
    {
      "name": "_MEDIA",
      "type": "http://127.0.0.1/ontology/my_ontology.owl#Media",
      "desc": "Output of service Title Media RecommendedPrice Quality service"
    },
    {
      "name": "_RECOMMENDEDPRICE",
      "type": "http://127.0.0.1/ontology/concept.owl#RecommendedPrice",
      "desc": "Output of service Title Media RecommendedPrice Quality service"
    },
    {
      "name": "_QUALITY",
      "type": "http://127.0.0.1/ontology/finance_th_web.owl#quality",
      "desc": "Output of service Title Media RecommendedPrice Quality service"
    }
  ],
  "capability": "atomic",
  "file": "title_mediarecommendedpricequality_service.owls",
  "provider": {
    "type": "webservice"
  },
  "inputs": [
    {
      "name": "_TITLE",
      "type": "http://127.0.0.1/ontology/books.owl#Title",
      "desc": "Input of service Title Media RecommendedPrice Quality service"
    }
  ],
  "name": "Title Media RecommendedPrice Quality service",
  "description": "This service searches media for the given title, and also returnsits recommended price and quality.",
  "domains": [
    {
      "name": "Communications",
      "url": "http://www.surf.scss.tcd.ie/cityOntology/#Communications"
    }
  ],
  "id": "communication/title_mediarecommendedpricequality_service",
  "state": true,
  "url": "http://surf.scss.tcd.ie/_provider_/communication/title_mediarecommendedpricequality_service"
}