{
  "outputs": [
    {
      "name": "_ICON",
      "type": "http://127.0.0.1/ontology/SUMO.owl#Icon",
      "desc": "Output of service roadway signs Service"
    }
  ],
  "capability": "atomic",
  "file": "geographical-regiongeographical-region_icon_service.owls",
  "provider": {
    "type": "wsdn"
  },
  "inputs": [
    {
      "name": "_GEOGRAPHICAL-REGION1",
      "type": "http://127.0.0.1/ontology/portal.owl#Geographical-Region",
      "desc": "Input of service roadway signs Service"
    },
    {
      "name": "_GEOGRAPHICAL-REGION2",
      "type": "http://127.0.0.1/ontology/portal.owl#Geographical-Region",
      "desc": "Input of service roadway signs Service"
    }
  ],
  "name": "roadway signs Service",
  "description": "This service returns an icon to indicate roadway signs between two geographical locations.",
  "domains": [
    {
      "name": "Travel",
      "url": "http://www.surf.scss.tcd.ie/cityOntology/#Travel"
    },
    {
      "name": "Geography",
      "url": "http://www.surf.scss.tcd.ie/cityOntology/#Geography"
    }
  ],
  "id": "travel/geographical-regiongeographical-region_icon_service",
  "state": true,
  "url": "http://surf.scss.tcd.ie/_provider_/travel/geographical-regiongeographical-region_icon_service"
}