{
    "capability": "atomic",
    "description": "This services informs the latest market taxedprice and the quantity of a given beverage item.",
    "domains": [
        {
            "name": "Food_and_Drinks",
            "url": "http://www.surf.scss.tcd.ie/cityOntology/#Food_and_Drinks"
        }
    ],
    "file": "beverage_taxedpricequantity_service.owls",
    "id": "education/beverage_taxedpricequantity_service",
    "inputs": [
        {
            "desc": "Input of service Beverage TaxedPrice Quantity Service",
            "name": "_BEVERAGE",
            "type": "http://127.0.0.1/ontology/SUMO.owl#Beverage"
        }
    ],
    "name": "Beverage TaxedPrice Quantity Service",
    "outputs": [
        {
            "desc": "Output of service Beverage TaxedPrice Quantity Service",
            "name": "_TAXEDPRICE",
            "type": "http://127.0.0.1/ontology/concept.owl#TaxedPrice"
        },
        {
            "desc": "Output of service Beverage TaxedPrice Quantity Service",
            "name": "_QUANTITY",
            "type": "http://127.0.0.1/ontology/support.owl#Quantity"
        }
    ],
    "provider": {
        "type": "wsdn"
    },
    "state": true,
    "url": "http://surf.scss.tcd.ie/_provider_/education/beverage_taxedpricequantity_service"
}