{
  "outputs": [
    {
      "name": "_TOWN",
      "type": "http://127.0.0.1/ontology/travel.owl#Town",
      "desc": "Output of service HikingTownService"
    }
  ],
  "capability": "atomic",
  "file": "hiking_town_service.owls",
  "provider": {
    "type": "asp"
  },
  "inputs": [
    {
      "name": "_HIKING",
      "type": "http://127.0.0.1/ontology/travel.owl#Hiking",
      "desc": "Input of service HikingTownService"
    }
  ],
  "name": "HikingTownService",
  "description": "This service returns the best towns for given hiking type.",
  "domains": [
    {
      "name": "Travel",
      "url": "http://www.surf.scss.tcd.ie/cityOntology/#Travel"
    },
    {
      "name": "Activity",
      "url": "http://www.surf.scss.tcd.ie/cityOntology/#Activity"
    }
  ],
  "id": "activity/hiking_town_service",
  "state": true,
  "url": "http://surf.scss.tcd.ie/_provider_/activity/hiking_town_service"
}