{
  "outputs": [
    {
      "name": "_PRICE",
      "type": "http://127.0.0.1/ontology/concept.owl#Price",
      "desc": "Output of service Expensive car price service"
    }
  ],
  "capability": "atomic",
  "file": "expensivecar_price_service.owls",
  "provider": {
    "type": "webservice"
  },
  "inputs": [
    {
      "name": "_EXPENSIVECAR",
      "type": "http://127.0.0.1/ontology/my_ontology.owl#ExpensiveCar",
      "desc": "Input of service Expensive car price service"
    }
  ],
  "name": "Expensive car price service",
  "description": "An interested service to provide charm purchase price of a given expensive car model.",
  "id": "economy/expensivecar_price_service",
  "state": true,
  "url": "http://surf.scss.tcd.ie/_provider_/economy/expensivecar_price_service"
}