{
    "capability": "atomic",
    "description": "This service returns author and max price of a given science fiction novel.",
    "domains": [
        {
            "name": "Research_and_Science",
            "url": "http://www.surf.scss.tcd.ie/cityOntology/#Research_and_Science"
        }
    ],
    "file": "science-fiction-novel_authormaxprice_service.owls",
    "id": "books/science-fiction-novel_authormaxprice_service",
    "inputs": [
        {
            "desc": "Input of service Science-Fiction-Novel Author MaxPrice Service",
            "name": "_SCIENCE-FICTION-NOVEL",
            "type": "http://127.0.0.1/ontology/books.owl#Science-Fiction-Novel"
        }
    ],
    "name": "Science-Fiction-Novel Author MaxPrice Service",
    "outputs": [
        {
            "desc": "Output of service Science-Fiction-Novel Author MaxPrice Service",
            "name": "_AUTHOR",
            "type": "http://127.0.0.1/ontology/books.owl#Author"
        },
        {
            "desc": "Output of service Science-Fiction-Novel Author MaxPrice Service",
            "name": "_MAXPRICE",
            "type": "http://127.0.0.1/ontology/concept.owl#MaxPrice"
        }
    ],
    "provider": {
        "type": "webservice"
    },
    "state": true,
    "url": "http://surf.scss.tcd.ie/_provider_/books/science-fiction-novel_authormaxprice_service"
}