{
  "outputs": [
    {
      "name": "_DIET",
      "type": "http://127.0.0.1/ontology/Mid-level-ontology.owl#Diet",
      "desc": "Output of service MerkelD Service"
    },
    {
      "name": "_PRICE",
      "type": "http://127.0.0.1/ontology/concept.owl#Price",
      "desc": "Output of service MerkelD Service"
    }
  ],
  "capability": "atomic",
  "file": "MerkelD_service.owls",
  "provider": {
    "type": "wsdn"
  },
  "inputs": [
    {
      "name": "_PREPAREDFOOD",
      "type": "http://127.0.0.1/ontology/Mid-level-ontology.owl#PreparedFood",
      "desc": "Input of service MerkelD Service"
    }
  ],
  "name": "MerkelD Service",
  "description": "MerkelD is a german firm and presents a service that returns not only price of a givenprepared food item, but also informs the usage of the food in certain type of diet.",
  "domains": [
    {
      "name": "Food_and_Drinks",
      "url": "http://www.surf.scss.tcd.ie/cityOntology/#Food_and_Drinks"
    }
  ],
  "id": "food/preparedfood_dietprice_service",
  "state": true,
  "url": "http://surf.scss.tcd.ie/_provider_/food/preparedfood_dietprice_service"
}