{
  "outputs": [
    {
      "name": "_ZIPCODE",
      "type": "http://127.0.0.1/ontology/geographydataset.owl#US5DigitZipCode",
      "desc": "Output of service Zip codes finder  service."
    }
  ],
  "capability": "atomic",
  "file": "city_state_ZipCodes.owls",
  "provider": {
    "type": "webservice"
  },
  "inputs": [
    {
      "name": "_LICENSEKEY",
      "type": "http://127.0.0.1/ontology/geographydataset.owl#Code",
      "desc": "Input of service Zip codes finder  service."
    },
    {
      "name": "_CITY",
      "type": "http://127.0.0.1/ontology/protonu.owl#City",
      "desc": "Input of service Zip codes finder  service."
    },
    {
      "name": "_STATE",
      "type": "http://127.0.0.1/ontology/protonu.owl#State",
      "desc": "Input of service Zip codes finder  service."
    }
  ],
  "name": "Zip codes finder  service.",
  "description": "This service returns all possible zipcodes for a given US city/state combination.For using this service valid License Key should be provided.",
  "domains": [
    {
      "name": "Geography",
      "url": "http://www.surf.scss.tcd.ie/cityOntology/#Geography"
    },
    {
      "name": "Travel",
      "url": "http://www.surf.scss.tcd.ie/cityOntology/#Travel"
    }
  ],
  "id": "travel/city_state_ZipCodes",
  "state": true,
  "url": "http://surf.scss.tcd.ie/_provider_/travel/city_state_ZipCodes"
}