{
  "outputs": [
    {
      "name": "_BOOK",
      "type": "http://127.0.0.1/ontology/books.owl#Book",
      "desc": "Output of service Author Book MaxPrice Service"
    },
    {
      "name": "_MAXPRICE",
      "type": "http://127.0.0.1/ontology/concept.owl#MaxPrice",
      "desc": "Output of service Author Book MaxPrice Service"
    }
  ],
  "capability": "atomic",
  "file": "author_bookmaxprice_service.owls",
  "provider": {
    "type": "webservice"
  },
  "inputs": [
    {
      "name": "_AUTHOR",
      "type": "http://127.0.0.1/ontology/books.owl#Author",
      "desc": "Input of service Author Book MaxPrice Service"
    }
  ],
  "name": "Author Book MaxPrice Service",
  "description": "This service returns books written by the given authorand their maximum price as well.",
  "domains": [
    {
      "name": "Entertainment_Products",
      "url": "http://www.surf.scss.tcd.ie/cityOntology/#Entertainment_Products"
    },
    {
      "name": "Educational",
      "url": "http://www.surf.scss.tcd.ie/cityOntology/#Educational"
    }
  ],
  "id": "books/author_bookmaxprice_service",
  "state": true,
  "url": "http://surf.scss.tcd.ie/_provider_/books/author_bookmaxprice_service"
}