{
  "outputs": [
    {
      "name": "_LATITUDE",
      "type": "http://127.0.0.1/ontology/protont.owl#latitude",
      "desc": "Output of service ATM Location Finder Service."
    },
    {
      "name": "_LONGITUDE",
      "type": "http://127.0.0.1/ontology/protont.owl#longitude",
      "desc": "Output of service ATM Location Finder Service."
    }
  ],
  "capability": "atomic",
  "file": "getATMLocationsInCity.owls",
  "provider": {
    "type": "asp"
  },
  "inputs": [
    {
      "name": "_LICENSEKEY",
      "type": "http://127.0.0.1/ontology/geographydataset.owl#Code",
      "desc": "Input of service ATM Location Finder Service."
    },
    {
      "name": "_CITY",
      "type": "http://127.0.0.1/ontology/protonu.owl#City",
      "desc": "Input of service ATM Location Finder Service."
    },
    {
      "name": "_STATE",
      "type": "http://127.0.0.1/ontology/protonu.owl#State",
      "desc": "Input of service ATM Location Finder Service."
    }
  ],
  "name": "ATM Location Finder Service.",
  "description": "This service returns up to fifty ATM locations (Latitude/Longitude pairs) for a given city in a given state.For using this service valid License Key should be provided.",
  "domains": [
    {
      "name": "Geography",
      "url": "http://www.surf.scss.tcd.ie/cityOntology/#Geography"
    }
  ],
  "id": "geography/atm_location_service",
  "state": true,
  "url": "http://surf.scss.tcd.ie/_provider_/geography/atm_location_service"
}