{
  "outputs": [
    {
      "name": "_HOTEL",
      "type": "http://127.0.0.1/ontology/travel.owl#Hotel",
      "desc": "Output of service Time-Measure Geopolitical-Entity City Hotel InfoService"
    }
  ],
  "capability": "atomic",
  "file": "time-measuregeopolitical-entitycity_hotel_service.owls",
  "provider": {
    "type": "wsdn"
  },
  "inputs": [
    {
      "name": "_CITY",
      "type": "http://127.0.0.1/ontology/travel.owl#City",
      "desc": "Input of service Time-Measure Geopolitical-Entity City Hotel InfoService"
    },
    {
      "name": "_GEOPOLITICAL-ENTITY",
      "type": "http://127.0.0.1/ontology/portal.owl#Geopolitical-Entity",
      "desc": "Input of service Time-Measure Geopolitical-Entity City Hotel InfoService"
    },
    {
      "name": "_TIME-MEASURE",
      "type": "http://127.0.0.1/ontology/support.owl#Time-Measure",
      "desc": "Input of service Time-Measure Geopolitical-Entity City Hotel InfoService"
    }
  ],
  "name": "Time-Measure Geopolitical-Entity City Hotel InfoService",
  "description": "This service informs about availability of hotel in a city of the geopolitical-entity during the given time-measure. The city should be located in the given geopolitical entity.",
  "domains": [
    {
      "name": "Travel",
      "url": "http://www.surf.scss.tcd.ie/cityOntology/#Travel"
    }
  ],
  "id": "travel/time-measuregeopolitical-entitycity_hotel_service",
  "state": true,
  "url": "http://surf.scss.tcd.ie/_provider_/travel/time-measuregeopolitical-entitycity_hotel_service"
}