{
    "description": "This is the service vehicle_usage_monitoring",
    "domains": [
        {
            "name": "Transport_and_Mobility",
            "url": "http://www.surf.scss.tcd.ie/cityOntology/#Transport_and_Mobility"
        }
    ],
    "id": "transportandmobility/14_vehicle_usage_monitoring",
    "inputs": [
        {
            "desc": "Input of service vehicle_usage_monitoring",
            "name": "_VEHICLEID",
            "type": "http://www.surf.scss.tcd.ie/IoTservices.owl#vehicleId"
        }
    ],
    "name": "vehicle_usage_monitoring",
    "outputs": [
        {
            "desc": "Output of service vehicle_usage_monitoring",
            "name": "_CARSTATUS",
            "type": "http://www.surf.scss.tcd.ie/IoTservices.owl#carStatus"
        }
    ],
    "provider": {
        "type": "asp"
    },
    "state": true,
    "url": "http://surf.scss.tcd.ie/_provider_/transportandmobility/14_vehicle_usage_monitoring"
}