{
    "capability": "atomic",
    "description": "This service returns information of person who has booked the given novel.",
    "domains": [
        {
            "name": "Research_and_Science",
            "url": "http://www.surf.scss.tcd.ie/cityOntology/#Research_and_Science"
        }
    ],
    "file": "novel_person_Reserverservice.owls",
    "id": "education/novel_person_service",
    "inputs": [
        {
            "desc": "Input of service NovelPersonService",
            "name": "_NOVEL",
            "type": "http://127.0.0.1/ontology/books.owl#Novel"
        }
    ],
    "name": "NovelPersonService",
    "outputs": [
        {
            "desc": "Output of service NovelPersonService",
            "name": "_PERSON",
            "type": "http://127.0.0.1/ontology/books.owl#Person"
        }
    ],
    "provider": {
        "type": "asp"
    },
    "state": true,
    "url": "http://surf.scss.tcd.ie/_provider_/education/novel_person_service"
}