{
  "outputs": [
    {
      "name": "_weathersystem",
      "type": "string",
      "desc": "Output of service GRWF Service"
    }
  ],
  "provider": {
    "type": "webservice"
  },
  "inputs": [
    {
      "name": "_geographical-region",
      "type": "string",
      "desc": "Input of service GRWF Service"
    }
  ],
  "name": "GRWF Service",
  "description": "GRWF service is used to get weather system of a particular geogrphical region.",
  "domains": [
    {
      "name": "Touristic_Place",
      "url": "http://www.surf.scss.tcd.ie/cityOntology/#Touristic_Place"
    }
  ],
  "id": "environmental/geographical-region_weathersystem_service",
  "state": true,
  "url": "http://surf.scss.tcd.ie/_provider_/environmental/geographical-region_weathersystem_service"
}