{
  "outputs": [
    {
      "name": "_SPORTS",
      "type": "http://127.0.0.1/ontology/travel.owl#Sports",
      "desc": "Output of service PersonCityCountryInfoService"
    },
    {
      "name": "_HOTEL",
      "type": "http://127.0.0.1/ontology/travel.owl#Hotel",
      "desc": "Output of service PersonCityCountryInfoService"
    }
  ],
  "capability": "atomic",
  "file": "personcountrycity_sportshotel_service.owls",
  "provider": {
    "type": "webservice"
  },
  "inputs": [
    {
      "name": "_CITY",
      "type": "http://127.0.0.1/ontology/travel.owl#City",
      "desc": "Input of service PersonCityCountryInfoService"
    },
    {
      "name": "_COUNTRY",
      "type": "http://127.0.0.1/ontology/portal.owl#Country",
      "desc": "Input of service PersonCityCountryInfoService"
    },
    {
      "name": "_PERSON",
      "type": "http://127.0.0.1/ontology/portal.owl#Person",
      "desc": "Input of service PersonCityCountryInfoService"
    }
  ],
  "name": "PersonCityCountryInfoService",
  "description": "This service is used not only to know the hotel in whichthe person is working, but also about sport activities which are available in the given city of a country.",
  "domains": [
    {
      "name": "Travel",
      "url": "http://www.surf.scss.tcd.ie/cityOntology/#Travel"
    }
  ],
  "id": "travel/personcountrycity_sportshotel_service",
  "state": true,
  "url": "http://surf.scss.tcd.ie/_provider_/travel/personcountrycity_sportshotel_service"
}