{
  "outputs": [
    {
      "name": "_PATIENTPRESENTATION",
      "type": "http://www.surf.scss.tcd.ie/IoTservices.owl#patientPresentation",
      "desc": "Output of service presentation_patient_status"
    }
  ],
  "provider": {
    "type": "asp"
  },
  "inputs": [
    {
      "name": "_PATIENTREADINGS",
      "type": "http://www.surf.scss.tcd.ie/IoTservices.owl#patientReadings",
      "desc": "Input of service presentation_patient_status"
    },
    {
      "name": "_PATIENTVIDEO",
      "type": "http://www.surf.scss.tcd.ie/IoTservices.owl#patientVideo",
      "desc": "Input of service presentation_patient_status"
    }
  ],
  "name": "presentation_patient_status",
  "description": "This is the service presentation_patient_status",
  "domains": [
    {
      "name": "Health",
      "url": "http://www.surf.scss.tcd.ie/cityOntology/#Health"
    },
    {
      "name": "Safety_and_Emergencies",
      "url": "http://www.surf.scss.tcd.ie/cityOntology/#Safety_and_Emergencies"
    }
  ],
  "id": "health/91_presentation_patient_status",
  "state": true,
  "url": "http://surf.scss.tcd.ie/_provider_/health/91_presentation_patient_status"
}