{
  "outputs": [
    {
      "name": "_LATITUDE",
      "type": "http://127.0.0.1/ontology/protont.owl#latitude",
      "desc": "Output of service Address location finder service."
    },
    {
      "name": "_LONGITUDE",
      "type": "http://127.0.0.1/ontology/protont.owl#longitude",
      "desc": "Output of service Address location finder service."
    }
  ],
  "capability": "atomic",
  "file": "getLocationOfAddress.owls",
  "provider": {
    "type": "webservice"
  },
  "inputs": [
    {
      "name": "_ADDRESS",
      "type": "http://127.0.0.1/ontology/protonu.owl#Address",
      "desc": "Input of service Address location finder service."
    },
    {
      "name": "_CITY",
      "type": "http://127.0.0.1/ontology/protonu.owl#City",
      "desc": "Input of service Address location finder service."
    },
    {
      "name": "_STATE",
      "type": "http://127.0.0.1/ontology/protonu.owl#State",
      "desc": "Input of service Address location finder service."
    }
  ],
  "name": "Address location finder service.",
  "description": "This service returns latitude and longitude location of a given US or Canadian address, with its city and state. If the address is not found, an error is returned.",
  "domains": [
    {
      "name": "Geography",
      "url": "http://www.surf.scss.tcd.ie/cityOntology/#Geography"
    },
    {
      "name": "Travel",
      "url": "http://www.surf.scss.tcd.ie/cityOntology/#Travel"
    }
  ],
  "id": "travel/getLocationOfAddress",
  "state": true,
  "url": "http://surf.scss.tcd.ie/_provider_/travel/getLocationOfAddress"
}