{
  "outputs": [
    {
      "name": "_ADDRESS",
      "type": "http://127.0.0.1/ontology/portal.owl#Address",
      "desc": "Output of service Educational-Employee Address Service"
    }
  ],
  "capability": "atomic",
  "file": "educational-employee_address_service.owls",
  "provider": {
    "type": "webservice"
  },
  "inputs": [
    {
      "name": "_EDUCATIONAL-EMPLOYEE",
      "type": "http://127.0.0.1/ontology/portal.owl#Educational-Employee",
      "desc": "Input of service Educational-Employee Address Service"
    }
  ],
  "name": "Educational-Employee Address Service",
  "description": "This service returns an home address of an educational-employee of a university.",
  "domains": [
    {
      "name": "Educational",
      "url": "http://www.surf.scss.tcd.ie/cityOntology/#Educational"
    }
  ],
  "id": "education/educational-employee_address_service",
  "state": true,
  "url": "http://surf.scss.tcd.ie/_provider_/education/educational-employee_address_service"
}