{
  "outputs": [
    {
      "name": "_AUTHOR",
      "type": "http://127.0.0.1/ontology/books.owl#Author",
      "desc": "Output of service SFBookAuthorService"
    }
  ],
  "capability": "atomic",
  "file": "sciencefictionbook_author_service.owls",
  "provider": {
    "type": "wsdn"
  },
  "inputs": [
    {
      "name": "_SCIENCEFICTIONBOOK",
      "type": "http://127.0.0.1/ontology/books.owl#ScienceFictionBook",
      "desc": "Input of service SFBookAuthorService"
    }
  ],
  "name": "SFBookAuthorService",
  "description": "This service returns author of the given science-fiction book.",
  "domains": [
    {
      "name": "Educational",
      "url": "http://www.surf.scss.tcd.ie/cityOntology/#Educational"
    },
    {
      "name": "Entertainment_Products",
      "url": "http://www.surf.scss.tcd.ie/cityOntology/#Entertainment_Products"
    }
  ],
  "id": "books/sciencefictionbook_author_service",
  "state": true,
  "url": "http://surf.scss.tcd.ie/_provider_/books/sciencefictionbook_author_service"
}