{
  "outputs": [
    {
      "name": "_nationalpark",
      "type": "string",
      "desc": "Output of service SurfingNationalParkService"
    }
  ],
  "provider": {
    "type": "asp"
  },
  "inputs": [
    {
      "name": "_surfing",
      "type": "string",
      "desc": "Input of service SurfingNationalParkService"
    }
  ],
  "name": "SurfingNationalParkService",
  "description": "This is the recommended service to know aboutthe national park for surfing.",
  "domains": [
    {
      "name": "Tools",
      "url": "http://www.surf.scss.tcd.ie/cityOntology/#Tools"
    }
  ],
  "id": "tourism/surfing_nationalpark_service",
  "state": true,
  "url": "http://surf.scss.tcd.ie/_provider_/tourism/surfing_nationalpark_service"
}