{
  "outputs": [
    {
      "name": "_LENDING",
      "type": "http://127.0.0.1/ontology/SUMO.owl#Lending",
      "desc": "Output of service Award Lending Germangoverment Service"
    }
  ],
  "capability": "atomic",
  "file": "award_lending_GermanGovservice.owls",
  "provider": {
    "type": "asp"
  },
  "inputs": [
    {
      "name": "_AWARD",
      "type": "http://127.0.0.1/ontology/portal.owl#Award",
      "desc": "Input of service Award Lending Germangoverment Service"
    }
  ],
  "name": "Award Lending Germangoverment Service",
  "description": "It is an attractive service to know about lendings offered for the given award by the german government.",
  "domains": [
    {
      "name": "Educational",
      "url": "http://www.surf.scss.tcd.ie/cityOntology/#Educational"
    }
  ],
  "id": "education/award_lending_service",
  "state": true,
  "url": "http://surf.scss.tcd.ie/_provider_/education/award_lending_service"
}