{
  "outputs": [
    {
      "name": "_LOCATION",
      "type": "http://127.0.0.1/ontology/protont.owl#Location",
      "desc": "Output of service Real-time geocoding service."
    },
    {
      "name": "_MATCHING-ADDRESS",
      "type": "http://127.0.0.1/ontology/protonu.owl#Address",
      "desc": "Output of service Real-time geocoding service."
    }
  ],
  "capability": "atomic",
  "file": "real-time_geocodingStreetAddress.owls",
  "provider": {
    "type": "asp"
  },
  "inputs": [
    {
      "name": "_USERID",
      "type": "http://127.0.0.1/ontology/geographydataset.owl#UniqueIdentifier",
      "desc": "Input of service Real-time geocoding service."
    },
    {
      "name": "_CITY",
      "type": "http://127.0.0.1/ontology/protonu.owl#City",
      "desc": "Input of service Real-time geocoding service."
    },
    {
      "name": "_STATE",
      "type": "http://127.0.0.1/ontology/protonu.owl#State",
      "desc": "Input of service Real-time geocoding service."
    },
    {
      "name": "_COUNTRY",
      "type": "http://127.0.0.1/ontology/protonu.owl#Country",
      "desc": "Input of service Real-time geocoding service."
    },
    {
      "name": "_ADDRESS",
      "type": "http://127.0.0.1/ontology/protonu.owl#Address",
      "desc": "Input of service Real-time geocoding service."
    },
    {
      "name": "_ZIPCODE",
      "type": "http://127.0.0.1/ontology/geographydataset.owl#US5DigitZipCode",
      "desc": "Input of service Real-time geocoding service."
    }
  ],
  "name": "Real-time geocoding service.",
  "description": "The real-time geocoding service is a web based geocoding service providing real-time geocoding of addresses from 26 countries and areas. It returns the best mathching geographic location and actual matching address.Valid UserID should be provided in order to use this service.",
  "domains": [
    {
      "name": "Geography",
      "url": "http://www.surf.scss.tcd.ie/cityOntology/#Geography"
    },
    {
      "name": "Travel",
      "url": "http://www.surf.scss.tcd.ie/cityOntology/#Travel"
    }
  ],
  "id": "travel/real-time_geocodingStreetAddress",
  "state": true,
  "url": "http://surf.scss.tcd.ie/_provider_/travel/real-time_geocodingStreetAddress"
}