{
  "outputs": [
    {
      "name": "_YEAR",
      "type": "http://127.0.0.1/ontology/SUMO.owl#Year",
      "desc": "Output of service ExpensiveCar Year Price Service"
    },
    {
      "name": "_PRICE",
      "type": "http://127.0.0.1/ontology/concept.owl#Price",
      "desc": "Output of service ExpensiveCar Year Price Service"
    }
  ],
  "capability": "atomic",
  "file": "expensivecar_yearprice_service.owls",
  "provider": {
    "type": "wsdn"
  },
  "inputs": [
    {
      "name": "_EXPENSIVECAR",
      "type": "http://127.0.0.1/ontology/my_ontology.owl#ExpensiveCar",
      "desc": "Input of service ExpensiveCar Year Price Service"
    }
  ],
  "name": "ExpensiveCar Year Price Service",
  "description": "This service provides the purchase price and production year of a given expensive car model.",
  "id": "economy/expensivecar_yearprice_service",
  "state": true,
  "url": "http://surf.scss.tcd.ie/_provider_/economy/expensivecar_yearprice_service"
}