{
  "outputs": [
    {
      "name": "_RECOMMENDEDPRICEINDOLLAR",
      "type": "http://127.0.0.1/ontology/concept.owl#RecommendedPriceInDollar",
      "desc": "Output of service Tizon RecommendedPriceService"
    }
  ],
  "capability": "atomic",
  "file": "Tizonbook_recommendedpriceindollar_service.owls",
  "provider": {
    "type": "wsdn"
  },
  "inputs": [
    {
      "name": "_BOOK",
      "type": "http://127.0.0.1/ontology/books.owl#Book",
      "desc": "Input of service Tizon RecommendedPriceService"
    }
  ],
  "name": "Tizon RecommendedPriceService",
  "description": "Tizon is a rival US company of the book providers.It provides a web service to return recommended purchase price of a book in dollars.",
  "domains": [
    {
      "name": "Entertainment_Products",
      "url": "http://www.surf.scss.tcd.ie/cityOntology/#Entertainment_Products"
    }
  ],
  "id": "books/book_recommendedpriceindollar_service",
  "state": true,
  "url": "http://surf.scss.tcd.ie/_provider_/books/book_recommendedpriceindollar_service"
}