{
  "outputs": [
    {
      "name": "_MAXPRICE",
      "type": "http://127.0.0.1/ontology/concept.owl#MaxPrice",
      "desc": "Output of service CDPlayer MaxPrice service"
    }
  ],
  "capability": "atomic",
  "file": "cdplayer_maxprice_service.owls",
  "provider": {
    "type": "webservice"
  },
  "inputs": [
    {
      "name": "_CDPLAYER",
      "type": "http://127.0.0.1/ontology/my_ontology.owl#CDPlayer",
      "desc": "Input of service CDPlayer MaxPrice service"
    }
  ],
  "name": "CDPlayer MaxPrice service",
  "description": "This service returns the max purchase price of a given cd player model.",
  "domains": [
    {
      "name": "Technology",
      "url": "http://www.surf.scss.tcd.ie/cityOntology/#Technology"
    }
  ],
  "id": "technology/cdplayer_maxprice_service",
  "state": true,
  "url": "http://surf.scss.tcd.ie/_provider_/technology/cdplayer_maxprice_service"
}