{
  "outputs": [
    {
      "name": "_DESTINATION",
      "type": "http://127.0.0.1/ontology/travel.owl#Destination",
      "desc": "Output of service SurfingOrganizationDESTINATIONService"
    }
  ],
  "capability": "atomic",
  "file": "surfingorganization_destination_service.owls",
  "provider": {
    "type": "wsdn"
  },
  "inputs": [
    {
      "name": "_ORGANIZATION",
      "type": "http://127.0.0.1/ontology/portal.owl#Organization",
      "desc": "Input of service SurfingOrganizationDESTINATIONService"
    },
    {
      "name": "_SURFING",
      "type": "http://127.0.0.1/ontology/travel.owl#Surfing",
      "desc": "Input of service SurfingOrganizationDESTINATIONService"
    }
  ],
  "name": "SurfingOrganizationDESTINATIONService",
  "description": "This service returns DESTINATION of the organization responsible for providing good surfing activities.",
  "domains": [
    {
      "name": "Travel",
      "url": "http://www.surf.scss.tcd.ie/cityOntology/#Travel"
    }
  ],
  "id": "travel/surfingorganization_destination_service",
  "state": true,
  "url": "http://surf.scss.tcd.ie/_provider_/travel/surfingorganization_destination_service"
}