{
    "capability": "atomic",
    "description": "This service informs the physical-quantity and approximately latest market taxedprice of a given beverage item.",
    "domains": [
        {
            "name": "Food_and_Drinks",
            "url": "http://www.surf.scss.tcd.ie/cityOntology/#Food_and_Drinks"
        }
    ],
    "file": "beverage_taxedpricephysical-quantity_service.owls",
    "id": "education/beverage_taxedpricephysical-quantity_service",
    "inputs": [
        {
            "desc": "Input of service Beverage TaxedPrice Physical-Quantity Service",
            "name": "_BEVERAGE",
            "type": "http://127.0.0.1/ontology/SUMO.owl#Beverage"
        }
    ],
    "name": "Beverage TaxedPrice Physical-Quantity Service",
    "outputs": [
        {
            "desc": "Output of service Beverage TaxedPrice Physical-Quantity Service",
            "name": "_TAXEDPRICE",
            "type": "http://127.0.0.1/ontology/concept.owl#TaxedPrice"
        },
        {
            "desc": "Output of service Beverage TaxedPrice Physical-Quantity Service",
            "name": "_PHYSICAL-QUANTITY",
            "type": "http://127.0.0.1/ontology/support.owl#Physical-Quantity"
        }
    ],
    "provider": {
        "type": "webservice"
    },
    "state": true,
    "url": "http://surf.scss.tcd.ie/_provider_/education/beverage_taxedpricephysical-quantity_service"
}