{
  "outputs": [
    {
      "name": "_USSTATECODE",
      "type": "http://127.0.0.1/ontology/geographydataset.owl#USStateCode",
      "desc": "Output of service US Zip code location finder service."
    },
    {
      "name": "_LATITUDE",
      "type": "http://127.0.0.1/ontology/protont.owl#latitude",
      "desc": "Output of service US Zip code location finder service."
    },
    {
      "name": "_LONGITUDE",
      "type": "http://127.0.0.1/ontology/protont.owl#longitude",
      "desc": "Output of service US Zip code location finder service."
    },
    {
      "name": "_CITY",
      "type": "http://127.0.0.1/ontology/protonu.owl#City",
      "desc": "Output of service US Zip code location finder service."
    }
  ],
  "capability": "atomic",
  "file": "getUSZipCodeLocation.owls",
  "provider": {
    "type": "asp"
  },
  "inputs": [
    {
      "name": "_LICENSEKEY",
      "type": "http://127.0.0.1/ontology/geographydataset.owl#Code",
      "desc": "Input of service US Zip code location finder service."
    },
    {
      "name": "_ZIPCODE",
      "type": "http://127.0.0.1/ontology/geographydataset.owl#US5DigitZipCode",
      "desc": "Input of service US Zip code location finder service."
    }
  ],
  "name": "US Zip code location finder service.",
  "description": "This service returns the coordinates (Latitude/Longitude pair) of the given US zip code together with the US state code and city that the zip is associated with.For using this service valid License Key should be provided.",
  "domains": [
    {
      "name": "Geography",
      "url": "http://www.surf.scss.tcd.ie/cityOntology/#Geography"
    }
  ],
  "id": "geography/us_zipcode_location_service",
  "state": true,
  "url": "http://surf.scss.tcd.ie/_provider_/geography/us_zipcode_location_service"
}