{
  "outputs": [
    {
      "name": "_INVENTORYREPORT",
      "type": "http://www.surf.scss.tcd.ie/IoTservices.owl#inventoryReport",
      "desc": "Output of service inventory_report"
    }
  ],
  "provider": {
    "type": "ws"
  },
  "inputs": [
    {
      "name": "_PRODUCTSSTATUS",
      "type": "http://www.surf.scss.tcd.ie/IoTservices.owl#productsStatus",
      "desc": "Input of service inventory_report"
    }
  ],
  "name": "inventory_report",
  "description": "This is the service inventory_report",
  "domains": [
    {
      "name": "Clothing",
      "url": "http://www.surf.scss.tcd.ie/cityOntology/#Clothing"
    }
  ],
  "id": "clothing/73_inventory_report",
  "state": true,
  "url": "http://surf.scss.tcd.ie/_provider_/clothing/73_inventory_report"
}