{
  "outputs": [
    {
      "name": "_ADDRESS",
      "type": "http://127.0.0.1/ontology/protonu.owl#Address",
      "desc": "Output of service Addrees Finder Service."
    },
    {
      "name": "_CITY",
      "type": "http://127.0.0.1/ontology/protonu.owl#City",
      "desc": "Output of service Addrees Finder Service."
    },
    {
      "name": "_COUNTRY",
      "type": "http://127.0.0.1/ontology/protonu.owl#Country",
      "desc": "Output of service Addrees Finder Service."
    }
  ],
  "capability": "atomic",
  "file": "getAddressOfLocation.owls",
  "provider": {
    "type": "wsdn"
  },
  "inputs": [
    {
      "name": "_USERID",
      "type": "http://127.0.0.1/ontology/geographydataset.owl#UniqueIdentifier",
      "desc": "Input of service Addrees Finder Service."
    },
    {
      "name": "_LATITUDE",
      "type": "http://127.0.0.1/ontology/protont.owl#latitude",
      "desc": "Input of service Addrees Finder Service."
    },
    {
      "name": "_LONGITUDE",
      "type": "http://127.0.0.1/ontology/protont.owl#longitude",
      "desc": "Input of service Addrees Finder Service."
    }
  ],
  "name": "Addrees Finder Service.",
  "description": "This service finds address, including its city and country, of a given location (latitude/longitude pair) worldwide.For using this service valid UserID should be provided.",
  "domains": [
    {
      "name": "Geography",
      "url": "http://www.surf.scss.tcd.ie/cityOntology/#Geography"
    }
  ],
  "id": "geography/location_address_service",
  "state": true,
  "url": "http://surf.scss.tcd.ie/_provider_/geography/location_address_service"
}