{
  "outputs": [
    {
      "name": "_publication",
      "type": "string",
      "desc": "Output of service PublicationSearchingService"
    }
  ],
  "provider": {
    "type": "webservice"
  },
  "inputs": [
    {
      "name": "_isbn",
      "type": "string",
      "desc": "Input of service PublicationSearchingService"
    }
  ],
  "name": "PublicationSearchingService",
  "description": "This service returns a publication on given ISBN.",
  "domains": [
    {
      "name": "Furniture_and_Housing",
      "url": "http://www.surf.scss.tcd.ie/cityOntology/#Furniture_and_Housing"
    }
  ],
  "id": "educational/isbn_publication_service",
  "state": true,
  "url": "http://surf.scss.tcd.ie/_provider_/educational/isbn_publication_service"
}