{
  "outputs": [
    {
      "name": "_HOMEALARM",
      "type": "http://www.surf.scss.tcd.ie/IoTservices.owl#homeAlarm",
      "desc": "Output of service start_home_alarm"
    }
  ],
  "provider": {
    "type": "wsdn"
  },
  "inputs": [
    {
      "name": "_STARTALARM",
      "type": "http://www.surf.scss.tcd.ie/IoTservices.owl#startAlarm",
      "desc": "Input of service start_home_alarm"
    }
  ],
  "name": "start_home_alarm",
  "description": "This is the service start_home_alarm",
  "domains": [
    {
      "name": "Safety_and_Emergencies",
      "url": "http://www.surf.scss.tcd.ie/cityOntology/#Safety_and_Emergencies"
    }
  ],
  "id": "safetyandemergencies/35_start_home_alarm",
  "state": true,
  "url": "http://surf.scss.tcd.ie/_provider_/safetyandemergencies/35_start_home_alarm"
}