{
  "outputs": [
    {
      "name": "_COLA",
      "type": "http://127.0.0.1/ontology/my_ontology.owl#Cola",
      "desc": "Output of service Hallo2 ColaService"
    }
  ],
  "capability": "atomic",
  "file": "price_cola_Hallo2service.owls",
  "provider": {
    "type": "asp"
  },
  "inputs": [
    {
      "name": "_PRICE",
      "type": "http://127.0.0.1/ontology/concept.owl#Price",
      "desc": "Input of service Hallo2 ColaService"
    }
  ],
  "name": "Hallo2 ColaService",
  "description": "Hallo2 service is a refined service to get cola for a given price.",
  "domains": [
    {
      "name": "Food_and_Drinks",
      "url": "http://www.surf.scss.tcd.ie/cityOntology/#Food_and_Drinks"
    }
  ],
  "id": "food/price_cola_Hallo2service",
  "state": true,
  "url": "http://surf.scss.tcd.ie/_provider_/food/price_cola_Hallo2service"
}