{
  "outputs": [
    {
      "name": "_PROFESSION",
      "type": "http://127.0.0.1/ontology/Mid-level-ontology.owl#Profession",
      "desc": "Output of service Municipal-Unit Profession TimeDuration service"
    },
    {
      "name": "_TIMEDURATION",
      "type": "http://127.0.0.1/ontology/SUMO.owl#TimeDuration",
      "desc": "Output of service Municipal-Unit Profession TimeDuration service"
    }
  ],
  "capability": "atomic",
  "file": "municipal-unit_professiontimeduration_service.owls",
  "provider": {
    "type": "webservice"
  },
  "inputs": [
    {
      "name": "_MUNICIPAL-UNIT",
      "type": "http://127.0.0.1/ontology/portal.owl#Municipal-Unit",
      "desc": "Input of service Municipal-Unit Profession TimeDuration service"
    }
  ],
  "name": "Municipal-Unit Profession TimeDuration service",
  "description": "This service returns profession job in a given municipal-unit and its time duration.",
  "domains": [
    {
      "name": "Educational",
      "url": "http://www.surf.scss.tcd.ie/cityOntology/#Educational"
    }
  ],
  "id": "education/municipal-unit_professiontimeduration_service",
  "state": true,
  "url": "http://surf.scss.tcd.ie/_provider_/education/municipal-unit_professiontimeduration_service"
}