{
    "description": "This is the service streets_temperature",
    "domains": [
        {
            "name": "Government_and_Planning",
            "url": "http://www.surf.scss.tcd.ie/cityOntology/#Government_and_Planning"
        }
    ],
    "id": "governmentandplanning/126_streets_temperature",
    "inputs": [
        {
            "desc": "Input of service streets_temperature",
            "name": "_STREETSINFO",
            "type": "http://www.surf.scss.tcd.ie/IoTservices.owl#streetsInfo"
        }
    ],
    "name": "streets_temperature",
    "outputs": [
        {
            "desc": "Output of service streets_temperature",
            "name": "_STREETSTEMPERATURE",
            "type": "http://www.surf.scss.tcd.ie/IoTservices.owl#streetsTemperature"
        }
    ],
    "provider": {
        "type": "wsdn"
    },
    "state": true,
    "url": "http://surf.scss.tcd.ie/_provider_/governmentandplanning/126_streets_temperature"
}