{
  "outputs": [
    {
      "name": "_CD",
      "type": "http://127.0.0.1/ontology/my_ontology.owl#CD",
      "desc": "Output of service CD Price Software Title"
    },
    {
      "name": "_PRICE",
      "type": "http://127.0.0.1/ontology/concept.owl#Price",
      "desc": "Output of service CD Price Software Title"
    },
    {
      "name": "_SOFTWARE",
      "type": "http://127.0.0.1/ontology/univ-bench.owl#Software",
      "desc": "Output of service CD Price Software Title"
    }
  ],
  "capability": "atomic",
  "file": "title_cdpricesoftwareStreaming_service.owls",
  "provider": {
    "type": "asp"
  },
  "inputs": [
    {
      "name": "_TITLE",
      "type": "http://127.0.0.1/ontology/books.owl#Title",
      "desc": "Input of service CD Price Software Title"
    }
  ],
  "name": "CD Price Software Title",
  "description": "Self-service solution for video creation and encoding into streaming format.This service finds a software for a title, it also returns its availability as CD and price.",
  "domains": [
    {
      "name": "Communications",
      "url": "http://www.surf.scss.tcd.ie/cityOntology/#Communications"
    }
  ],
  "id": "communication/title_cdpricesoftware_service",
  "state": true,
  "url": "http://surf.scss.tcd.ie/_provider_/communication/title_cdpricesoftware_service"
}