{
  "outputs": [
    {
      "name": "_CORPORATION",
      "type": "http://127.0.0.1/ontology/finance_th_web.owl#corporation",
      "desc": "Output of service Geographical-Region Corporation OccupationalTrade Service"
    },
    {
      "name": "_OCCUPATIONALTRADE",
      "type": "http://127.0.0.1/ontology/Mid-level-ontology.owl#OccupationalTrade",
      "desc": "Output of service Geographical-Region Corporation OccupationalTrade Service"
    }
  ],
  "capability": "atomic",
  "file": "geographical-region_corporationoccupationaltrade_service.owls",
  "provider": {
    "type": "wsdn"
  },
  "inputs": [
    {
      "name": "_GEOGRAPHICAL-REGION",
      "type": "http://127.0.0.1/ontology/portal.owl#Geographical-Region",
      "desc": "Input of service Geographical-Region Corporation OccupationalTrade Service"
    }
  ],
  "name": "Geographical-Region Corporation OccupationalTrade Service",
  "description": "This service finds occupational trade positions in a given geopolitical regions and also returns corporation who offers that job.",
  "domains": [
    {
      "name": "Educational",
      "url": "http://www.surf.scss.tcd.ie/cityOntology/#Educational"
    }
  ],
  "id": "education/geographical-region_corporationoccupationaltrade_service",
  "state": true,
  "url": "http://surf.scss.tcd.ie/_provider_/education/geographical-region_corporationoccupationaltrade_service"
}