{
  "outputs": [
    {
      "name": "_FUNDING",
      "type": "http://127.0.0.1/ontology/SUMO.owl#Funding",
      "desc": "Output of service GermanGovernment Degree Funding Duration Service"
    },
    {
      "name": "_DURATION",
      "type": "http://127.0.0.1/ontology/support.owl#Duration",
      "desc": "Output of service GermanGovernment Degree Funding Duration Service"
    }
  ],
  "capability": "atomic",
  "file": "degree_fundingduration_GermanGovservice.owls",
  "provider": {
    "type": "asp"
  },
  "inputs": [
    {
      "name": "_DEGREE",
      "type": "http://127.0.0.1/ontology/portal.owl#Degree",
      "desc": "Input of service GermanGovernment Degree Funding Duration Service"
    }
  ],
  "name": "GermanGovernment Degree Funding Duration Service",
  "description": "This service informs about funding offered for the degree by the german government. The funding\u0027s duration is informed as well.",
  "domains": [
    {
      "name": "Educational",
      "url": "http://www.surf.scss.tcd.ie/cityOntology/#Educational"
    }
  ],
  "id": "education/degree_fundingduration_service",
  "state": true,
  "url": "http://surf.scss.tcd.ie/_provider_/education/degree_fundingduration_service"
}