{
  "outputs": [
    {
      "name": "_TOURISTICPATH",
      "type": "http://www.surf.scss.tcd.ie/IoTservices.owl#touristicPath",
      "desc": "Output of service touristic_path_calculator"
    }
  ],
  "provider": {
    "type": "ws"
  },
  "inputs": [
    {
      "name": "_ACTIVITYINFO",
      "type": "http://www.surf.scss.tcd.ie/IoTservices.owl#activityInfo",
      "desc": "Input of service touristic_path_calculator"
    }
  ],
  "name": "touristic_path_calculator",
  "description": "This is the service touristic_path_calculator",
  "domains": [
    {
      "name": "Activity",
      "url": "http://www.surf.scss.tcd.ie/cityOntology/#Activity"
    },
    {
      "name": "Travel",
      "url": "http://www.surf.scss.tcd.ie/cityOntology/#Travel"
    },
    {
      "name": "Geography",
      "url": "http://www.surf.scss.tcd.ie/cityOntology/#Geography"
    }
  ],
  "id": "travel/75_touristic_path_calculator",
  "state": true,
  "url": "http://surf.scss.tcd.ie/_provider_/travel/75_touristic_path_calculator"
}