{
  "outputs": [
    {
      "name": "_PHYSICAL-QUANTITY",
      "type": "http://127.0.0.1/ontology/support.owl#Physical-Quantity",
      "desc": "Output of service NationalGovernement offers Service"
    },
    {
      "name": "_SCHOLARSHIP",
      "type": "http://127.0.0.1/ontology/Mid-level-ontology.owl#Scholarship",
      "desc": "Output of service NationalGovernement offers Service"
    },
    {
      "name": "_LANDAREA",
      "type": "http://127.0.0.1/ontology/SUMO.owl#LandArea",
      "desc": "Output of service NationalGovernement offers Service"
    }
  ],
  "capability": "atomic",
  "file": "nationalgovernment_physical-quantityscholarshiplandarea_service.owls",
  "provider": {
    "type": "asp"
  },
  "inputs": [
    {
      "name": "_NATIONALGOVERNMENT",
      "type": "http://127.0.0.1/ontology/Mid-level-ontology.owl#NationalGovernment",
      "desc": "Input of service NationalGovernement offers Service"
    }
  ],
  "name": "NationalGovernement offers Service",
  "description": "This service returns the offered scholarship, specially for high level education, from the given national government,and also phaysical quantity which describes the area of its land.",
  "domains": [
    {
      "name": "Educational",
      "url": "http://www.surf.scss.tcd.ie/cityOntology/#Educational"
    }
  ],
  "id": "education/nationalgovernment_physical-quantityscholarshiplandarea_service",
  "state": true,
  "url": "http://surf.scss.tcd.ie/_provider_/education/nationalgovernment_physical-quantityscholarshiplandarea_service"
}