{
  "outputs": [
    {
      "name": "_CITY",
      "type": "http://127.0.0.1/ontology/travel.owl#City",
      "desc": "Output of service SFCityService"
    }
  ],
  "capability": "atomic",
  "file": "surfinghiking_city_SFservice.owls",
  "provider": {
    "type": "webservice"
  },
  "inputs": [
    {
      "name": "_SURFING",
      "type": "http://127.0.0.1/ontology/travel.owl#Surfing",
      "desc": "Input of service SFCityService"
    },
    {
      "name": "_HIKING",
      "type": "http://127.0.0.1/ontology/travel.owl#Hiking",
      "desc": "Input of service SFCityService"
    }
  ],
  "name": "SFCityService",
  "description": "A pioneer service to know about the cities which provide both sports hiking and surfing activities.",
  "domains": [
    {
      "name": "Travel",
      "url": "http://www.surf.scss.tcd.ie/cityOntology/#Travel"
    },
    {
      "name": "Activity",
      "url": "http://www.surf.scss.tcd.ie/cityOntology/#Activity"
    }
  ],
  "id": "activity/surfinghiking_city_SFservice",
  "state": true,
  "url": "http://surf.scss.tcd.ie/_provider_/activity/surfinghiking_city_SFservice"
}