{
    "capability": "atomic",
    "description": "This service returns available jobs in some profession in a given geopolitical-entity.",
    "domains": [
        {
            "name": "Industry",
            "url": "http://www.surf.scss.tcd.ie/cityOntology/#Industry"
        }
    ],
    "file": "geopolitical-entity_profession_service.owls",
    "id": "education/geopolitical-entity_profession_service",
    "inputs": [
        {
            "desc": "Input of service Geopolitical-Entity Profession service",
            "name": "_GEOPOLITICAL-ENTITY",
            "type": "http://127.0.0.1/ontology/portal.owl#Geopolitical-Entity"
        }
    ],
    "name": "Geopolitical-Entity Profession service",
    "outputs": [
        {
            "desc": "Output of service Geopolitical-Entity Profession service",
            "name": "_PROFESSION",
            "type": "http://127.0.0.1/ontology/Mid-level-ontology.owl#Profession"
        }
    ],
    "provider": {
        "type": "webservice"
    },
    "state": true,
    "url": "http://surf.scss.tcd.ie/_provider_/education/geopolitical-entity_profession_service"
}