{
  "outputs": [
    {
      "name": "_OCCUPATIONALTRADE",
      "type": "http://127.0.0.1/ontology/Mid-level-ontology.owl#OccupationalTrade",
      "desc": "Output of service Geopolitical-Entity OccupationalTrade FullTimePosition Service"
    },
    {
      "name": "_FULLTIMEPOSITION",
      "type": "http://127.0.0.1/ontology/Mid-level-ontology.owl#FullTimePosition",
      "desc": "Output of service Geopolitical-Entity OccupationalTrade FullTimePosition Service"
    }
  ],
  "capability": "atomic",
  "file": "geopolitical-entity_occupationaltradefulltimeposition_service.owls",
  "provider": {
    "type": "wsdn"
  },
  "inputs": [
    {
      "name": "_GEOPOLITICAL-ENTITY",
      "type": "http://127.0.0.1/ontology/portal.owl#Geopolitical-Entity",
      "desc": "Input of service Geopolitical-Entity OccupationalTrade FullTimePosition Service"
    }
  ],
  "name": "Geopolitical-Entity OccupationalTrade FullTimePosition Service",
  "description": "This service returns full time positions offering for occupationaltrades in a given geopolitical-entity.",
  "domains": [
    {
      "name": "Educational",
      "url": "http://www.surf.scss.tcd.ie/cityOntology/#Educational"
    }
  ],
  "id": "education/geopolitical-entity_occupationaltradefulltimeposition_service",
  "state": true,
  "url": "http://surf.scss.tcd.ie/_provider_/education/geopolitical-entity_occupationaltradefulltimeposition_service"
}