{
    "capability": "atomic",
    "description": "This service returns latitude and longitude location of a given US or Canadian address, with its city and state. If the address is not found, an error is returned.",
    "domains": [
        {
            "name": "Travel",
            "url": "http://www.surf.scss.tcd.ie/cityOntology/#Travel"
        }
    ],
    "file": "getLocationOfAddress.owls",
    "id": "geography/address_location_service",
    "inputs": [
        {
            "desc": "Input of service Address location finder service.",
            "name": "_ADDRESS",
            "type": "http://127.0.0.1/ontology/protonu.owl#Address"
        },
        {
            "desc": "Input of service Address location finder service.",
            "name": "_CITY",
            "type": "http://127.0.0.1/ontology/protonu.owl#City"
        },
        {
            "desc": "Input of service Address location finder service.",
            "name": "_STATE",
            "type": "http://127.0.0.1/ontology/protonu.owl#State"
        }
    ],
    "name": "Address location finder service.",
    "outputs": [
        {
            "desc": "Output of service Address location finder service.",
            "name": "_LATITUDE",
            "type": "http://127.0.0.1/ontology/protont.owl#latitude"
        },
        {
            "desc": "Output of service Address location finder service.",
            "name": "_LONGITUDE",
            "type": "http://127.0.0.1/ontology/protont.owl#longitude"
        }
    ],
    "provider": {
        "type": "webservice"
    },
    "state": true,
    "url": "http://surf.scss.tcd.ie/_provider_/geography/address_location_service"
}