{
  "outputs": [
    {
      "name": "_FILM",
      "type": "http://127.0.0.1/ontology/my_ontology.owl#Film",
      "desc": "Output of service Title Film MaxPrice Quality service"
    },
    {
      "name": "_MAXPRICE",
      "type": "http://127.0.0.1/ontology/concept.owl#MaxPrice",
      "desc": "Output of service Title Film MaxPrice Quality service"
    },
    {
      "name": "_QUALITY",
      "type": "http://127.0.0.1/ontology/finance_th_web.owl#quality",
      "desc": "Output of service Title Film MaxPrice Quality service"
    }
  ],
  "capability": "atomic",
  "file": "title_filmmaxpricequality_service.owls",
  "provider": {
    "type": "wsdn"
  },
  "inputs": [
    {
      "name": "_TITLE",
      "type": "http://127.0.0.1/ontology/books.owl#Title",
      "desc": "Input of service Title Film MaxPrice Quality service"
    }
  ],
  "name": "Title Film MaxPrice Quality service",
  "description": "This service searches films for the given title, and also returnsits max price and quality.",
  "domains": [
    {
      "name": "Communications",
      "url": "http://www.surf.scss.tcd.ie/cityOntology/#Communications"
    }
  ],
  "id": "communication/title_filmmaxpricequality_service",
  "state": true,
  "url": "http://surf.scss.tcd.ie/_provider_/communication/title_filmmaxpricequality_service"
}