{
  "outputs": [
    {
      "name": "_urbanarea",
      "type": "string",
      "desc": "Output of service Activity UrbanArea Service"
    }
  ],
  "provider": {
    "type": "wsdn"
  },
  "inputs": [
    {
      "name": "_activity",
      "type": "string",
      "desc": "Input of service Activity UrbanArea Service"
    }
  ],
  "name": "Activity UrbanArea Service",
  "description": "This service returns urbanarea for a given activity.",
  "domains": [
    {
      "name": "Furniture_and_Housing",
      "url": "http://www.surf.scss.tcd.ie/cityOntology/#Furniture_and_Housing"
    }
  ],
  "id": "tourism/activity_urbanarea_service",
  "state": true,
  "url": "http://surf.scss.tcd.ie/_provider_/tourism/activity_urbanarea_service"
}