{
  "outputs": [
    {
      "name": "_icon",
      "type": "string",
      "desc": "Output of service LocationTravelInfo Service"
    }
  ],
  "provider": {
    "type": "webservice"
  },
  "inputs": [
    {
      "name": "_location",
      "type": "string",
      "desc": "Input of service LocationTravelInfo Service"
    }
  ],
  "name": "LocationTravelInfo Service",
  "description": "This service returns a set of icons reprsent roadway signs in the given location, andalso photographs of the location.",
  "domains": [
    {
      "name": "Touristic_Place",
      "url": "http://www.surf.scss.tcd.ie/cityOntology/#Touristic_Place"
    }
  ],
  "id": "mobility/location_icon_service",
  "state": true,
  "url": "http://surf.scss.tcd.ie/_provider_/mobility/location_icon_service"
}