{
  "outputs": [
    {
      "name": "_MAXPRICE",
      "type": "http://127.0.0.1/ontology/concept.owl#MaxPrice",
      "desc": "Output of service CheapCar 2PersonBicycle MaxPrice service"
    }
  ],
  "capability": "atomic",
  "file": "cheapcar2personbicycle_maxprice_service.owls",
  "provider": {
    "type": "webservice"
  },
  "inputs": [
    {
      "name": "_2PERSONBICYCLE",
      "type": "http://127.0.0.1/ontology/my_ontology.owl#TwoPersonBicycle",
      "desc": "Input of service CheapCar 2PersonBicycle MaxPrice service"
    },
    {
      "name": "_CHEAPCAR",
      "type": "http://127.0.0.1/ontology/my_ontology.owl#CheapCar",
      "desc": "Input of service CheapCar 2PersonBicycle MaxPrice service"
    }
  ],
  "name": "CheapCar 2PersonBicycle MaxPrice service",
  "description": "This service returns max purchase prices of the given pair of a cheap car model and two person bicycle model.",
  "domains": [
    {
      "name": "Vehicle_Sale_and_Rent",
      "url": "http://www.surf.scss.tcd.ie/cityOntology/#Vehicle_Sale_and_Rent"
    }
  ],
  "id": "vehicle/cheapcar2personbicycle_maxprice_service",
  "state": true,
  "url": "http://surf.scss.tcd.ie/_provider_/vehicle/cheapcar2personbicycle_maxprice_service"
}