{
  "outputs": [
    {
      "name": "_PRICE",
      "type": "http://127.0.0.1/ontology/concept.owl#Price",
      "desc": "Output of service MicrowaveOven Price service"
    }
  ],
  "capability": "atomic",
  "file": "microwaveoven_price_service.owls",
  "provider": {
    "type": "asp"
  },
  "inputs": [
    {
      "name": "_MICROWAVEOVEN",
      "type": "http://127.0.0.1/ontology/my_ontology.owl#MicrowaveOven",
      "desc": "Input of service MicrowaveOven Price service"
    }
  ],
  "name": "MicrowaveOven Price service",
  "description": "This service returns purchase prices on the market of a given microwave oven brand.",
  "domains": [
    {
      "name": "Technology",
      "url": "http://www.surf.scss.tcd.ie/cityOntology/#Technology"
    }
  ],
  "id": "technology/microwaveoven_price_service",
  "state": true,
  "url": "http://surf.scss.tcd.ie/_provider_/technology/microwaveoven_price_service"
}