{
  "outputs": [
    {
      "name": "_FINANCING",
      "type": "http://127.0.0.1/ontology/Mid-level-ontology.owl#Financing",
      "desc": "Output of service GovernmentOrganization Missile Financing Range Service"
    },
    {
      "name": "_RANGE",
      "type": "http://127.0.0.1/ontology/extendedCamera.owl#Range",
      "desc": "Output of service GovernmentOrganization Missile Financing Range Service"
    }
  ],
  "capability": "atomic",
  "file": "missilegovernmentorganization_financingrange_service.owls",
  "provider": {
    "type": "asp"
  },
  "inputs": [
    {
      "name": "_GOVERNMENTORGANIZATION",
      "type": "http://127.0.0.1/ontology/SUMO.owl#GovernmentOrganization",
      "desc": "Input of service GovernmentOrganization Missile Financing Range Service"
    },
    {
      "name": "_MISSILE",
      "type": "http://127.0.0.1/ontology/Mid-level-ontology.owl#Missile",
      "desc": "Input of service GovernmentOrganization Missile Financing Range Service"
    }
  ],
  "name": "GovernmentOrganization Missile Financing Range Service",
  "description": "This service informs you financing for the Missile provided by the government organization, and target range of the missile.",
  "domains": [
    {
      "name": "Defense",
      "url": "http://www.surf.scss.tcd.ie/cityOntology/#Defense"
    }
  ],
  "id": "defense/missilegovernmentorganization_financingrange_service",
  "state": true,
  "url": "http://surf.scss.tcd.ie/_provider_/defense/missilegovernmentorganization_financingrange_service"
}