{
  "outputs": [
    {
      "name": "_PROFESSION",
      "type": "http://127.0.0.1/ontology/Mid-level-ontology.owl#Profession",
      "desc": "Output of service ProfessionIncomeTax"
    },
    {
      "name": "_INCOMETAX",
      "type": "http://127.0.0.1/ontology/Mid-level-ontology.owl#IncomeTax",
      "desc": "Output of service ProfessionIncomeTax"
    }
  ],
  "capability": "atomic",
  "file": "country_professionincometax_service.owls",
  "provider": {
    "type": "wsdn"
  },
  "inputs": [
    {
      "name": "_COUNTRY",
      "type": "http://127.0.0.1/ontology/portal.owl#Country",
      "desc": "Input of service ProfessionIncomeTax"
    }
  ],
  "name": "ProfessionIncomeTax",
  "description": "This service returns set income tax on the certain profession in a given country.",
  "domains": [
    {
      "name": "Industry",
      "url": "http://www.surf.scss.tcd.ie/cityOntology/#Industry"
    }
  ],
  "id": "industry/country_professionincometax_service",
  "state": true,
  "url": "http://surf.scss.tcd.ie/_provider_/industry/country_professionincometax_service"
}