{
  "outputs": [
    {
      "name": "_DISTANCE",
      "type": "http://127.0.0.1/ontology/geographydataset.owl#GeographicDistance",
      "desc": "Output of service Distance finder between two postal codes"
    }
  ],
  "capability": "atomic",
  "file": "usPostalCode_distance.owls",
  "provider": {
    "type": "asp"
  },
  "inputs": [
    {
      "name": "_USPOSTALCODE1",
      "type": "http://127.0.0.1/ontology/geographydataset.owl#USPostalCode",
      "desc": "Input of service Distance finder between two postal codes"
    },
    {
      "name": "_USPOSTALCODE2",
      "type": "http://127.0.0.1/ontology/geographydataset.owl#USPostalCode",
      "desc": "Input of service Distance finder between two postal codes"
    }
  ],
  "name": "Distance finder between two postal codes",
  "description": "This service retrieves the distance in miles between two given US postal codes. The distance is a straight line.",
  "domains": [
    {
      "name": "Geography",
      "url": "http://www.surf.scss.tcd.ie/cityOntology/#Geography"
    },
    {
      "name": "Travel",
      "url": "http://www.surf.scss.tcd.ie/cityOntology/#Travel"
    }
  ],
  "id": "travel/usPostalCode_distance",
  "state": true,
  "url": "http://surf.scss.tcd.ie/_provider_/travel/usPostalCode_distance"
}