{
  "outputs": [
    {
      "name": "_RECOMMENDEDPRICE",
      "type": "http://127.0.0.1/ontology/concept.owl#RecommendedPrice",
      "desc": "Output of service Car Price service"
    }
  ],
  "capability": "atomic",
  "file": "amount-of-money4wheeledcar_recommendedprice_service.owls",
  "provider": {
    "type": "wsdn"
  },
  "inputs": [
    {
      "name": "_4WHEELEDCAR",
      "type": "http://127.0.0.1/ontology/my_ontology.owl#FourWheeledCar",
      "desc": "Input of service Car Price service"
    },
    {
      "name": "_AMOUNT-OF-MONEY",
      "type": "http://127.0.0.1/ontology/portal.owl#Amount-Of-Money",
      "desc": "Input of service Car Price service"
    }
  ],
  "name": "Car Price service",
  "description": "This service tries to find the recommended purchase price of a brand new four wheeled car model within given amount of money.",
  "id": "economy/amount-of-money4wheeledcar_recommendedprice_service",
  "state": true,
  "url": "http://surf.scss.tcd.ie/_provider_/economy/amount-of-money4wheeledcar_recommendedprice_service"
}