{
  "outputs": [
    {
      "name": "_hotel",
      "type": "string",
      "desc": "Output of service CountryHotelService"
    }
  ],
  "provider": {
    "type": "wsdn"
  },
  "inputs": [
    {
      "name": "_country",
      "type": "string",
      "desc": "Input of service CountryHotelService"
    }
  ],
  "name": "CountryHotelService",
  "description": "This service is a favourite service that returns hotel info of the given country.",
  "domains": [
    {
      "name": "Beauty_Products",
      "url": "http://www.surf.scss.tcd.ie/cityOntology/#Beauty_Products"
    }
  ],
  "id": "tourism/country_hotel_service",
  "state": true,
  "url": "http://surf.scss.tcd.ie/_provider_/tourism/country_hotel_service"
}