{
  "outputs": [
    {
      "name": "_RECOMMENDEDPRICE",
      "type": "http://127.0.0.1/ontology/concept.owl#RecommendedPrice",
      "desc": "Output of service SFNovelReview Service"
    },
    {
      "name": "_REVIEW",
      "type": "http://127.0.0.1/ontology/books.owl#Review",
      "desc": "Output of service SFNovelReview Service"
    }
  ],
  "capability": "atomic",
  "file": "ScienceFNovelReview_service.owls",
  "provider": {
    "type": "asp"
  },
  "inputs": [
    {
      "name": "_SCIENCE-FICTION-NOVEL",
      "type": "http://127.0.0.1/ontology/books.owl#Science-Fiction-Novel",
      "desc": "Input of service SFNovelReview Service"
    },
    {
      "name": "_USER",
      "type": "http://127.0.0.1/ontology/books.owl#User",
      "desc": "Input of service SFNovelReview Service"
    }
  ],
  "name": "SFNovelReview Service",
  "description": "The main focus of this service is to return the review on a science-fictionnovel for an authorized user, also the recommended price (it may be not represent the current price of the novel.)",
  "domains": [
    {
      "name": "Entertainment_Products",
      "url": "http://www.surf.scss.tcd.ie/cityOntology/#Entertainment_Products"
    }
  ],
  "id": "books/userscience-fiction-novel_recommendedpricereview_service",
  "state": true,
  "url": "http://surf.scss.tcd.ie/_provider_/books/userscience-fiction-novel_recommendedpricereview_service"
}