{
  "outputs": [
    {
      "name": "_FUNDING",
      "type": "http://127.0.0.1/ontology/SUMO.owl#Funding",
      "desc": "Output of service GovOrgMissileFundingService"
    }
  ],
  "capability": "atomic",
  "file": "missilegovernmentorganization_funding_service.owls",
  "provider": {
    "type": "asp"
  },
  "inputs": [
    {
      "name": "_GOVERNMENTORGANIZATION",
      "type": "http://127.0.0.1/ontology/SUMO.owl#GovernmentOrganization",
      "desc": "Input of service GovOrgMissileFundingService"
    },
    {
      "name": "_MISSILE",
      "type": "http://127.0.0.1/ontology/Mid-level-ontology.owl#Missile",
      "desc": "Input of service GovOrgMissileFundingService"
    }
  ],
  "name": "GovOrgMissileFundingService",
  "description": "This service returns the funding provided for the missile by the given government organization.",
  "domains": [
    {
      "name": "Defense",
      "url": "http://www.surf.scss.tcd.ie/cityOntology/#Defense"
    }
  ],
  "id": "defense/missilegovernmentorganization_funding_service",
  "state": true,
  "url": "http://surf.scss.tcd.ie/_provider_/defense/missilegovernmentorganization_funding_service"
}