{
  "outputs": [
    {
      "name": "_FARMLAND",
      "type": "http://127.0.0.1/ontology/travel.owl#Farmland",
      "desc": "Output of service SurfingFarmlandService"
    }
  ],
  "capability": "atomic",
  "file": "surfing_farmland_service.owls",
  "provider": {
    "type": "webservice"
  },
  "inputs": [
    {
      "name": "_SURFING",
      "type": "http://127.0.0.1/ontology/travel.owl#Surfing",
      "desc": "Input of service SurfingFarmlandService"
    }
  ],
  "name": "SurfingFarmlandService",
  "description": "This is the recommended service to know aboutthe farmland for surfing activities.",
  "domains": [
    {
      "name": "Travel",
      "url": "http://www.surf.scss.tcd.ie/cityOntology/#Travel"
    }
  ],
  "id": "travel/surfing_farmland_service",
  "state": true,
  "url": "http://surf.scss.tcd.ie/_provider_/travel/surfing_farmland_service"
}