{
  "outputs": [
    {
      "name": "_WEATHERFRONT",
      "type": "http://127.0.0.1/ontology/Mid-level-ontology.owl#WeatherFront",
      "desc": "Output of service Municipal-Unit WeatherFront Service"
    }
  ],
  "capability": "atomic",
  "file": "municipal-unit_weatherfront_service.owls",
  "provider": {
    "type": "wsdn"
  },
  "inputs": [
    {
      "name": "_MUNICIPAL-UNIT",
      "type": "http://127.0.0.1/ontology/portal.owl#Municipal-Unit",
      "desc": "Input of service Municipal-Unit WeatherFront Service"
    }
  ],
  "name": "Municipal-Unit WeatherFront Service",
  "description": "This service informs about weatherfront in a given municipal-unit.",
  "domains": [
    {
      "name": "Travel",
      "url": "http://www.surf.scss.tcd.ie/cityOntology/#Travel"
    },
    {
      "name": "Geography",
      "url": "http://www.surf.scss.tcd.ie/cityOntology/#Geography"
    }
  ],
  "id": "travel/municipal-unit_weatherfront_service",
  "state": true,
  "url": "http://surf.scss.tcd.ie/_provider_/travel/municipal-unit_weatherfront_service"
}