{
  "outputs": [
    {
      "name": "_MAXPRICE",
      "type": "http://127.0.0.1/ontology/concept.owl#MaxPrice",
      "desc": "Output of service Coffee MaxPrice Service"
    }
  ],
  "capability": "atomic",
  "file": "coffee_maxprice_service.owls",
  "provider": {
    "type": "asp"
  },
  "inputs": [
    {
      "name": "_COFFEE",
      "type": "http://127.0.0.1/ontology/Mid-level-ontology.owl#Coffee",
      "desc": "Input of service Coffee MaxPrice Service"
    }
  ],
  "name": "Coffee MaxPrice Service",
  "description": "This service returns market purchase max price of coffee type. The price is for 1Kg of coffee.",
  "domains": [
    {
      "name": "Food_and_Drinks",
      "url": "http://www.surf.scss.tcd.ie/cityOntology/#Food_and_Drinks"
    }
  ],
  "id": "food/coffee_maxprice_service",
  "state": true,
  "url": "http://surf.scss.tcd.ie/_provider_/food/coffee_maxprice_service"
}