{
  "outputs": [
    {
      "name": "_WHISKEY",
      "type": "http://127.0.0.1/ontology/my_ontology.owl#Whiskey",
      "desc": "Output of service USWhiskeyCoffee Service"
    },
    {
      "name": "_COFFEE",
      "type": "http://127.0.0.1/ontology/my_ontology.owl#Coffee",
      "desc": "Output of service USWhiskeyCoffee Service"
    }
  ],
  "capability": "atomic",
  "file": "recommendedpriceindollar_whiskeycoffee_service.owls",
  "provider": {
    "type": "wsdn"
  },
  "inputs": [
    {
      "name": "_RECOMMENDEDPRICEINDOLLAR",
      "type": "http://127.0.0.1/ontology/concept.owl#RecommendedPriceInDollar",
      "desc": "Input of service USWhiskeyCoffee Service"
    }
  ],
  "name": "USWhiskeyCoffee Service",
  "description": "USWhiskeyCoffee service returns a coffee and a whiskey for the given recommended price.",
  "domains": [
    {
      "name": "Food_and_Drinks",
      "url": "http://www.surf.scss.tcd.ie/cityOntology/#Food_and_Drinks"
    }
  ],
  "id": "food/recommendedpriceindollar_whiskeycoffee_service",
  "state": true,
  "url": "http://surf.scss.tcd.ie/_provider_/food/recommendedpriceindollar_whiskeycoffee_service"
}