{
    "capability": "atomic",
    "description": "This service returns home or office address of a given person's first and last name.",
    "domains": [
        {
            "name": "Educational",
            "url": "http://www.surf.scss.tcd.ie/cityOntology/#Educational"
        }
    ],
    "file": "person_address_service.owls",
    "id": "education/person_address_service",
    "inputs": [
        {
            "desc": "Input of service Person address  service",
            "name": "_PERSON",
            "type": "http://127.0.0.1/ontology/portal.owl#Person"
        }
    ],
    "name": "Person address  service",
    "outputs": [
        {
            "desc": "Output of service Person address  service",
            "name": "_ADDRESS",
            "type": "http://127.0.0.1/ontology/portal.owl#Address"
        }
    ],
    "provider": {
        "type": "webservice"
    },
    "state": true,
    "url": "http://surf.scss.tcd.ie/_provider_/education/person_address_service"
}