{
  "outputs": [
    {
      "name": "_MAXPRICE",
      "type": "http://127.0.0.1/ontology/concept.owl#MaxPrice",
      "desc": "Output of service Sandwich MaxPrice Service"
    }
  ],
  "capability": "atomic",
  "file": "sandwich_maxprice_service.owls",
  "provider": {
    "type": "asp"
  },
  "inputs": [
    {
      "name": "_SANDWICH",
      "type": "http://127.0.0.1/ontology/Mid-level-ontology.owl#Sandwich",
      "desc": "Input of service Sandwich MaxPrice Service"
    }
  ],
  "name": "Sandwich MaxPrice Service",
  "description": "This service returns current market purchase max price of given sandwich type.",
  "domains": [
    {
      "name": "Food_and_Drinks",
      "url": "http://www.surf.scss.tcd.ie/cityOntology/#Food_and_Drinks"
    }
  ],
  "id": "food/sandwich_maxprice_service",
  "state": true,
  "url": "http://surf.scss.tcd.ie/_provider_/food/sandwich_maxprice_service"
}