{
  "outputs": [
    {
      "name": "_STREETSTEMPERATURE",
      "type": "http://www.surf.scss.tcd.ie/IoTservices.owl#streetsTemperature",
      "desc": "Output of service streets_temperature"
    }
  ],
  "provider": {
    "type": "wsdn"
  },
  "inputs": [
    {
      "name": "_STREETSINFO",
      "type": "http://www.surf.scss.tcd.ie/IoTservices.owl#streetsInfo",
      "desc": "Input of service streets_temperature"
    }
  ],
  "name": "streets_temperature",
  "description": "This is the service streets_temperature",
  "domains": [
    {
      "name": "Government_and_Planning",
      "url": "http://www.surf.scss.tcd.ie/cityOntology/#Government_and_Planning"
    },
    {
      "name": "Nature",
      "url": "http://www.surf.scss.tcd.ie/cityOntology/#Nature"
    }
  ],
  "id": "governmentandplanning/126_streets_temperature",
  "state": true,
  "url": "http://surf.scss.tcd.ie/_provider_/governmentandplanning/126_streets_temperature"
}