{
  "outputs": [
    {
      "name": "_RECOMMENDEDPRICEINEURO",
      "type": "http://127.0.0.1/ontology/concept.owl#RecommendedPriceInEuro",
      "desc": "Output of service BreadBiscuitPriceService"
    },
    {
      "name": "_TAXEDPRICEINEURO",
      "type": "http://127.0.0.1/ontology/concept.owl#TaxedPriceInEuro",
      "desc": "Output of service BreadBiscuitPriceService"
    }
  ],
  "capability": "atomic",
  "file": "breadorbiscuit_recPricetaxedpriceineuro_service.owls",
  "provider": {
    "type": "wsdn"
  },
  "inputs": [
    {
      "name": "_BREADORBISCUIT",
      "type": "http://127.0.0.1/ontology/Mid-level-ontology.owl#BreadOrBiscuit",
      "desc": "Input of service BreadBiscuitPriceService"
    }
  ],
  "name": "BreadBiscuitPriceService",
  "description": "This service returns recommended price and tax price (in euros) of certain bread or biscuit..",
  "domains": [
    {
      "name": "Food_and_Drinks",
      "url": "http://www.surf.scss.tcd.ie/cityOntology/#Food_and_Drinks"
    }
  ],
  "id": "food/breadorbiscuit_recPricetaxedpriceineuro_service",
  "state": true,
  "url": "http://surf.scss.tcd.ie/_provider_/food/breadorbiscuit_recPricetaxedpriceineuro_service"
}