{
  "outputs": [
    {
      "name": "_AUGMENTEDREALITYRESOURCE",
      "type": "http://www.surf.scss.tcd.ie/IoTservices.owl#augmentedRealityResource",
      "desc": "Output of service search_augmented_reality_resource"
    }
  ],
  "provider": {
    "type": "ws"
  },
  "inputs": [
    {
      "name": "_RESOURCEPARAMETERS",
      "type": "http://www.surf.scss.tcd.ie/IoTservices.owl#resourceParameters",
      "desc": "Input of service search_augmented_reality_resource"
    }
  ],
  "name": "search_augmented_reality_resource",
  "description": "This is the service search_augmented_reality_resource",
  "domains": [
    {
      "name": "Educational",
      "url": "http://www.surf.scss.tcd.ie/cityOntology/#Educational"
    }
  ],
  "id": "education/61_search_augmented_reality_resource",
  "state": true,
  "url": "http://surf.scss.tcd.ie/_provider_/education/61_search_augmented_reality_resource"
}