{
    "capability": "atomic",
    "description": "This service returns the unliteral giving money that is given by the government organization for given missiles types.",
    "domains": [
        {
            "name": "Government_and_Planning",
            "url": "http://www.surf.scss.tcd.ie/cityOntology/#Government_and_Planning"
        }
    ],
    "file": "governmentorganizationmissile_unilateralgiving_service.owls",
    "id": "weapon/governmentorganizationmissile_unilateralgiving_service",
    "inputs": [
        {
            "desc": "Input of service GovOrgMissilesUniliteralGivingService",
            "name": "_MISSILE",
            "type": "http://127.0.0.1/ontology/Mid-level-ontology.owl#Missile"
        },
        {
            "desc": "Input of service GovOrgMissilesUniliteralGivingService",
            "name": "_GOVERNMENTORGANIZATION",
            "type": "http://127.0.0.1/ontology/SUMO.owl#GovernmentOrganization"
        }
    ],
    "name": "GovOrgMissilesUniliteralGivingService",
    "outputs": [
        {
            "desc": "Output of service GovOrgMissilesUniliteralGivingService",
            "name": "_UNILATERALGIVING",
            "type": "http://127.0.0.1/ontology/SUMO.owl#UnilateralGiving"
        }
    ],
    "provider": {
        "type": "webservice"
    },
    "state": true,
    "url": "http://surf.scss.tcd.ie/_provider_/weapon/governmentorganizationmissile_unilateralgiving_service"
}