{
  "outputs": [
    {
      "name": "_PRICE",
      "type": "http://127.0.0.1/ontology/concept.owl#Price",
      "desc": "Output of service 3Wheeled Car price service"
    }
  ],
  "capability": "atomic",
  "file": "3wheeledcar_price_service.owls",
  "provider": {
    "type": "wsdn"
  },
  "inputs": [
    {
      "name": "_3WHEELEDCAR",
      "type": "http://127.0.0.1/ontology/my_ontology.owl#ThreeWheeledCar",
      "desc": "Input of service 3Wheeled Car price service"
    }
  ],
  "name": "3Wheeled Car price service",
  "description": "With this service you can inquire a price of a 3(three) Wheeled car brand/model.",
  "id": "economy/3wheeledcar_price_service",
  "state": true,
  "url": "http://surf.scss.tcd.ie/_provider_/economy/3wheeledcar_price_service"
}