{
  "outputs": [
    {
      "name": "_farmland",
      "type": "string",
      "desc": "Output of service SurfingFarmlandService"
    }
  ],
  "provider": {
    "type": "wsdn"
  },
  "inputs": [
    {
      "name": "_surfing",
      "type": "string",
      "desc": "Input of service SurfingFarmlandService"
    }
  ],
  "name": "SurfingFarmlandService",
  "description": "This is the recommended service to know aboutthe farmland for surfing.",
  "domains": [
    {
      "name": "History",
      "url": "http://www.surf.scss.tcd.ie/cityOntology/#History"
    }
  ],
  "id": "tourism/surfing_farmland_service",
  "state": true,
  "url": "http://surf.scss.tcd.ie/_provider_/tourism/surfing_farmland_service"
}