{
  "outputs": [
    {
      "name": "_EVENTVISUALISATION",
      "type": "http://www.surf.scss.tcd.ie/IoTservices.owl#eventVisualisation",
      "desc": "Output of service sport_event_dashboard"
    }
  ],
  "provider": {
    "type": "asp"
  },
  "inputs": [
    {
      "name": "_TRANSPORTINFO",
      "type": "http://www.surf.scss.tcd.ie/IoTservices.owl#transportInfo",
      "desc": "Input of service sport_event_dashboard"
    },
    {
      "name": "_STADIUMMAP",
      "type": "http://www.surf.scss.tcd.ie/IoTservices.owl#stadiumMap",
      "desc": "Input of service sport_event_dashboard"
    },
    {
      "name": "_SIMILARRESULTS",
      "type": "http://www.surf.scss.tcd.ie/IoTservices.owl#similarResults",
      "desc": "Input of service sport_event_dashboard"
    }
  ],
  "name": "sport_event_dashboard",
  "description": "This is the service sport_event_dashboard",
  "domains": [
    {
      "name": "Sport",
      "url": "http://www.surf.scss.tcd.ie/cityOntology/#Sport"
    },
    {
      "name": "Activity",
      "url": "http://www.surf.scss.tcd.ie/cityOntology/#Activity"
    },
    {
      "name": "Leisure",
      "url": "http://www.surf.scss.tcd.ie/cityOntology/#Leisure"
    }
  ],
  "id": "sport/123_sport_event_dashboard",
  "state": true,
  "url": "http://surf.scss.tcd.ie/_provider_/sport/123_sport_event_dashboard"
}