{
  "outputs": [
    {
      "name": "_DENSITY",
      "type": "http://127.0.0.1/ontology/ontosem.owl#population-density",
      "desc": "Output of service Population Density Calculator Service."
    }
  ],
  "capability": "atomic",
  "file": "getPopulationDensityOfLocation.owls",
  "provider": {
    "type": "asp"
  },
  "inputs": [
    {
      "name": "_USERID",
      "type": "http://127.0.0.1/ontology/geographydataset.owl#UniqueIdentifier",
      "desc": "Input of service Population Density Calculator Service."
    },
    {
      "name": "_LATITUDE",
      "type": "http://127.0.0.1/ontology/protont.owl#latitude",
      "desc": "Input of service Population Density Calculator Service."
    },
    {
      "name": "_LONGITUDE",
      "type": "http://127.0.0.1/ontology/protont.owl#longitude",
      "desc": "Input of service Population Density Calculator Service."
    }
  ],
  "name": "Population Density Calculator Service.",
  "description": "This service returns an estimate of the population density at any location (latitude/longitude pair), in persons per square kilometer, as a decimal number followed by a line feed.For using this service valid UserID should be provided.",
  "domains": [
    {
      "name": "Geography",
      "url": "http://www.surf.scss.tcd.ie/cityOntology/#Geography"
    },
    {
      "name": "Travel",
      "url": "http://www.surf.scss.tcd.ie/cityOntology/#Travel"
    }
  ],
  "id": "travel/getPopulationDensityOfLocation",
  "state": true,
  "url": "http://surf.scss.tcd.ie/_provider_/travel/getPopulationDensityOfLocation"
}