{
  "outputs": [
    {
      "name": "busAvailability",
      "type": "json"
    }
  ],
  "provider": {
    "type": "asp"
  },
  "inputs": [
    {
      "name": "routeParameters",
      "type": "json"
    }
  ],
  "name": "bus_availability",
  "description": "This is the service bus_availability",
  "domains": [
    {
      "name": "Transport_and_Mobility",
      "url": "http://www.surf.scss.tcd.ie/cityOntology/#Transport_and_Mobility"
    }
  ],
  "id": "8/bus_availability",
  "state": true,
  "url": "http://surf.scss.tcd.ie/_provider_/bus_availability"
}