{
  "outputs": [
    {
      "name": "_RECOMMENDEDPRICE",
      "type": "http://127.0.0.1/ontology/concept.owl#RecommendedPrice",
      "desc": "Output of service Sandwich RecommendedPrice Service"
    }
  ],
  "capability": "atomic",
  "file": "sandwich_recommendedprice_service.owls",
  "provider": {
    "type": "webservice"
  },
  "inputs": [
    {
      "name": "_SANDWICH",
      "type": "http://127.0.0.1/ontology/Mid-level-ontology.owl#Sandwich",
      "desc": "Input of service Sandwich RecommendedPrice Service"
    }
  ],
  "name": "Sandwich RecommendedPrice Service",
  "description": "This service returns latest purchase recommended price of given sandwich type.",
  "domains": [
    {
      "name": "Food_and_Drinks",
      "url": "http://www.surf.scss.tcd.ie/cityOntology/#Food_and_Drinks"
    }
  ],
  "id": "food/sandwich_recommendedprice_service",
  "state": true,
  "url": "http://surf.scss.tcd.ie/_provider_/food/sandwich_recommendedprice_service"
}