{
  "outputs": [
    {
      "name": "_TAXEDPRICEINDOLLAR",
      "type": "http://127.0.0.1/ontology/concept.owl#TaxedPriceInDollar",
      "desc": "Output of service EntranceFee Service"
    }
  ],
  "capability": "atomic",
  "file": "EntranceFeeindollar_service.owls",
  "provider": {
    "type": "asp"
  },
  "inputs": [
    {
      "name": "_PERSON",
      "type": "http://127.0.0.1/ontology/books.owl#Person",
      "desc": "Input of service EntranceFee Service"
    }
  ],
  "name": "EntranceFee Service",
  "description": "This service returns the entrance fee including tax in dollars for a person. The fee is different for each person.",
  "domains": [
    {
      "name": "Payment_and_Delivery",
      "url": "http://www.surf.scss.tcd.ie/cityOntology/#Payment_and_Delivery"
    }
  ],
  "id": "payment/person_taxedpriceindollar_service",
  "state": true,
  "url": "http://surf.scss.tcd.ie/_provider_/payment/person_taxedpriceindollar_service"
}