{
  "outputs": [
    {
      "name": "_publication",
      "type": "string",
      "desc": "Output of service PublicationSearchingService"
    }
  ],
  "provider": {
    "type": "wsdn"
  },
  "inputs": [
    {
      "name": "_publication-number",
      "type": "string",
      "desc": "Input of service PublicationSearchingService"
    }
  ],
  "name": "PublicationSearchingService",
  "description": "This service returns a publication on given PUBLICATION-NUMBER.",
  "domains": [
    {
      "name": "Nature",
      "url": "http://www.surf.scss.tcd.ie/cityOntology/#Nature"
    }
  ],
  "id": "educational/publication-number_publication_service",
  "state": true,
  "url": "http://surf.scss.tcd.ie/_provider_/educational/publication-number_publication_service"
}