{
  "outputs": [
    {
      "name": "_LENDING",
      "type": "http://127.0.0.1/ontology/SUMO.owl#Lending",
      "desc": "Output of service GovernmentOrganization Missile Lending Range Service"
    },
    {
      "name": "_RANGE",
      "type": "http://127.0.0.1/ontology/extendedCamera.owl#Range",
      "desc": "Output of service GovernmentOrganization Missile Lending Range Service"
    }
  ],
  "capability": "atomic",
  "file": "missilegovernmentorganization_lendingrange_service.owls",
  "provider": {
    "type": "asp"
  },
  "inputs": [
    {
      "name": "_GOVERMENTORGANIZATION",
      "type": "http://127.0.0.1/ontology/SUMO.owl#GovernmentOrganization",
      "desc": "Input of service GovernmentOrganization Missile Lending Range Service"
    },
    {
      "name": "_MISSILE",
      "type": "http://127.0.0.1/ontology/Mid-level-ontology.owl#Missile",
      "desc": "Input of service GovernmentOrganization Missile Lending Range Service"
    }
  ],
  "name": "GovernmentOrganization Missile Lending Range Service",
  "description": "This service informs you lending for the Missile provided by the government organization, and target range of the missile.",
  "domains": [
    {
      "name": "Government_and_Planning",
      "url": "http://www.surf.scss.tcd.ie/cityOntology/#Government_and_Planning"
    }
  ],
  "id": "weapon/missilegovermentorganization_lendingrange_service",
  "state": true,
  "url": "http://surf.scss.tcd.ie/_provider_/weapon/missilegovermentorganization_lendingrange_service"
}