{
  "outputs": [
    {
      "name": "_RECOMMENDEDPRICE",
      "type": "http://127.0.0.1/ontology/concept.owl#RecommendedPrice",
      "desc": "Output of service Coffee RecommendedPrice Service"
    }
  ],
  "capability": "atomic",
  "file": "coffee_recommendedprice_service.owls",
  "provider": {
    "type": "asp"
  },
  "inputs": [
    {
      "name": "_COFFEE",
      "type": "http://127.0.0.1/ontology/Mid-level-ontology.owl#Coffee",
      "desc": "Input of service Coffee RecommendedPrice Service"
    }
  ],
  "name": "Coffee RecommendedPrice Service",
  "description": "This service returns recommended purchase price of given coffee brand. The price is for 1kg of coffee.",
  "domains": [
    {
      "name": "Food_and_Drinks",
      "url": "http://www.surf.scss.tcd.ie/cityOntology/#Food_and_Drinks"
    }
  ],
  "id": "food/coffee_recommendedprice_service",
  "state": true,
  "url": "http://surf.scss.tcd.ie/_provider_/food/coffee_recommendedprice_service"
}