{
  "outputs": [
    {
      "name": "_SCHOLARSHIP",
      "type": "http://127.0.0.1/ontology/Mid-level-ontology.owl#Scholarship",
      "desc": "Output of service Academic-Degree Scholarship GermangovService"
    }
  ],
  "capability": "atomic",
  "file": "academic-degree_scholarship_GermanGovservice.owls",
  "provider": {
    "type": "wsdn"
  },
  "inputs": [
    {
      "name": "_ACADEMIC-DEGREE",
      "type": "http://127.0.0.1/ontology/portal.owl#Academic-Degree",
      "desc": "Input of service Academic-Degree Scholarship GermangovService"
    }
  ],
  "name": "Academic-Degree Scholarship GermangovService",
  "description": "It is an attractive service to know about the scholarships offered for a given academic-degree by the german government.",
  "domains": [
    {
      "name": "Educational",
      "url": "http://www.surf.scss.tcd.ie/cityOntology/#Educational"
    }
  ],
  "id": "education/academic-degree_scholarship_service",
  "state": true,
  "url": "http://surf.scss.tcd.ie/_provider_/education/academic-degree_scholarship_service"
}