{
  "outputs": [
    {
      "name": "_CARSTATUS",
      "type": "http://www.surf.scss.tcd.ie/IoTservices.owl#carStatus",
      "desc": "Output of service vehicle_usage_monitoring"
    }
  ],
  "provider": {
    "type": "asp"
  },
  "inputs": [
    {
      "name": "_VEHICLEID",
      "type": "http://www.surf.scss.tcd.ie/IoTservices.owl#vehicleId",
      "desc": "Input of service vehicle_usage_monitoring"
    }
  ],
  "name": "vehicle_usage_monitoring",
  "description": "This is the service vehicle_usage_monitoring",
  "domains": [
    {
      "name": "Transport_and_Mobility",
      "url": "http://www.surf.scss.tcd.ie/cityOntology/#Transport_and_Mobility"
    }
  ],
  "id": "transportandmobility/14_vehicle_usage_monitoring",
  "state": true,
  "url": "http://surf.scss.tcd.ie/_provider_/transportandmobility/14_vehicle_usage_monitoring"
}