{
  "outputs": [
    {
      "name": "_RURALAREA",
      "type": "http://127.0.0.1/ontology/travel.owl#RuralArea",
      "desc": "Output of service HikingSurfingRuralAreaService"
    }
  ],
  "capability": "atomic",
  "file": "surfinghiking_ruralarea_service.owls",
  "provider": {
    "type": "webservice"
  },
  "inputs": [
    {
      "name": "_HIKING",
      "type": "http://127.0.0.1/ontology/travel.owl#Hiking",
      "desc": "Input of service HikingSurfingRuralAreaService"
    },
    {
      "name": "_SURFING",
      "type": "http://127.0.0.1/ontology/travel.owl#Surfing",
      "desc": "Input of service HikingSurfingRuralAreaService"
    }
  ],
  "name": "HikingSurfingRuralAreaService",
  "description": "This is a nice service to know aboutthe rural area where you can find both sports hiking and surfing.",
  "domains": [
    {
      "name": "Travel",
      "url": "http://www.surf.scss.tcd.ie/cityOntology/#Travel"
    },
    {
      "name": "Activity",
      "url": "http://www.surf.scss.tcd.ie/cityOntology/#Activity"
    }
  ],
  "id": "activity/surfinghiking_ruralarea_service",
  "state": true,
  "url": "http://surf.scss.tcd.ie/_provider_/activity/surfinghiking_ruralarea_service"
}