{
  "outputs": [
    {
      "name": "_PRICE",
      "type": "http://127.0.0.1/ontology/concept.owl#Price",
      "desc": "Output of service 3wheeledcar year price service"
    }
  ],
  "capability": "atomic",
  "file": "3wheeledcaryear_price_service.owls",
  "provider": {
    "type": "asp"
  },
  "inputs": [
    {
      "name": "_3WHEELEDCAR",
      "type": "http://127.0.0.1/ontology/my_ontology.owl#ThreeWheeledCar",
      "desc": "Input of service 3wheeledcar year price service"
    },
    {
      "name": "_YEAR",
      "type": "http://127.0.0.1/ontology/SUMO.owl#Year",
      "desc": "Input of service 3wheeledcar year price service"
    }
  ],
  "name": "3wheeledcar year price service",
  "description": "You can inquire a price of a three wheeled car model given the model year of production.",
  "id": "economy/3wheeledcaryear_price_service",
  "state": true,
  "url": "http://surf.scss.tcd.ie/_provider_/economy/3wheeledcaryear_price_service"
}