{
  "outputs": [
    {
      "name": "_LETTER",
      "type": "http://127.0.0.1/ontology/portal.owl#Letter",
      "desc": "Output of service LetterFounderService"
    }
  ],
  "capability": "atomic",
  "file": "item-number_letter_service.owls",
  "provider": {
    "type": "asp"
  },
  "inputs": [
    {
      "name": "_ITEM-NUMBER",
      "type": "http://127.0.0.1/ontology/portal.owl#Item-Number",
      "desc": "Input of service LetterFounderService"
    }
  ],
  "name": "LetterFounderService",
  "description": "This service finds list of letters on the given item number.",
  "domains": [
    {
      "name": "Educational",
      "url": "http://www.surf.scss.tcd.ie/cityOntology/#Educational"
    }
  ],
  "id": "education/item-number_letter_service",
  "state": true,
  "url": "http://surf.scss.tcd.ie/_provider_/education/item-number_letter_service"
}