{
  "outputs": [
    {
      "name": "_PROFESSION",
      "type": "http://127.0.0.1/ontology/Mid-level-ontology.owl#Profession",
      "desc": "Output of service Geopolitical-Entity Profession service"
    }
  ],
  "capability": "atomic",
  "file": "geopolitical-entity_profession_service.owls",
  "provider": {
    "type": "webservice"
  },
  "inputs": [
    {
      "name": "_GEOPOLITICAL-ENTITY",
      "type": "http://127.0.0.1/ontology/portal.owl#Geopolitical-Entity",
      "desc": "Input of service Geopolitical-Entity Profession service"
    }
  ],
  "name": "Geopolitical-Entity Profession service",
  "description": "This service returns available jobs in some profession in a given geopolitical-entity.",
  "domains": [
    {
      "name": "Industry",
      "url": "http://www.surf.scss.tcd.ie/cityOntology/#Industry"
    }
  ],
  "id": "industry/geopolitical-entity_profession_service",
  "state": true,
  "url": "http://surf.scss.tcd.ie/_provider_/industry/geopolitical-entity_profession_service"
}