{
  "outputs": [
    {
      "name": "_AUTHOR",
      "type": "http://127.0.0.1/ontology/books.owl#Author",
      "desc": "Output of service Novel Author MaxPrice Service"
    },
    {
      "name": "_MAXPRICE",
      "type": "http://127.0.0.1/ontology/concept.owl#MaxPrice",
      "desc": "Output of service Novel Author MaxPrice Service"
    }
  ],
  "capability": "atomic",
  "file": "novel_authormaxprice_service.owls",
  "provider": {
    "type": "webservice"
  },
  "inputs": [
    {
      "name": "_NOVEL",
      "type": "http://127.0.0.1/ontology/books.owl#Novel",
      "desc": "Input of service Novel Author MaxPrice Service"
    }
  ],
  "name": "Novel Author MaxPrice Service",
  "description": "This service returns author and max price of a given novel.",
  "domains": [
    {
      "name": "Entertainment_Products",
      "url": "http://www.surf.scss.tcd.ie/cityOntology/#Entertainment_Products"
    }
  ],
  "id": "books/novel_authormaxprice_service",
  "state": true,
  "url": "http://surf.scss.tcd.ie/_provider_/books/novel_authormaxprice_service"
}