{
  "outputs": [
    {
      "name": "_FLOODINGINFO",
      "type": "http://www.surf.scss.tcd.ie/IoTservices.owl#floodingInfo",
      "desc": "Output of service route_water_level"
    }
  ],
  "provider": {
    "type": "wsdn"
  },
  "inputs": [
    {
      "name": "_ROUTEPARAMETERS",
      "type": "http://www.surf.scss.tcd.ie/IoTservices.owl#routeParameters",
      "desc": "Input of service route_water_level"
    }
  ],
  "name": "route_water_level",
  "description": "This is the service route_water_level",
  "domains": [
    {
      "name": "Transport_and_Mobility",
      "url": "http://www.surf.scss.tcd.ie/cityOntology/#Transport_and_Mobility"
    }
  ],
  "id": "transportandmobility/6_route_water_level",
  "state": true,
  "url": "http://surf.scss.tcd.ie/_provider_/transportandmobility/6_route_water_level"
}