{
  "outputs": [
    {
      "name": "_PROFESSION",
      "type": "http://127.0.0.1/ontology/Mid-level-ontology.owl#Profession",
      "desc": "Output of service Geopolitical-Entity Profession TimeDuration service"
    },
    {
      "name": "_TIMEDURATION",
      "type": "http://127.0.0.1/ontology/SUMO.owl#TimeDuration",
      "desc": "Output of service Geopolitical-Entity Profession TimeDuration service"
    }
  ],
  "capability": "atomic",
  "file": "geopolitical-entity_professiontimeduration_service.owls",
  "provider": {
    "type": "wsdn"
  },
  "inputs": [
    {
      "name": "_GEOPOLITICAL-ENTITY",
      "type": "http://127.0.0.1/ontology/portal.owl#Geopolitical-Entity",
      "desc": "Input of service Geopolitical-Entity Profession TimeDuration service"
    }
  ],
  "name": "Geopolitical-Entity Profession TimeDuration service",
  "description": "This service returns profession job in a given geopolitical-entity and its time duration.",
  "domains": [
    {
      "name": "Educational",
      "url": "http://www.surf.scss.tcd.ie/cityOntology/#Educational"
    }
  ],
  "id": "education/geopolitical-entity_professiontimeduration_service",
  "state": true,
  "url": "http://surf.scss.tcd.ie/_provider_/education/geopolitical-entity_professiontimeduration_service"
}