{
    "capability": "atomic",
    "description": "This service returns novels written by the given author. The recommended price is also informed.",
    "domains": [
        {
            "name": "Research_and_Science",
            "url": "http://www.surf.scss.tcd.ie/cityOntology/#Research_and_Science"
        }
    ],
    "file": "author_novelrecommendedprice_service.owls",
    "id": "books/author_novelrecommendedprice_service",
    "inputs": [
        {
            "desc": "Input of service Author Novel RecommendedPrice Service",
            "name": "_AUTHOR",
            "type": "http://127.0.0.1/ontology/books.owl#Author"
        }
    ],
    "name": "Author Novel RecommendedPrice Service",
    "outputs": [
        {
            "desc": "Output of service Author Novel RecommendedPrice Service",
            "name": "_NOVEL",
            "type": "http://127.0.0.1/ontology/books.owl#Novel"
        },
        {
            "desc": "Output of service Author Novel RecommendedPrice Service",
            "name": "_RECOMMENDEDPRICE",
            "type": "http://127.0.0.1/ontology/concept.owl#RecommendedPrice"
        }
    ],
    "provider": {
        "type": "webservice"
    },
    "state": true,
    "url": "http://surf.scss.tcd.ie/_provider_/books/author_novelrecommendedprice_service"
}