{
  "outputs": [
    {
      "name": "_BEDANDBREAKFAST",
      "type": "http://127.0.0.1/ontology/travel.owl#BedAndBreakfast",
      "desc": "Output of service Duration Geopolitical-Entity City BedAndBreakfast InfoService"
    }
  ],
  "capability": "atomic",
  "file": "durationgeopolitical-entitycity_bedandbreakfast_service.owls",
  "provider": {
    "type": "asp"
  },
  "inputs": [
    {
      "name": "_CITY",
      "type": "http://127.0.0.1/ontology/travel.owl#City",
      "desc": "Input of service Duration Geopolitical-Entity City BedAndBreakfast InfoService"
    },
    {
      "name": "_GEOPOLITICAL-ENTITY",
      "type": "http://127.0.0.1/ontology/portal.owl#Geopolitical-Entity",
      "desc": "Input of service Duration Geopolitical-Entity City BedAndBreakfast InfoService"
    },
    {
      "name": "_DURATION",
      "type": "http://127.0.0.1/ontology/support.owl#Duration",
      "desc": "Input of service Duration Geopolitical-Entity City BedAndBreakfast InfoService"
    }
  ],
  "name": "Duration Geopolitical-Entity City BedAndBreakfast InfoService",
  "description": "This service informs about availability of bed-and-breakfast accommodation in a given city of a given geopolitical-entity, for a given duration time.",
  "domains": [
    {
      "name": "Travel",
      "url": "http://www.surf.scss.tcd.ie/cityOntology/#Travel"
    }
  ],
  "id": "travel/durationgeopolitical-entitycity_bedandbreakfast_service",
  "state": true,
  "url": "http://surf.scss.tcd.ie/_provider_/travel/durationgeopolitical-entitycity_bedandbreakfast_service"
}