{
  "outputs": [
    {
      "name": "_maxprice",
      "type": "string",
      "desc": "Output of service Coffee MaxPrice Service"
    }
  ],
  "provider": {
    "type": "webservice"
  },
  "inputs": [
    {
      "name": "_coffee",
      "type": "string",
      "desc": "Input of service Coffee MaxPrice Service"
    }
  ],
  "name": "Coffee MaxPrice Service",
  "description": "This service returns max price of coffee.",
  "domains": [
    {
      "name": "Medicines",
      "url": "http://www.surf.scss.tcd.ie/cityOntology/#Medicines"
    }
  ],
  "id": "retail/coffee_maxprice_service",
  "state": true,
  "url": "http://surf.scss.tcd.ie/_provider_/retail/coffee_maxprice_service"
}