{
    "description": "This is the service present_offers_mirror",
    "domains": [
        {
            "name": "Clothing",
            "url": "http://www.surf.scss.tcd.ie/cityOntology/#Clothing"
        }
    ],
    "id": "clothing/69_present_offers_mirror",
    "inputs": [
        {
            "desc": "Input of service present_offers_mirror",
            "name": "_OFFERSINFO",
            "type": "http://www.surf.scss.tcd.ie/IoTservices.owl#offersInfo"
        }
    ],
    "name": "present_offers_mirror",
    "outputs": [
        {
            "desc": "Output of service present_offers_mirror",
            "name": "_PRESENTOFFERS",
            "type": "http://www.surf.scss.tcd.ie/IoTservices.owl#presentOffers"
        }
    ],
    "provider": {
        "type": "asp"
    },
    "state": true,
    "url": "http://surf.scss.tcd.ie/_provider_/clothing/69_present_offers_mirror"
}