{
    "description": "This is the service sport_event_dashboard",
    "domains": [
        {
            "name": "Sport",
            "url": "http://www.surf.scss.tcd.ie/cityOntology/#Sport"
        }
    ],
    "id": "sport/123_sport_event_dashboard",
    "inputs": [
        {
            "desc": "Input of service sport_event_dashboard",
            "name": "_TRANSPORTINFO",
            "type": "http://www.surf.scss.tcd.ie/IoTservices.owl#transportInfo"
        },
        {
            "desc": "Input of service sport_event_dashboard",
            "name": "_STADIUMMAP",
            "type": "http://www.surf.scss.tcd.ie/IoTservices.owl#stadiumMap"
        },
        {
            "desc": "Input of service sport_event_dashboard",
            "name": "_SIMILARRESULTS",
            "type": "http://www.surf.scss.tcd.ie/IoTservices.owl#similarResults"
        }
    ],
    "name": "sport_event_dashboard",
    "outputs": [
        {
            "desc": "Output of service sport_event_dashboard",
            "name": "_EVENTVISUALISATION",
            "type": "http://www.surf.scss.tcd.ie/IoTservices.owl#eventVisualisation"
        }
    ],
    "provider": {
        "type": "asp"
    },
    "state": true,
    "url": "http://surf.scss.tcd.ie/_provider_/sport/123_sport_event_dashboard"
}