{
  "outputs": [
    {
      "name": "_lecturer-in-academia",
      "type": "string",
      "desc": "Output of service EducationalOrganizationLecturer"
    }
  ],
  "provider": {
    "type": "webservice"
  },
  "inputs": [
    {
      "name": "_educational-organization",
      "type": "string",
      "desc": "Input of service EducationalOrganizationLecturer"
    }
  ],
  "name": "EducationalOrganizationLecturer",
  "description": "This service returns lecturer of the given educational organization.",
  "domains": [
    {
      "name": "Food_and_Drinks",
      "url": "http://www.surf.scss.tcd.ie/cityOntology/#Food_and_Drinks"
    }
  ],
  "id": "educational/educational-organization_lecturer-in-academia_service",
  "state": true,
  "url": "http://surf.scss.tcd.ie/_provider_/educational/educational-organization_lecturer-in-academia_service"
}