{
  "outputs": [
    {
      "name": "_YEAR",
      "type": "http://127.0.0.1/ontology/SUMO.owl#Year",
      "desc": "Output of service Car Year Price Service"
    },
    {
      "name": "_PRICE",
      "type": "http://127.0.0.1/ontology/concept.owl#Price",
      "desc": "Output of service Car Year Price Service"
    }
  ],
  "capability": "atomic",
  "file": "car_yearprice_service.owls",
  "provider": {
    "type": "asp"
  },
  "inputs": [
    {
      "name": "_CAR",
      "type": "http://127.0.0.1/ontology/my_ontology.owl#Car",
      "desc": "Input of service Car Year Price Service"
    }
  ],
  "name": "Car Year Price Service",
  "description": "This service provides the purchase price and year of producation of a given car model (the results contain both new or used models of the given car).",
  "domains": [
    {
      "name": "Vehicle_Sale_and_Rent",
      "url": "http://www.surf.scss.tcd.ie/cityOntology/#Vehicle_Sale_and_Rent"
    }
  ],
  "id": "vehicle/car_yearprice_service",
  "state": true,
  "url": "http://surf.scss.tcd.ie/_provider_/vehicle/car_yearprice_service"
}