{
  "outputs": [
    {
      "name": "_map",
      "type": "string",
      "desc": "Output of service Gorge RouteFinder Service"
    }
  ],
  "provider": {
    "type": "wsdn"
  },
  "inputs": [
    {
      "name": "_geographical-region",
      "type": "string",
      "desc": "Input of service Gorge RouteFinder Service"
    },
    {
      "name": "_geographical-region",
      "type": "string",
      "desc": "Input of service Gorge RouteFinder Service"
    }
  ],
  "name": "Gorge RouteFinder Service",
  "description": "Gorge is a new service and provides all relative paths between two given geographical regions.",
  "domains": [
    {
      "name": "Tools",
      "url": "http://www.surf.scss.tcd.ie/cityOntology/#Tools"
    }
  ],
  "id": "mobility/geographical-regiongeographical-region_map_service",
  "state": true,
  "url": "http://surf.scss.tcd.ie/_provider_/mobility/geographical-regiongeographical-region_map_service"
}