{
  "outputs": [
    {
      "name": "_BEACH",
      "type": "http://127.0.0.1/ontology/travel.owl#Beach",
      "desc": "Output of service SurfingBeachService"
    }
  ],
  "capability": "atomic",
  "file": "surfing_beach_service.owls",
  "provider": {
    "type": "wsdn"
  },
  "inputs": [
    {
      "name": "_SURFING",
      "type": "http://127.0.0.1/ontology/travel.owl#Surfing",
      "desc": "Input of service SurfingBeachService"
    }
  ],
  "name": "SurfingBeachService",
  "description": "This is the best service to know aboutthe names of beaches which provide good surfing activities.",
  "domains": [
    {
      "name": "Travel",
      "url": "http://www.surf.scss.tcd.ie/cityOntology/#Travel"
    }
  ],
  "id": "travel/surfing_beach_service",
  "state": true,
  "url": "http://surf.scss.tcd.ie/_provider_/travel/surfing_beach_service"
}