{
  "outputs": [
    {
      "name": "_PRISIONVIDEO",
      "type": "http://www.surf.scss.tcd.ie/IoTservices.owl#prisionVideo",
      "desc": "Output of service prision_video_camera"
    }
  ],
  "provider": {
    "type": "wsdn"
  },
  "inputs": [
    {
      "name": "_PRISIONZONE",
      "type": "http://www.surf.scss.tcd.ie/IoTservices.owl#prisionZone",
      "desc": "Input of service prision_video_camera"
    }
  ],
  "name": "prision_video_camera",
  "description": "This is the service prision_video_camera",
  "domains": [
    {
      "name": "Safety_and_Emergencies",
      "url": "http://www.surf.scss.tcd.ie/cityOntology/#Safety_and_Emergencies"
    }
  ],
  "id": "safetyandemergencies/19_prision_video_camera",
  "state": true,
  "url": "http://surf.scss.tcd.ie/_provider_/safetyandemergencies/19_prision_video_camera"
}