{
  "outputs": [
    {
      "name": "_DESTINATION",
      "type": "http://127.0.0.1/ontology/travel.owl#Destination",
      "desc": "Output of service AUS SurfingDestinationService"
    }
  ],
  "capability": "atomic",
  "file": "surfing_destination_AUSservice.owls",
  "provider": {
    "type": "asp"
  },
  "inputs": [
    {
      "name": "_SURFING",
      "type": "http://127.0.0.1/ontology/travel.owl#Surfing",
      "desc": "Input of service AUS SurfingDestinationService"
    }
  ],
  "name": "AUS SurfingDestinationService",
  "description": "AUS is the most used service to know about a good destination for surfing activities.",
  "domains": [
    {
      "name": "Travel",
      "url": "http://www.surf.scss.tcd.ie/cityOntology/#Travel"
    },
    {
      "name": "Activity",
      "url": "http://www.surf.scss.tcd.ie/cityOntology/#Activity"
    }
  ],
  "id": "activity/surfing_destination_AUSservice",
  "state": true,
  "url": "http://surf.scss.tcd.ie/_provider_/activity/surfing_destination_AUSservice"
}