{
  "outputs": [
    {
      "name": "_SKILLEDOCCUPATION",
      "type": "http://127.0.0.1/ontology/Mid-level-ontology.owl#SkilledOccupation",
      "desc": "Output of service Country SkilledOccupation PartTimePosition Service"
    },
    {
      "name": "_PARTTIMEPOSITION",
      "type": "http://127.0.0.1/ontology/Mid-level-ontology.owl#PartTimePosition",
      "desc": "Output of service Country SkilledOccupation PartTimePosition Service"
    }
  ],
  "capability": "atomic",
  "file": "country_skilledoccupationparttimeposition_JobService.owls",
  "provider": {
    "type": "asp"
  },
  "inputs": [
    {
      "name": "_COUNTRY",
      "type": "http://127.0.0.1/ontology/portal.owl#Country",
      "desc": "Input of service Country SkilledOccupation PartTimePosition Service"
    }
  ],
  "name": "Country SkilledOccupation PartTimePosition Service",
  "description": "This service returns part time positions offering for skilledoccupations in a given country.",
  "domains": [
    {
      "name": "Educational",
      "url": "http://www.surf.scss.tcd.ie/cityOntology/#Educational"
    }
  ],
  "id": "education/country_skilledoccupationparttimeposition_service",
  "state": true,
  "url": "http://surf.scss.tcd.ie/_provider_/education/country_skilledoccupationparttimeposition_service"
}