{
  "outputs": [
    {
      "name": "_SCHOLARSHIP",
      "type": "http://127.0.0.1/ontology/Mid-level-ontology.owl#Scholarship",
      "desc": "Output of service NationalGovernmentScholarship Service"
    }
  ],
  "capability": "atomic",
  "file": "nationalgovernment_scholarship_service.owls",
  "provider": {
    "type": "webservice"
  },
  "inputs": [
    {
      "name": "_NATIONALGOVERNMENT",
      "type": "http://127.0.0.1/ontology/Mid-level-ontology.owl#NationalGovernment",
      "desc": "Input of service NationalGovernmentScholarship Service"
    }
  ],
  "name": "NationalGovernmentScholarship Service",
  "description": "This service returns the offered scholarship from the given national government,this scholarship is for high educated persons.",
  "domains": [
    {
      "name": "Educational",
      "url": "http://www.surf.scss.tcd.ie/cityOntology/#Educational"
    }
  ],
  "id": "education/nationalgovernment_scholarship_service",
  "state": true,
  "url": "http://surf.scss.tcd.ie/_provider_/education/nationalgovernment_scholarship_service"
}