{
  "outputs": [
    {
      "name": "_HOTEL",
      "type": "http://127.0.0.1/ontology/travel.owl#Hotel",
      "desc": "Output of service CapitalCityCountaryHotelInfoService"
    }
  ],
  "capability": "atomic",
  "file": "countrycapital-city_hotel_service.owls",
  "provider": {
    "type": "asp"
  },
  "inputs": [
    {
      "name": "_CAPITAL-CITY",
      "type": "http://127.0.0.1/ontology/portal.owl#Capital-City",
      "desc": "Input of service CapitalCityCountaryHotelInfoService"
    },
    {
      "name": "_COUNTRY",
      "type": "http://127.0.0.1/ontology/portal.owl#Country",
      "desc": "Input of service CapitalCityCountaryHotelInfoService"
    }
  ],
  "name": "CapitalCityCountaryHotelInfoService",
  "description": "This service returns list of available hotels in the capital city of the country, the countryis an optional input.",
  "domains": [
    {
      "name": "Travel",
      "url": "http://www.surf.scss.tcd.ie/cityOntology/#Travel"
    }
  ],
  "id": "travel/countrycapital-city_hotel_service",
  "state": true,
  "url": "http://surf.scss.tcd.ie/_provider_/travel/countrycapital-city_hotel_service"
}