{
  "outputs": [
    {
      "name": "_VIDEOMEDIA",
      "type": "http://127.0.0.1/ontology/my_ontology.owl#VideoMedia",
      "desc": "Output of service Title VideoMedia TaxedPrice Quality service"
    },
    {
      "name": "_TAXEDPRICE",
      "type": "http://127.0.0.1/ontology/concept.owl#TaxedPrice",
      "desc": "Output of service Title VideoMedia TaxedPrice Quality service"
    },
    {
      "name": "_QUALITY",
      "type": "http://127.0.0.1/ontology/finance_th_web.owl#quality",
      "desc": "Output of service Title VideoMedia TaxedPrice Quality service"
    }
  ],
  "capability": "atomic",
  "file": "title_videomediataxedpricequality_service.owls",
  "provider": {
    "type": "wsdn"
  },
  "inputs": [
    {
      "name": "_TITLE",
      "type": "http://127.0.0.1/ontology/books.owl#Title",
      "desc": "Input of service Title VideoMedia TaxedPrice Quality service"
    }
  ],
  "name": "Title VideoMedia TaxedPrice Quality service",
  "description": "This service searches videomedia for the given title, and also returnsits taxed price and quality.",
  "domains": [
    {
      "name": "Communications",
      "url": "http://www.surf.scss.tcd.ie/cityOntology/#Communications"
    }
  ],
  "id": "communication/title_videomediataxedpricequality_service",
  "state": true,
  "url": "http://surf.scss.tcd.ie/_provider_/communication/title_videomediataxedpricequality_service"
}