{
  "outputs": [
    {
      "name": "_PURCHASEORDER",
      "type": "http://www.surf.scss.tcd.ie/IoTservices.owl#purchaseOrder",
      "desc": "Output of service shopping_order"
    }
  ],
  "provider": {
    "type": "ws"
  },
  "inputs": [
    {
      "name": "_PRODUCTS",
      "type": "http://www.surf.scss.tcd.ie/IoTservices.owl#products",
      "desc": "Input of service shopping_order"
    }
  ],
  "name": "shopping_order",
  "description": "This is the service shopping_order",
  "domains": [
    {
      "name": "Payment_and_Delivery",
      "url": "http://www.surf.scss.tcd.ie/cityOntology/#Payment_and_Delivery"
    }
  ],
  "id": "payment/134_shopping_order",
  "state": true,
  "url": "http://surf.scss.tcd.ie/_provider_/payment/134_shopping_order"
}