{
  "outputs": [
    {
      "name": "_PRICE",
      "type": "http://127.0.0.1/ontology/concept.owl#Price",
      "desc": "Output of service KodakPriceService"
    }
  ],
  "capability": "atomic",
  "file": "PhillipDigCamera_price_service.owls",
  "provider": {
    "type": "webservice"
  },
  "inputs": [
    {
      "name": "_MERCANTILEORGANIZATION",
      "type": "http://127.0.0.1/ontology/SUMO.owl#MercantileOrganization",
      "desc": "Input of service KodakPriceService"
    }
  ],
  "name": "KodakPriceService",
  "description": "This service is dedicated to return price of Phillips digital camera available in a mercentile organization.",
  "domains": [
    {
      "name": "Technology",
      "url": "http://www.surf.scss.tcd.ie/cityOntology/#Technology"
    }
  ],
  "id": "technology/PhillipDigCamera_price_service",
  "state": true,
  "url": "http://surf.scss.tcd.ie/_provider_/technology/PhillipDigCamera_price_service"
}