{
  "outputs": [
    {
      "name": "_WEATHERSEASON",
      "type": "http://127.0.0.1/ontology/Mid-level-ontology.owl#WeatherSeason",
      "desc": "Output of service GEWS Service"
    },
    {
      "name": "_PROPOSITION",
      "type": "http://127.0.0.1/ontology/SUMO.owl#Proposition",
      "desc": "Output of service GEWS Service"
    }
  ],
  "capability": "atomic",
  "file": "geopolitical-entity_weatherseasonproposition_service.owls",
  "provider": {
    "type": "webservice"
  },
  "inputs": [
    {
      "name": "_GEOPOLITICAL-ENTITY",
      "type": "http://127.0.0.1/ontology/portal.owl#Geopolitical-Entity",
      "desc": "Input of service GEWS Service"
    }
  ],
  "name": "GEWS Service",
  "description": "GEWS service is used to get season report and proposition about aweather status of a particular geogrphical region.",
  "domains": [
    {
      "name": "Travel",
      "url": "http://www.surf.scss.tcd.ie/cityOntology/#Travel"
    },
    {
      "name": "Weather",
      "url": "http://www.surf.scss.tcd.ie/cityOntology/#Weather"
    }
  ],
  "id": "weather/geopolitical-entity_weatherseasonproposition_service",
  "state": true,
  "url": "http://surf.scss.tcd.ie/_provider_/weather/geopolitical-entity_weatherseasonproposition_service"
}