{
  "outputs": [
    {
      "name": "_AUTHOR",
      "type": "http://127.0.0.1/ontology/books.owl#Author",
      "desc": "Output of service Short-Story Author TaxedPrice Service"
    },
    {
      "name": "_TAXEDPRICE",
      "type": "http://127.0.0.1/ontology/concept.owl#TaxedPrice",
      "desc": "Output of service Short-Story Author TaxedPrice Service"
    }
  ],
  "capability": "atomic",
  "file": "short-story_authortaxedprice_service.owls",
  "provider": {
    "type": "webservice"
  },
  "inputs": [
    {
      "name": "_SHORT-STORY",
      "type": "http://127.0.0.1/ontology/books.owl#Short-Story",
      "desc": "Input of service Short-Story Author TaxedPrice Service"
    }
  ],
  "name": "Short-Story Author TaxedPrice Service",
  "description": "This service returns author and taxed price of a given short-story.",
  "domains": [
    {
      "name": "Entertainment_Products",
      "url": "http://www.surf.scss.tcd.ie/cityOntology/#Entertainment_Products"
    },
    {
      "name": "Educational",
      "url": "http://www.surf.scss.tcd.ie/cityOntology/#Educational"
    }
  ],
  "id": "books/short-story_authortaxedprice_service",
  "state": true,
  "url": "http://surf.scss.tcd.ie/_provider_/books/short-story_authortaxedprice_service"
}