{
  "outputs": [
    {
      "name": "_PRICE",
      "type": "http://127.0.0.1/ontology/concept.owl#Price",
      "desc": "Output of service Shoppingstatus Service"
    }
  ],
  "capability": "atomic",
  "file": "user_price_ShoppingStatusservice.owls",
  "provider": {
    "type": "asp"
  },
  "inputs": [
    {
      "name": "_USER",
      "type": "http://127.0.0.1/ontology/books.owl#User",
      "desc": "Input of service Shoppingstatus Service"
    }
  ],
  "name": "Shoppingstatus Service",
  "description": "This service informs about the total price of the items in a shopping basket of the logged-in user. The service also gives confirmation for shipping the items.",
  "domains": [
    {
      "name": "Payment_and_Delivery",
      "url": "http://www.surf.scss.tcd.ie/cityOntology/#Payment_and_Delivery"
    }
  ],
  "id": "payment/user_price_ShoppingStatusservice",
  "state": true,
  "url": "http://surf.scss.tcd.ie/_provider_/payment/user_price_ShoppingStatusservice"
}