{
  "outputs": [
    {
      "name": "_BINSTATUS",
      "type": "http://www.surf.scss.tcd.ie/IoTservices.owl#binStatus",
      "desc": "Output of service garbage_bin_status"
    }
  ],
  "provider": {
    "type": "wsdn"
  },
  "inputs": [
    {
      "name": "_BINID",
      "type": "http://www.surf.scss.tcd.ie/IoTservices.owl#binId",
      "desc": "Input of service garbage_bin_status"
    }
  ],
  "name": "garbage_bin_status",
  "description": "This is the service garbage_bin_status",
  "domains": [
    {
      "name": "Waste",
      "url": "http://www.surf.scss.tcd.ie/cityOntology/#Waste"
    }
  ],
  "id": "waste/107_garbage_bin_status",
  "state": true,
  "url": "http://surf.scss.tcd.ie/_provider_/waste/107_garbage_bin_status"
}