{
  "outputs": [
    {
      "name": "_VIDEOMEDIA",
      "type": "http://127.0.0.1/ontology/my_ontology.owl#VideoMedia",
      "desc": "Output of service AvailableVideoService"
    }
  ],
  "capability": "atomic",
  "file": "linguisticexpression_videomedia_service.owls",
  "provider": {
    "type": "asp"
  },
  "inputs": [
    {
      "name": "_LINGUISTICEXPRESSION",
      "type": "http://127.0.0.1/ontology/books.owl#LinguisticExpression",
      "desc": "Input of service AvailableVideoService"
    }
  ],
  "name": "AvailableVideoService",
  "description": "You can use this service to get matching video media model for the given name.",
  "domains": [
    {
      "name": "Communications",
      "url": "http://www.surf.scss.tcd.ie/cityOntology/#Communications"
    },
    {
      "name": "Entertainment_Products",
      "url": "http://www.surf.scss.tcd.ie/cityOntology/#Entertainment_Products"
    }
  ],
  "id": "entertainment/linguisticexpression_videomedia_service",
  "state": true,
  "url": "http://surf.scss.tcd.ie/_provider_/entertainment/linguisticexpression_videomedia_service"
}