{
  "outputs": [
    {
      "name": "_ACTIONFILM",
      "type": "http://127.0.0.1/ontology/my_ontology.owl#ActionFilm",
      "desc": "Output of service Title ActionFilm Price Quality service"
    },
    {
      "name": "_PRICE",
      "type": "http://127.0.0.1/ontology/concept.owl#Price",
      "desc": "Output of service Title ActionFilm Price Quality service"
    },
    {
      "name": "_QUALITY",
      "type": "http://127.0.0.1/ontology/finance_th_web.owl#quality",
      "desc": "Output of service Title ActionFilm Price Quality service"
    }
  ],
  "capability": "atomic",
  "file": "title_actionfilmpricequality_service.owls",
  "provider": {
    "type": "asp"
  },
  "inputs": [
    {
      "name": "_TITLE",
      "type": "http://127.0.0.1/ontology/books.owl#Title",
      "desc": "Input of service Title ActionFilm Price Quality service"
    }
  ],
  "name": "Title ActionFilm Price Quality service",
  "description": "This service searches action films for the given title, and also returnsits price and quality.",
  "domains": [
    {
      "name": "Communications",
      "url": "http://www.surf.scss.tcd.ie/cityOntology/#Communications"
    }
  ],
  "id": "communication/title_actionfilmpricequality_service",
  "state": true,
  "url": "http://surf.scss.tcd.ie/_provider_/communication/title_actionfilmpricequality_service"
}