{
    "capability": "atomic",
    "description": "This service returns publisher of a certain science fiction novel.",
    "domains": [
        {
            "name": "Research_and_Science",
            "url": "http://www.surf.scss.tcd.ie/cityOntology/#Research_and_Science"
        }
    ],
    "file": "science-fiction-novel_publisher_service.owls",
    "id": "books/science-fiction-novel_publisher_service",
    "inputs": [
        {
            "desc": "Input of service Science-Fiction-Novel Publisher Service",
            "name": "_SCIENCE-FICTION-NOVEL",
            "type": "http://127.0.0.1/ontology/books.owl#Science-Fiction-Novel"
        }
    ],
    "name": "Science-Fiction-Novel Publisher Service",
    "outputs": [
        {
            "desc": "Output of service Science-Fiction-Novel Publisher Service",
            "name": "_PUBLISHER",
            "type": "http://127.0.0.1/ontology/books.owl#Publisher"
        }
    ],
    "provider": {
        "type": "wsdn"
    },
    "state": true,
    "url": "http://surf.scss.tcd.ie/_provider_/books/science-fiction-novel_publisher_service"
}