{
  "outputs": [
    {
      "name": "_town",
      "type": "string",
      "desc": "Output of service SportsTownService"
    }
  ],
  "provider": {
    "type": "wsdn"
  },
  "inputs": [
    {
      "name": "_sports",
      "type": "string",
      "desc": "Input of service SportsTownService"
    }
  ],
  "name": "SportsTownService",
  "description": "This service returns town for sports.",
  "domains": [
    {
      "name": "Activity",
      "url": "http://www.surf.scss.tcd.ie/cityOntology/#Activity"
    }
  ],
  "id": "tourism/sports_town_service",
  "state": true,
  "url": "http://surf.scss.tcd.ie/_provider_/tourism/sports_town_service"
}