{
  "outputs": [
    {
      "name": "_CONSTRUCTIONDASHBOARD",
      "type": "http://www.surf.scss.tcd.ie/IoTservices.owl#constructionDashboard",
      "desc": "Output of service construction_dashboard"
    }
  ],
  "provider": {
    "type": "asp"
  },
  "inputs": [
    {
      "name": "_CONSTRUCTIONINFORMATION",
      "type": "http://www.surf.scss.tcd.ie/IoTservices.owl#constructionInformation",
      "desc": "Input of service construction_dashboard"
    }
  ],
  "name": "construction_dashboard",
  "description": "This is the service construction_dashboard",
  "domains": [
    {
      "name": "Safety_and_Emergencies",
      "url": "http://www.surf.scss.tcd.ie/cityOntology/#Safety_and_Emergencies"
    },
    {
      "name": "Construction",
      "url": "http://www.surf.scss.tcd.ie/cityOntology/#Construction"
    }
  ],
  "id": "construction/45_construction_dashboard",
  "state": true,
  "url": "http://surf.scss.tcd.ie/_provider_/construction/45_construction_dashboard"
}