{
  "outputs": [
    {
      "name": "_COMEDYFILM",
      "type": "http://127.0.0.1/ontology/my_ontology.owl#ComedyFilm",
      "desc": "Output of service BF Comedy Film Searcher"
    }
  ],
  "capability": "atomic",
  "file": "title_comedyfilm_BFservice.owls",
  "provider": {
    "type": "wsdn"
  },
  "inputs": [
    {
      "name": "_TITLE",
      "type": "http://127.0.0.1/ontology/books.owl#Title",
      "desc": "Input of service BF Comedy Film Searcher"
    }
  ],
  "name": "BF Comedy Film Searcher",
  "description": "This service searches a comedy film for a title.",
  "domains": [
    {
      "name": "Communications",
      "url": "http://www.surf.scss.tcd.ie/cityOntology/#Communications"
    }
  ],
  "id": "communication/title_comedyfilm_service",
  "state": true,
  "url": "http://surf.scss.tcd.ie/_provider_/communication/title_comedyfilm_service"
}