{
  "outputs": [
    {
      "name": "_FUNDING",
      "type": "http://127.0.0.1/ontology/SUMO.owl#Funding",
      "desc": "Output of service PakistanMissilesFundingService"
    }
  ],
  "capability": "atomic",
  "file": "missile_funding_Pakservice.owls",
  "provider": {
    "type": "wsdn"
  },
  "inputs": [
    {
      "name": "_MISSILE",
      "type": "http://127.0.0.1/ontology/Mid-level-ontology.owl#Missile",
      "desc": "Input of service PakistanMissilesFundingService"
    }
  ],
  "name": "PakistanMissilesFundingService",
  "description": "This service returns the amount of funding for given missiles types spent by the pakistani government.",
  "domains": [
    {
      "name": "Defense",
      "url": "http://www.surf.scss.tcd.ie/cityOntology/#Defense"
    }
  ],
  "id": "defense/missile_funding_Pakservice",
  "state": true,
  "url": "http://surf.scss.tcd.ie/_provider_/defense/missile_funding_Pakservice"
}