{
    "capability": "atomic",
    "description": "This service returns the current weather process condition of a given country.",
    "domains": [
        {
            "name": "Travel",
            "url": "http://www.surf.scss.tcd.ie/cityOntology/#Travel"
        }
    ],
    "file": "country_weatherprocess_service.owls",
    "id": "travel/country_weatherprocess_service",
    "inputs": [
        {
            "desc": "Input of service CountryWeatherProcessService",
            "name": "_COUNTRY",
            "type": "http://127.0.0.1/ontology/portal.owl#Country"
        }
    ],
    "name": "CountryWeatherProcessService",
    "outputs": [
        {
            "desc": "Output of service CountryWeatherProcessService",
            "name": "_WEATHERPROCESS",
            "type": "http://127.0.0.1/ontology/SUMO.owl#WeatherProcess"
        }
    ],
    "provider": {
        "type": "wsdn"
    },
    "state": true,
    "url": "http://surf.scss.tcd.ie/_provider_/travel/country_weatherprocess_service"
}