{
  "outputs": [
    {
      "name": "_MATCHING-ADDRESS",
      "type": "http://127.0.0.1/ontology/protonu.owl#Address",
      "desc": "Output of service Address location Yahoo Maps service."
    },
    {
      "name": "_PRECISION-LEVEL",
      "type": "http://127.0.0.1/ontology/geographydataset.owl#AccuracyMeasure",
      "desc": "Output of service Address location Yahoo Maps service."
    },
    {
      "name": "_LATITUDE",
      "type": "http://127.0.0.1/ontology/protont.owl#latitude",
      "desc": "Output of service Address location Yahoo Maps service."
    },
    {
      "name": "_LONGITUDE",
      "type": "http://127.0.0.1/ontology/protont.owl#longitude",
      "desc": "Output of service Address location Yahoo Maps service."
    }
  ],
  "capability": "atomic",
  "file": "getLocationOfAddressYahooMaps.owls",
  "provider": {
    "type": "wsdn"
  },
  "inputs": [
    {
      "name": "_ADDRESS",
      "type": "http://127.0.0.1/ontology/protonu.owl#Address",
      "desc": "Input of service Address location Yahoo Maps service."
    }
  ],
  "name": "Address location Yahoo Maps service.",
  "description": "This service allows you to find the specific latitude and longitude for a structured or unstructured address. It works for many countries world wide and it uses Yahoo! Maps in background. It returns also the matching formatted address, with its city, state, country, postal code.",
  "domains": [
    {
      "name": "Geography",
      "url": "http://www.surf.scss.tcd.ie/cityOntology/#Geography"
    },
    {
      "name": "Travel",
      "url": "http://www.surf.scss.tcd.ie/cityOntology/#Travel"
    }
  ],
  "id": "travel/getLocationOfAddressYahooMaps",
  "state": true,
  "url": "http://surf.scss.tcd.ie/_provider_/travel/getLocationOfAddressYahooMaps"
}