{
  "outputs": [
    {
      "name": "_EXPERIMENTING",
      "type": "http://127.0.0.1/ontology/SUMO.owl#Experimenting",
      "desc": "Output of service MedicalClinic Experiment service"
    }
  ],
  "capability": "atomic",
  "file": "medicalclinic_experimenting_service.owls",
  "provider": {
    "type": "webservice"
  },
  "inputs": [
    {
      "name": "_MEDICALCLINIC",
      "type": "http://127.0.0.1/ontology/Mid-level-ontology.owl#MedicalClinic",
      "desc": "Input of service MedicalClinic Experiment service"
    }
  ],
  "name": "MedicalClinic Experiment service",
  "description": "This service returns the types of experiments organized by a certain given medical clinic.",
  "domains": [
    {
      "name": "Health",
      "url": "http://www.surf.scss.tcd.ie/cityOntology/#Health"
    }
  ],
  "id": "medical/medicalclinic_experimenting_service",
  "state": true,
  "url": "http://surf.scss.tcd.ie/_provider_/medical/medicalclinic_experimenting_service"
}