{
  "outputs": [
    {
      "name": "_PREPAREDFOOD",
      "type": "http://127.0.0.1/ontology/Mid-level-ontology.owl#PreparedFood",
      "desc": "Output of service AvailablePreparedFoodService"
    },
    {
      "name": "_QUANTITY",
      "type": "http://127.0.0.1/ontology/support.owl#Quantity",
      "desc": "Output of service AvailablePreparedFoodService"
    }
  ],
  "capability": "atomic",
  "file": "Available_preparedfoodquantity_service.owls",
  "provider": {
    "type": "wsdn"
  },
  "inputs": [
    {
      "name": "_GROCERYSTORE",
      "type": "http://127.0.0.1/ontology/Mid-level-ontology.owl#GroceryStore",
      "desc": "Input of service AvailablePreparedFoodService"
    }
  ],
  "name": "AvailablePreparedFoodService",
  "description": "This service informs you about the prepared food type which isavailable in a certain grocerystore and its available quantity.",
  "domains": [
    {
      "name": "Food_and_Drinks",
      "url": "http://www.surf.scss.tcd.ie/cityOntology/#Food_and_Drinks"
    }
  ],
  "id": "food/grocerystore_preparedfoodquantity_service",
  "state": true,
  "url": "http://surf.scss.tcd.ie/_provider_/food/grocerystore_preparedfoodquantity_service"
}