{
  "outputs": [
    {
      "name": "_PUBLISHER",
      "type": "http://127.0.0.1/ontology/books.owl#Publisher",
      "desc": "Output of service BookPublisherService"
    }
  ],
  "capability": "atomic",
  "file": "book_publisher_service.owls",
  "provider": {
    "type": "webservice"
  },
  "inputs": [
    {
      "name": "_BOOK",
      "type": "http://127.0.0.1/ontology/books.owl#Book",
      "desc": "Input of service BookPublisherService"
    }
  ],
  "name": "BookPublisherService",
  "description": "This service returns name of publisher of a given certain book title.",
  "domains": [
    {
      "name": "Educational",
      "url": "http://www.surf.scss.tcd.ie/cityOntology/#Educational"
    }
  ],
  "id": "education/book_publisher_service",
  "state": true,
  "url": "http://surf.scss.tcd.ie/_provider_/education/book_publisher_service"
}