{
  "outputs": [
    {
      "name": "_COMPANY",
      "type": "http://127.0.0.1/ontology/finance_th_web.owl#company",
      "desc": "Output of service OccupationFinder"
    },
    {
      "name": "_SKILLEDOCCUPATION",
      "type": "http://127.0.0.1/ontology/Mid-level-ontology.owl#SkilledOccupation",
      "desc": "Output of service OccupationFinder"
    }
  ],
  "capability": "atomic",
  "file": "country_companyskilledoccupation_service.owls",
  "provider": {
    "type": "wsdn"
  },
  "inputs": [
    {
      "name": "_COUNTRY",
      "type": "http://127.0.0.1/ontology/portal.owl#Geographical-Region",
      "desc": "Input of service OccupationFinder"
    }
  ],
  "name": "OccupationFinder",
  "description": "This service finds skilled occupation positions in a given country, and also returns company who offers that job.",
  "domains": [
    {
      "name": "Educational",
      "url": "http://www.surf.scss.tcd.ie/cityOntology/#Educational"
    }
  ],
  "id": "education/country_companyskilledoccupation_service",
  "state": true,
  "url": "http://surf.scss.tcd.ie/_provider_/education/country_companyskilledoccupation_service"
}