{
  "outputs": [
    {
      "name": "_PRICE",
      "type": "http://127.0.0.1/ontology/concept.owl#Price",
      "desc": "Output of service Guddu ColaService"
    }
  ],
  "capability": "atomic",
  "file": "price_cola_Gudduservice.owls",
  "provider": {
    "type": "webservice"
  },
  "inputs": [
    {
      "name": "_COLA",
      "type": "http://127.0.0.1/ontology/my_ontology.owl#Cola",
      "desc": "Input of service Guddu ColaService"
    }
  ],
  "name": "Guddu ColaService",
  "description": "Guddu service returns the latest purchase price of a given cola drink type. The price is for 1 litre of cola drink.",
  "domains": [
    {
      "name": "Food_and_Drinks",
      "url": "http://www.surf.scss.tcd.ie/cityOntology/#Food_and_Drinks"
    }
  ],
  "id": "food/price_cola_service",
  "state": true,
  "url": "http://surf.scss.tcd.ie/_provider_/food/price_cola_service"
}