{
  "outputs": [
    {
      "name": "_LECTURER-IN-ACADEMIA",
      "type": "http://127.0.0.1/ontology/portal.owl#Lecturer-In-Academia",
      "desc": "Output of service UniversityLecturerService"
    }
  ],
  "capability": "atomic",
  "file": "university_lecturer-in-academia_service.owls",
  "provider": {
    "type": "wsdn"
  },
  "inputs": [
    {
      "name": "_UNIVERSITY",
      "type": "http://127.0.0.1/ontology/portal.owl#University",
      "desc": "Input of service UniversityLecturerService"
    }
  ],
  "name": "UniversityLecturerService",
  "description": "This service returns list of names of academic lecturers that teach at the given university.",
  "domains": [
    {
      "name": "Educational",
      "url": "http://www.surf.scss.tcd.ie/cityOntology/#Educational"
    }
  ],
  "id": "education/university_lecturer-in-academia_service",
  "state": true,
  "url": "http://surf.scss.tcd.ie/_provider_/education/university_lecturer-in-academia_service"
}