{
  "outputs": [
    {
      "name": "_AUTHOR",
      "type": "http://127.0.0.1/ontology/books.owl#Author",
      "desc": "Output of service NovelAuthorService"
    }
  ],
  "capability": "atomic",
  "file": "novel_author_service.owls",
  "provider": {
    "type": "asp"
  },
  "inputs": [
    {
      "name": "_NOVEL",
      "type": "http://127.0.0.1/ontology/books.owl#Novel",
      "desc": "Input of service NovelAuthorService"
    }
  ],
  "name": "NovelAuthorService",
  "description": "It is the most user friendly service to get the info of an author who wrote the given novel.",
  "domains": [
    {
      "name": "Educational",
      "url": "http://www.surf.scss.tcd.ie/cityOntology/#Educational"
    },
    {
      "name": "Entertainment_Products",
      "url": "http://www.surf.scss.tcd.ie/cityOntology/#Entertainment_Products"
    }
  ],
  "id": "books/novel_author_service",
  "state": true,
  "url": "http://surf.scss.tcd.ie/_provider_/books/novel_author_service"
}