{
  "outputs": [
    {
      "name": "_PREPAREDFOOD",
      "type": "http://127.0.0.1/ontology/Mid-level-ontology.owl#PreparedFood",
      "desc": "Output of service RequiredFoodService"
    },
    {
      "name": "_QUANTITY",
      "type": "http://127.0.0.1/ontology/support.owl#Quantity",
      "desc": "Output of service RequiredFoodService"
    }
  ],
  "capability": "atomic",
  "file": "Required_preparedfoodquantity_service.owls",
  "provider": {
    "type": "webservice"
  },
  "inputs": [
    {
      "name": "_GROCERYSTORE",
      "type": "http://127.0.0.1/ontology/Mid-level-ontology.owl#GroceryStore",
      "desc": "Input of service RequiredFoodService"
    }
  ],
  "name": "RequiredFoodService",
  "description": "This service informs you about the prepared food which is notavailable in the certain grocerystore and its required quantity.",
  "domains": [
    {
      "name": "Food_and_Drinks",
      "url": "http://www.surf.scss.tcd.ie/cityOntology/#Food_and_Drinks"
    }
  ],
  "id": "food/Required_preparedfoodquantity_service",
  "state": true,
  "url": "http://surf.scss.tcd.ie/_provider_/food/Required_preparedfoodquantity_service"
}