{
  "outputs": [
    {
      "name": "_ACTIVITY",
      "type": "http://127.0.0.1/ontology/travel.owl#Activity",
      "desc": "Output of service Inside GeopoliticalEntityInfoService"
    },
    {
      "name": "_HOTEL",
      "type": "http://127.0.0.1/ontology/travel.owl#Hotel",
      "desc": "Output of service Inside GeopoliticalEntityInfoService"
    }
  ],
  "capability": "atomic",
  "file": "geopolitical-entityrecorded-video_activityhotel_service.owls",
  "provider": {
    "type": "asp"
  },
  "inputs": [
    {
      "name": "_RECORDED-VIDEO",
      "type": "http://127.0.0.1/ontology/portal.owl#Recorded-Video",
      "desc": "Input of service Inside GeopoliticalEntityInfoService"
    },
    {
      "name": "_GEOPOLITICAL-ENTITY",
      "type": "http://127.0.0.1/ontology/portal.owl#Geopolitical-Entity",
      "desc": "Input of service Inside GeopoliticalEntityInfoService"
    }
  ],
  "name": "Inside GeopoliticalEntityInfoService",
  "description": "This service reads the input recorded video and returns information ofactivities and hotels of the given geopolitical entity.",
  "domains": [
    {
      "name": "Travel",
      "url": "http://www.surf.scss.tcd.ie/cityOntology/#Travel"
    }
  ],
  "id": "travel/geopolitical-entityrecorded-video_activityhotel_service",
  "state": true,
  "url": "http://surf.scss.tcd.ie/_provider_/travel/geopolitical-entityrecorded-video_activityhotel_service"
}