{
  "outputs": [
    {
      "name": "_PUBLISHER",
      "type": "http://127.0.0.1/ontology/books.owl#Publisher",
      "desc": "Output of service Romantic Publisher Service"
    }
  ],
  "capability": "atomic",
  "file": "romanticnovel_publisher_service.owls",
  "provider": {
    "type": "webservice"
  },
  "inputs": [
    {
      "name": "_ROMANTIC",
      "type": "http://127.0.0.1/ontology/books.owl#RomanticNovel",
      "desc": "Input of service Romantic Publisher Service"
    }
  ],
  "name": "Romantic Publisher Service",
  "description": "This service returns the name of a publisher of a certain romantic novel.",
  "domains": [
    {
      "name": "Entertainment_Products",
      "url": "http://www.surf.scss.tcd.ie/cityOntology/#Entertainment_Products"
    },
    {
      "name": "Educational",
      "url": "http://www.surf.scss.tcd.ie/cityOntology/#Educational"
    }
  ],
  "id": "books/romanticnovel_publisher_service",
  "state": true,
  "url": "http://surf.scss.tcd.ie/_provider_/books/romanticnovel_publisher_service"
}