{
  "outputs": [
    {
      "name": "_SPORTSPOSITION",
      "type": "http://127.0.0.1/ontology/Mid-level-ontology.owl#SportsPosition",
      "desc": "Output of service SportsPositionsService"
    }
  ],
  "capability": "atomic",
  "file": "country_sportsposition_service.owls",
  "provider": {
    "type": "wsdn"
  },
  "inputs": [
    {
      "name": "_COUNTRY",
      "type": "http://127.0.0.1/ontology/portal.owl#Country",
      "desc": "Input of service SportsPositionsService"
    }
  ],
  "name": "SportsPositionsService",
  "description": "This service returns sports positions available in a certain country national team,for instance coach of German national football team.",
  "domains": [
    {
      "name": "Educational",
      "url": "http://www.surf.scss.tcd.ie/cityOntology/#Educational"
    }
  ],
  "id": "education/country_sportsposition_service",
  "state": true,
  "url": "http://surf.scss.tcd.ie/_provider_/education/country_sportsposition_service"
}