{
  "outputs": [
    {
      "name": "_EXPERIMENTING",
      "type": "http://127.0.0.1/ontology/SUMO.owl#Experimenting",
      "desc": "Output of service OrganizationExp service"
    },
    {
      "name": "_TIMEDURATION",
      "type": "http://127.0.0.1/ontology/SUMO.owl#TimeDuration",
      "desc": "Output of service OrganizationExp service"
    }
  ],
  "capability": "atomic",
  "file": "organization_experimentingtimeduration_service.owls",
  "provider": {
    "type": "webservice"
  },
  "inputs": [
    {
      "name": "_ORGANIZATION",
      "type": "http://127.0.0.1/ontology/SUMO.owl#Organization",
      "desc": "Input of service OrganizationExp service"
    }
  ],
  "name": "OrganizationExp service",
  "description": "This service returns the student experiments, and its time duration also, organized by the certain organization.",
  "domains": [
    {
      "name": "Health",
      "url": "http://www.surf.scss.tcd.ie/cityOntology/#Health"
    }
  ],
  "id": "medical/organization_experimentingtimeduration_service",
  "state": true,
  "url": "http://surf.scss.tcd.ie/_provider_/medical/organization_experimentingtimeduration_service"
}