{
  "outputs": [
    {
      "name": "_PRICE",
      "type": "http://127.0.0.1/ontology/concept.owl#Price",
      "desc": "Output of service MonographPriceService"
    }
  ],
  "capability": "atomic",
  "file": "monograph_price_service.owls",
  "provider": {
    "type": "wsdn"
  },
  "inputs": [
    {
      "name": "_MONOGRAPH",
      "type": "http://127.0.0.1/ontology/books.owl#Monograph",
      "desc": "Input of service MonographPriceService"
    }
  ],
  "name": "MonographPriceService",
  "description": "This service returns price of a monograph.",
  "domains": [
    {
      "name": "Entertainment_Products",
      "url": "http://www.surf.scss.tcd.ie/cityOntology/#Entertainment_Products"
    },
    {
      "name": "Educational",
      "url": "http://www.surf.scss.tcd.ie/cityOntology/#Educational"
    }
  ],
  "id": "books/monograph_price_service",
  "state": true,
  "url": "http://surf.scss.tcd.ie/_provider_/books/monograph_price_service"
}