{
  "outputs": [
    {
      "name": "_WEATHERFRONT",
      "type": "http://127.0.0.1/ontology/Mid-level-ontology.owl#WeatherFront",
      "desc": "Output of service Country WeatherFront Service"
    }
  ],
  "capability": "atomic",
  "file": "country_weatherfront_service.owls",
  "provider": {
    "type": "wsdn"
  },
  "inputs": [
    {
      "name": "_COUNTRY",
      "type": "http://127.0.0.1/ontology/portal.owl#Country",
      "desc": "Input of service Country WeatherFront Service"
    }
  ],
  "name": "Country WeatherFront Service",
  "description": "This service informs about current weatherfront in a given country.",
  "domains": [
    {
      "name": "Travel",
      "url": "http://www.surf.scss.tcd.ie/cityOntology/#Travel"
    }
  ],
  "id": "travel/country_weatherfront_service",
  "state": true,
  "url": "http://surf.scss.tcd.ie/_provider_/travel/country_weatherfront_service"
}