{
  "outputs": [
    {
      "name": "_TAXEDPRICE",
      "type": "http://127.0.0.1/ontology/concept.owl#TaxedPrice",
      "desc": "Output of service Car Bicycle Taxed Price Service"
    }
  ],
  "capability": "atomic",
  "file": "carbicycle_taxedprice_service.owls",
  "provider": {
    "type": "asp"
  },
  "inputs": [
    {
      "name": "_BICYCLE",
      "type": "http://127.0.0.1/ontology/my_ontology.owl#Bicycle",
      "desc": "Input of service Car Bicycle Taxed Price Service"
    },
    {
      "name": "_CAR",
      "type": "http://127.0.0.1/ontology/my_ontology.owl#Car",
      "desc": "Input of service Car Bicycle Taxed Price Service"
    }
  ],
  "name": "Car Bicycle Taxed Price Service",
  "description": "This service returns the taxed purchase prices of the pair of a carand bicycle (the prices contain both new or used cars or bicycles).",
  "id": "economy/carbicycle_taxedprice_service",
  "state": true,
  "url": "http://surf.scss.tcd.ie/_provider_/economy/carbicycle_taxedprice_service"
}