{
  "outputs": [
    {
      "name": "_AUTHOR",
      "type": "http://127.0.0.1/ontology/books.owl#Author",
      "desc": "Output of service RomanticNovel Author Price Service"
    },
    {
      "name": "_PRICE",
      "type": "http://127.0.0.1/ontology/concept.owl#Price",
      "desc": "Output of service RomanticNovel Author Price Service"
    }
  ],
  "capability": "atomic",
  "file": "romanticnovel_authorprice_service.owls",
  "provider": {
    "type": "webservice"
  },
  "inputs": [
    {
      "name": "_ROMANTICNOVEL",
      "type": "http://127.0.0.1/ontology/books.owl#RomanticNovel",
      "desc": "Input of service RomanticNovel Author Price Service"
    }
  ],
  "name": "RomanticNovel Author Price Service",
  "description": "This service returns name of the author and price of a given romantic novel title.",
  "domains": [
    {
      "name": "Entertainment_Products",
      "url": "http://www.surf.scss.tcd.ie/cityOntology/#Entertainment_Products"
    }
  ],
  "id": "books/romanticnovel_authorprice_service",
  "state": true,
  "url": "http://surf.scss.tcd.ie/_provider_/books/romanticnovel_authorprice_service"
}