{
  "outputs": [
    {
      "name": "_AUTHOR",
      "type": "http://127.0.0.1/ontology/books.owl#Author",
      "desc": "Output of service BookAuthorService"
    }
  ],
  "capability": "atomic",
  "file": "book_author_service.owls",
  "provider": {
    "type": "asp"
  },
  "inputs": [
    {
      "name": "_BOOK",
      "type": "http://127.0.0.1/ontology/books.owl#Book",
      "desc": "Input of service BookAuthorService"
    }
  ],
  "name": "BookAuthorService",
  "description": "This service returns name of the author who wrote the book given by its title.",
  "domains": [
    {
      "name": "Educational",
      "url": "http://www.surf.scss.tcd.ie/cityOntology/#Educational"
    },
    {
      "name": "Entertainment_Products",
      "url": "http://www.surf.scss.tcd.ie/cityOntology/#Entertainment_Products"
    }
  ],
  "id": "books/book_author_service",
  "state": true,
  "url": "http://surf.scss.tcd.ie/_provider_/books/book_author_service"
}