{
    "capability": "atomic",
    "description": "This service returns monographs written by the given author. The taxfree price is also informed.",
    "domains": [
        {
            "name": "Research_and_Science",
            "url": "http://www.surf.scss.tcd.ie/cityOntology/#Research_and_Science"
        }
    ],
    "file": "author_monographtaxfreeprice_service.owls",
    "id": "books/author_monographtaxfreeprice_service",
    "inputs": [
        {
            "desc": "Input of service Author Monograph TaxFreePrice Service",
            "name": "_AUTHOR",
            "type": "http://127.0.0.1/ontology/books.owl#Author"
        }
    ],
    "name": "Author Monograph TaxFreePrice Service",
    "outputs": [
        {
            "desc": "Output of service Author Monograph TaxFreePrice Service",
            "name": "_MONOGRAPH",
            "type": "http://127.0.0.1/ontology/books.owl#Monograph"
        },
        {
            "desc": "Output of service Author Monograph TaxFreePrice Service",
            "name": "_TAXFREEPRICE",
            "type": "http://127.0.0.1/ontology/concept.owl#TaxFreePrice"
        }
    ],
    "provider": {
        "type": "asp"
    },
    "state": true,
    "url": "http://surf.scss.tcd.ie/_provider_/books/author_monographtaxfreeprice_service"
}