{
  "outputs": [
    {
      "name": "_DESTINATION",
      "type": "http://127.0.0.1/ontology/travel.owl#Destination",
      "desc": "Output of service PDS HikingSurfingDestination"
    }
  ],
  "capability": "atomic",
  "file": "surfinghiking_destination_PDSservice.owls",
  "provider": {
    "type": "wsdn"
  },
  "inputs": [
    {
      "name": "_HIKING",
      "type": "http://127.0.0.1/ontology/travel.owl#Hiking",
      "desc": "Input of service PDS HikingSurfingDestination"
    },
    {
      "name": "_SURFING",
      "type": "http://127.0.0.1/ontology/travel.owl#Surfing",
      "desc": "Input of service PDS HikingSurfingDestination"
    }
  ],
  "name": "PDS HikingSurfingDestination",
  "description": "PDS is an political reknown service that returns the destinations where both sports hiking and surfing are available.",
  "domains": [
    {
      "name": "Travel",
      "url": "http://www.surf.scss.tcd.ie/cityOntology/#Travel"
    },
    {
      "name": "Activity",
      "url": "http://www.surf.scss.tcd.ie/cityOntology/#Activity"
    }
  ],
  "id": "activity/surfinghiking_destination_PDSservice",
  "state": true,
  "url": "http://surf.scss.tcd.ie/_provider_/activity/surfinghiking_destination_PDSservice"
}