{
  "outputs": [
    {
      "name": "_PRICE",
      "type": "http://127.0.0.1/ontology/concept.owl#Price",
      "desc": "Output of service CarBicyclePrice service"
    }
  ],
  "capability": "atomic",
  "file": "carbicycle_price_service.owls",
  "provider": {
    "type": "webservice"
  },
  "inputs": [
    {
      "name": "_BICYCLE",
      "type": "http://127.0.0.1/ontology/my_ontology.owl#Bicycle",
      "desc": "Input of service CarBicyclePrice service"
    },
    {
      "name": "_CAR",
      "type": "http://127.0.0.1/ontology/my_ontology.owl#Car",
      "desc": "Input of service CarBicyclePrice service"
    }
  ],
  "name": "CarBicyclePrice service",
  "description": "This service returns purchase prices of the pair of a carand bicycle (the prices contain both new or used cars or bicycles).",
  "domains": [
    {
      "name": "Vehicle_Sale_and_Rent",
      "url": "http://www.surf.scss.tcd.ie/cityOntology/#Vehicle_Sale_and_Rent"
    }
  ],
  "id": "vehicle/carbicycle_price_service",
  "state": true,
  "url": "http://surf.scss.tcd.ie/_provider_/vehicle/carbicycle_price_service"
}