{
  "outputs": [
    {
      "name": "_DESTINATION",
      "type": "http://127.0.0.1/ontology/travel.owl#Destination",
      "desc": "Output of service SurfingLearningCentredOganizationDestinationService"
    }
  ],
  "capability": "atomic",
  "file": "learning-centred-organizationsurfing_destination_service.owls",
  "provider": {
    "type": "webservice"
  },
  "inputs": [
    {
      "name": "_SURFING",
      "type": "http://127.0.0.1/ontology/travel.owl#Surfing",
      "desc": "Input of service SurfingLearningCentredOganizationDestinationService"
    },
    {
      "name": "_LEARNING-CENTRED-ORGANIZATION",
      "type": "http://127.0.0.1/ontology/portal.owl#Learning-Centred-Organization",
      "desc": "Input of service SurfingLearningCentredOganizationDestinationService"
    }
  ],
  "name": "SurfingLearningCentredOganizationDestinationService",
  "description": "This service returns destinations where reputable generic agent works for given learning center organization and is responsiblefor sports especially surfing.",
  "domains": [
    {
      "name": "Travel",
      "url": "http://www.surf.scss.tcd.ie/cityOntology/#Travel"
    },
    {
      "name": "Activity",
      "url": "http://www.surf.scss.tcd.ie/cityOntology/#Activity"
    }
  ],
  "id": "activity/learning-centred-organizationsurfing_destination_service",
  "state": true,
  "url": "http://surf.scss.tcd.ie/_provider_/activity/learning-centred-organizationsurfing_destination_service"
}