{
  "outputs": [
    {
      "name": "_ROOMVIDEO",
      "type": "http://www.surf.scss.tcd.ie/IoTservices.owl#roomVideo",
      "desc": "Output of service activate_room_camera"
    }
  ],
  "provider": {
    "type": "asp"
  },
  "inputs": [
    {
      "name": "_SELECTEDACCOMMODATION",
      "type": "http://www.surf.scss.tcd.ie/IoTservices.owl#selectedAccommodation",
      "desc": "Input of service activate_room_camera"
    }
  ],
  "name": "activate_room_camera",
  "description": "This is the service activate_room_camera",
  "domains": [
    {
      "name": "Accommodation",
      "url": "http://www.surf.scss.tcd.ie/cityOntology/#Accommodation"
    }
  ],
  "id": "accommodation/84_activate_room_camera",
  "state": true,
  "url": "http://surf.scss.tcd.ie/_provider_/accommodation/84_activate_room_camera"
}