{
    "capability": "atomic",
    "description": "This service returns coffee and whiskey (products) for the given recommended priceand avaialbe in the particular hotel.If hotel input is not given then it returns coffee and whiskey products for the given price..",
    "domains": [
        {
            "name": "Food_and_Drinks",
            "url": "http://www.surf.scss.tcd.ie/cityOntology/#Food_and_Drinks"
        }
    ],
    "file": "hotelrecommendedprice_coffeewhiskey_service.owls",
    "id": "food/hotelrecommendedprice_coffeewhiskey_service",
    "inputs": [
        {
            "desc": "Input of service RecommendedPriceCoffeeWhiskey Hotel Service",
            "name": "_RECOMMENDEDPRICE",
            "type": "http://127.0.0.1/ontology/concept.owl#RecommendedPrice"
        },
        {
            "desc": "Input of service RecommendedPriceCoffeeWhiskey Hotel Service",
            "name": "_HOTEL",
            "type": "http://127.0.0.1/ontology/travel.owl#Hotel"
        }
    ],
    "name": "RecommendedPriceCoffeeWhiskey Hotel Service",
    "outputs": [
        {
            "desc": "Output of service RecommendedPriceCoffeeWhiskey Hotel Service",
            "name": "_COFFEE",
            "type": "http://127.0.0.1/ontology/my_ontology.owl#Coffee"
        },
        {
            "desc": "Output of service RecommendedPriceCoffeeWhiskey Hotel Service",
            "name": "_WHISKEY",
            "type": "http://127.0.0.1/ontology/my_ontology.owl#Whiskey"
        }
    ],
    "provider": {
        "type": "webservice"
    },
    "state": true,
    "url": "http://surf.scss.tcd.ie/_provider_/food/hotelrecommendedprice_coffeewhiskey_service"
}