{
  "outputs": [
    {
      "name": "_PRICE",
      "type": "http://127.0.0.1/ontology/concept.owl#Price",
      "desc": "Output of service 4WheeledCar1PersonBicyclePrice service"
    }
  ],
  "capability": "atomic",
  "file": "1personbicycle4wheeledcar_price_service.owls",
  "provider": {
    "type": "wsdn"
  },
  "inputs": [
    {
      "name": "_4WHEELEDCAR",
      "type": "http://127.0.0.1/ontology/my_ontology.owl#FourWheeledCar",
      "desc": "Input of service 4WheeledCar1PersonBicyclePrice service"
    },
    {
      "name": "_1PERSONBICYCLE",
      "type": "http://127.0.0.1/ontology/my_ontology.owl#OnePersonBicycle",
      "desc": "Input of service 4WheeledCar1PersonBicyclePrice service"
    }
  ],
  "name": "4WheeledCar1PersonBicyclePrice service",
  "description": "This service returns list of prices of the available pair of a four wheeled car modelsand 1(one) person bicycle models.",
  "domains": [
    {
      "name": "Vehicle_Sale_and_Rent",
      "url": "http://www.surf.scss.tcd.ie/cityOntology/#Vehicle_Sale_and_Rent"
    }
  ],
  "id": "vehicle/1personbicycle4wheeledcar_price_service",
  "state": true,
  "url": "http://surf.scss.tcd.ie/_provider_/vehicle/1personbicycle4wheeledcar_price_service"
}