{
    "capability": "atomic",
    "description": "MedDiag provides a service to return a type of diagnostic investigatingin a certain given hospital.",
    "domains": [
        {
            "name": "Health",
            "url": "http://www.surf.scss.tcd.ie/cityOntology/#Health"
        }
    ],
    "file": "hospital_diagnosticprocess_MedDiagservice.owls",
    "id": "medical/hospital_diagnosticprocess_service",
    "inputs": [
        {
            "desc": "Input of service MedDiag service",
            "name": "_HOSPITAL",
            "type": "http://127.0.0.1/ontology/Mid-level-ontology.owl#Hospital"
        }
    ],
    "name": "MedDiag service",
    "outputs": [
        {
            "desc": "Output of service MedDiag service",
            "name": "_DIAGNOSTICPROCESS",
            "type": "http://127.0.0.1/ontology/SUMO.owl#DiagnosticProcess"
        }
    ],
    "provider": {
        "type": "webservice"
    },
    "state": true,
    "url": "http://surf.scss.tcd.ie/_provider_/medical/hospital_diagnosticprocess_service"
}