{
  "outputs": [
    {
      "name": "_lecturer-in-academia",
      "type": "string",
      "desc": "Output of service HigherEducationalOrganizationLecturers"
    }
  ],
  "provider": {
    "type": "asp"
  },
  "inputs": [
    {
      "name": "_higher-educational-organization",
      "type": "string",
      "desc": "Input of service HigherEducationalOrganizationLecturers"
    }
  ],
  "name": "HigherEducationalOrganizationLecturers",
  "description": "It is one of the most used service to return Lecturers of the given higher educational organization, like universities..",
  "domains": [
    {
      "name": "Religious",
      "url": "http://www.surf.scss.tcd.ie/cityOntology/#Religious"
    }
  ],
  "id": "educational/higher-educational-organization_lecturer-in-academia_service",
  "state": true,
  "url": "http://surf.scss.tcd.ie/_provider_/educational/higher-educational-organization_lecturer-in-academia_service"
}