{
  "outputs": [
    {
      "name": "_PUBLISHER",
      "type": "http://127.0.0.1/ontology/books.owl#Publisher",
      "desc": "Output of service Short-Story Publisher Service"
    }
  ],
  "capability": "atomic",
  "file": "short-story_publisher_service.owls",
  "provider": {
    "type": "asp"
  },
  "inputs": [
    {
      "name": "_SHORT-STORY",
      "type": "http://127.0.0.1/ontology/books.owl#Short-Story",
      "desc": "Input of service Short-Story Publisher Service"
    }
  ],
  "name": "Short-Story Publisher Service",
  "description": "This service returns publisher of a certain short-story.",
  "domains": [
    {
      "name": "Entertainment_Products",
      "url": "http://www.surf.scss.tcd.ie/cityOntology/#Entertainment_Products"
    },
    {
      "name": "Educational",
      "url": "http://www.surf.scss.tcd.ie/cityOntology/#Educational"
    }
  ],
  "id": "books/short-story_publisher_service",
  "state": true,
  "url": "http://surf.scss.tcd.ie/_provider_/books/short-story_publisher_service"
}