{
  "outputs": [
    {
      "name": "_COFFEE",
      "type": "http://127.0.0.1/ontology/my_ontology.owl#Coffee",
      "desc": "Output of service 2for1CW brand Service"
    },
    {
      "name": "_WHISKEY",
      "type": "http://127.0.0.1/ontology/my_ontology.owl#Whiskey",
      "desc": "Output of service 2for1CW brand Service"
    },
    {
      "name": "_SYMBOLICSTRING",
      "type": "http://127.0.0.1/ontology/SUMO.owl#SymbolicString",
      "desc": "Output of service 2for1CW brand Service"
    }
  ],
  "capability": "atomic",
  "file": "recommendedprice_coffeewhiskeysymbolicstring_service.owls",
  "provider": {
    "type": "asp"
  },
  "inputs": [
    {
      "name": "_RECOMMENDEDPRICE",
      "type": "http://127.0.0.1/ontology/concept.owl#RecommendedPrice",
      "desc": "Input of service 2for1CW brand Service"
    }
  ],
  "name": "2for1CW brand Service",
  "description": "This service returns a coffee and a whiskey for the given recommended price,also the brand name of the both products.",
  "domains": [
    {
      "name": "Food_and_Drinks",
      "url": "http://www.surf.scss.tcd.ie/cityOntology/#Food_and_Drinks"
    }
  ],
  "id": "food/recommendedprice_coffeewhiskeysymbolicstring_service",
  "state": true,
  "url": "http://surf.scss.tcd.ie/_provider_/food/recommendedprice_coffeewhiskeysymbolicstring_service"
}