{
  "outputs": [
    {
      "name": "_weatherseason",
      "type": "string",
      "desc": "Output of service GEIZ weather service"
    },
    {
      "name": "_timeposition",
      "type": "string",
      "desc": "Output of service GEIZ weather service"
    }
  ],
  "provider": {
    "type": "wsdn"
  },
  "inputs": [
    {
      "name": "_geopolitical-entity",
      "type": "string",
      "desc": "Input of service GEIZ weather service"
    }
  ],
  "name": "GEIZ weather service",
  "description": "GEIZ service returns weather season condition of ageopolitical region, and also its timeposition.",
  "domains": [
    {
      "name": "Finance",
      "url": "http://www.surf.scss.tcd.ie/cityOntology/#Finance"
    }
  ],
  "id": "environmental/geopolitical-entity_weatherseasontimeposition_service",
  "state": true,
  "url": "http://surf.scss.tcd.ie/_provider_/environmental/geopolitical-entity_weatherseasontimeposition_service"
}