{
  "outputs": [
    {
      "name": "_PUBLICATION",
      "type": "http://127.0.0.1/ontology/portal.owl#Publication",
      "desc": "Output of service PublicationFinderService"
    },
    {
      "name": "_AUTHOR",
      "type": "http://127.0.0.1/ontology/books.owl#Author",
      "desc": "Output of service PublicationFinderService"
    }
  ],
  "capability": "atomic",
  "file": "publication-number_publicationauthor_service.owls",
  "provider": {
    "type": "asp"
  },
  "inputs": [
    {
      "name": "_PUBLICATION-NUMBER",
      "type": "http://127.0.0.1/ontology/portal.owl#Publication-Number",
      "desc": "Input of service PublicationFinderService"
    }
  ],
  "name": "PublicationFinderService",
  "description": "This service finds a publication on publication number,it also returns also its author.",
  "domains": [
    {
      "name": "Educational",
      "url": "http://www.surf.scss.tcd.ie/cityOntology/#Educational"
    }
  ],
  "id": "education/publication-number_publicationauthor_service",
  "state": true,
  "url": "http://surf.scss.tcd.ie/_provider_/education/publication-number_publicationauthor_service"
}