{
    "capability": "atomic",
    "description": "This service returns author of the given science-fiction book.",
    "domains": [
        {
            "name": "Research_and_Science",
            "url": "http://www.surf.scss.tcd.ie/cityOntology/#Research_and_Science"
        }
    ],
    "file": "sciencefictionbook_author_service.owls",
    "id": "education/sciencefictionbook_author_service",
    "inputs": [
        {
            "desc": "Input of service SFBookAuthorService",
            "name": "_SCIENCEFICTIONBOOK",
            "type": "http://127.0.0.1/ontology/books.owl#ScienceFictionBook"
        }
    ],
    "name": "SFBookAuthorService",
    "outputs": [
        {
            "desc": "Output of service SFBookAuthorService",
            "name": "_AUTHOR",
            "type": "http://127.0.0.1/ontology/books.owl#Author"
        }
    ],
    "provider": {
        "type": "wsdn"
    },
    "state": true,
    "url": "http://surf.scss.tcd.ie/_provider_/education/sciencefictionbook_author_service"
}