{
  "outputs": [
    {
      "name": "_HOTEL",
      "type": "http://127.0.0.1/ontology/travel.owl#Hotel",
      "desc": "Output of service HotelInfoService"
    }
  ],
  "capability": "atomic",
  "file": "towncountry_hotel_service.owls",
  "provider": {
    "type": "asp"
  },
  "inputs": [
    {
      "name": "_COUNTRY",
      "type": "http://127.0.0.1/ontology/portal.owl#Country",
      "desc": "Input of service HotelInfoService"
    },
    {
      "name": "_TOWN",
      "type": "http://127.0.0.1/ontology/portal.owl#Town",
      "desc": "Input of service HotelInfoService"
    }
  ],
  "name": "HotelInfoService",
  "description": "This service returns information of available hotels located in the given town of a country.",
  "domains": [
    {
      "name": "Travel",
      "url": "http://www.surf.scss.tcd.ie/cityOntology/#Travel"
    },
    {
      "name": "Accommodation",
      "url": "http://www.surf.scss.tcd.ie/cityOntology/#Accommodation"
    }
  ],
  "id": "accommodation/towncountry_hotel_service",
  "state": true,
  "url": "http://surf.scss.tcd.ie/_provider_/accommodation/towncountry_hotel_service"
}