{
  "outputs": [
    {
      "name": "_accommodation",
      "type": "string",
      "desc": "Output of service AccomodationInfoService"
    }
  ],
  "provider": {
    "type": "webservice"
  },
  "inputs": [
    {
      "name": "_country",
      "type": "string",
      "desc": "Input of service AccomodationInfoService"
    },
    {
      "name": "_city",
      "type": "string",
      "desc": "Input of service AccomodationInfoService"
    }
  ],
  "name": "AccomodationInfoService",
  "description": "This service returns accomodation information, hotel, resturant etcin the city of the country.",
  "domains": [
    {
      "name": "Activity",
      "url": "http://www.surf.scss.tcd.ie/cityOntology/#Activity"
    }
  ],
  "id": "tourism/citycountry_accommodation_service",
  "state": true,
  "url": "http://surf.scss.tcd.ie/_provider_/tourism/citycountry_accommodation_service"
}