{
    "capability": "atomic",
    "description": "This service finds positions for professionals in a given country and also returns organization who offers that job.",
    "domains": [
        {
            "name": "Industry",
            "url": "http://www.surf.scss.tcd.ie/cityOntology/#Industry"
        }
    ],
    "file": "country_organizationprofession_service.owls",
    "id": "education/country_organizationprofession_service",
    "inputs": [
        {
            "desc": "Input of service Country Organization Profession Service",
            "name": "_COUNTRY",
            "type": "http://127.0.0.1/ontology/portal.owl#Country"
        }
    ],
    "name": "Country Organization Profession Service",
    "outputs": [
        {
            "desc": "Output of service Country Organization Profession Service",
            "name": "_ORGANIZATION",
            "type": "http://127.0.0.1/ontology/finance_th_web.owl#organization"
        },
        {
            "desc": "Output of service Country Organization Profession Service",
            "name": "_PROFESSION",
            "type": "http://127.0.0.1/ontology/Mid-level-ontology.owl#Profession"
        }
    ],
    "provider": {
        "type": "webservice"
    },
    "state": true,
    "url": "http://surf.scss.tcd.ie/_provider_/education/country_organizationprofession_service"
}