{
    "capability": "atomic",
    "description": "This service returns names of national parks which provide given activity.",
    "domains": [
        {
            "name": "Activity",
            "url": "http://www.surf.scss.tcd.ie/cityOntology/#Activity"
        }
    ],
    "file": "activity_nationalpark_service.owls",
    "id": "travel/activity_nationalpark_service",
    "inputs": [
        {
            "desc": "Input of service Activity Nationalpark Service",
            "name": "_ACTIVITY",
            "type": "http://127.0.0.1/ontology/travel.owl#Activity"
        }
    ],
    "name": "Activity Nationalpark Service",
    "outputs": [
        {
            "desc": "Output of service Activity Nationalpark Service",
            "name": "_NATIONALPARK",
            "type": "http://127.0.0.1/ontology/travel.owl#NationalPark"
        }
    ],
    "provider": {
        "type": "asp"
    },
    "state": true,
    "url": "http://surf.scss.tcd.ie/_provider_/travel/activity_nationalpark_service"
}