{
  "outputs": [
    {
      "name": "_PRICE",
      "type": "http://127.0.0.1/ontology/concept.owl#Price",
      "desc": "Output of service BookPrice"
    }
  ],
  "capability": "atomic",
  "file": "bookperson_price_service.owls",
  "provider": {
    "type": "webservice"
  },
  "inputs": [
    {
      "name": "_BOOK",
      "type": "http://127.0.0.1/ontology/books.owl#Book",
      "desc": "Input of service BookPrice"
    },
    {
      "name": "_PERSON",
      "type": "http://127.0.0.1/ontology/books.owl#Person",
      "desc": "Input of service BookPrice"
    }
  ],
  "name": "BookPrice",
  "description": "This service returns price of lending a given book for time slot of 2 weeks for an authorised person.",
  "domains": [
    {
      "name": "Entertainment_Products",
      "url": "http://www.surf.scss.tcd.ie/cityOntology/#Entertainment_Products"
    },
    {
      "name": "Educational",
      "url": "http://www.surf.scss.tcd.ie/cityOntology/#Educational"
    }
  ],
  "id": "books/bookperson_price_service",
  "state": true,
  "url": "http://surf.scss.tcd.ie/_provider_/books/bookperson_price_service"
}