{
  "outputs": [
    {
      "name": "_AUTHOR",
      "type": "http://127.0.0.1/ontology/books.owl#Author",
      "desc": "Output of service Monograph Author Service"
    }
  ],
  "capability": "atomic",
  "file": "monograph_author_service.owls",
  "provider": {
    "type": "asp"
  },
  "inputs": [
    {
      "name": "_MONOGRAPH",
      "type": "http://127.0.0.1/ontology/books.owl#Monograph",
      "desc": "Input of service Monograph Author Service"
    }
  ],
  "name": "Monograph Author Service",
  "description": "This service returns author of a certain monograph.",
  "domains": [
    {
      "name": "Educational",
      "url": "http://www.surf.scss.tcd.ie/cityOntology/#Educational"
    },
    {
      "name": "Entertainment_Products",
      "url": "http://www.surf.scss.tcd.ie/cityOntology/#Entertainment_Products"
    }
  ],
  "id": "books/monograph_author_service",
  "state": true,
  "url": "http://surf.scss.tcd.ie/_provider_/books/monograph_author_service"
}