{
  "outputs": [
    {
      "name": "_PROFESSION",
      "type": "http://127.0.0.1/ontology/Mid-level-ontology.owl#Profession",
      "desc": "Output of service Company Profession service"
    }
  ],
  "capability": "atomic",
  "file": "company_profession_service.owls",
  "provider": {
    "type": "webservice"
  },
  "inputs": [
    {
      "name": "_COMPANY",
      "type": "http://127.0.0.1/ontology/portal.owl#Company",
      "desc": "Input of service Company Profession service"
    }
  ],
  "name": "Company Profession service",
  "description": "You can search available job positions for professionals in a given company.",
  "domains": [
    {
      "name": "Educational",
      "url": "http://www.surf.scss.tcd.ie/cityOntology/#Educational"
    }
  ],
  "id": "education/company_profession_service",
  "state": true,
  "url": "http://surf.scss.tcd.ie/_provider_/education/company_profession_service"
}