{
  "outputs": [
    {
      "name": "_SCIENCEFICTIONBOOK",
      "type": "http://127.0.0.1/ontology/books.owl#ScienceFictionBook",
      "desc": "Output of service Author ScienceFictionBook Price Service"
    },
    {
      "name": "_PRICE",
      "type": "http://127.0.0.1/ontology/concept.owl#Price",
      "desc": "Output of service Author ScienceFictionBook Price Service"
    }
  ],
  "capability": "atomic",
  "file": "author_sciencefictionbookprice_service.owls",
  "provider": {
    "type": "asp"
  },
  "inputs": [
    {
      "name": "_AUTHOR",
      "type": "http://127.0.0.1/ontology/books.owl#Author",
      "desc": "Input of service Author ScienceFictionBook Price Service"
    }
  ],
  "name": "Author ScienceFictionBook Price Service",
  "description": "This service returns science fiction books written by the given authorand their price as well.",
  "domains": [
    {
      "name": "Entertainment_Products",
      "url": "http://www.surf.scss.tcd.ie/cityOntology/#Entertainment_Products"
    }
  ],
  "id": "books/author_sciencefictionbookprice_service",
  "state": true,
  "url": "http://surf.scss.tcd.ie/_provider_/books/author_sciencefictionbookprice_service"
}