{
  "outputs": [
    {
      "name": "_ACCOMMODATIONCONFIRMATION",
      "type": "http://www.surf.scss.tcd.ie/IoTservices.owl#accommodationConfirmation",
      "desc": "Output of service accommodation_confirmation"
    }
  ],
  "provider": {
    "type": "asp"
  },
  "inputs": [
    {
      "name": "_ROOMVIDEO",
      "type": "http://www.surf.scss.tcd.ie/IoTservices.owl#roomVideo",
      "desc": "Input of service accommodation_confirmation"
    }
  ],
  "name": "accommodation_confirmation",
  "description": "This is the service accommodation_confirmation",
  "domains": [
    {
      "name": "Accommodation",
      "url": "http://www.surf.scss.tcd.ie/cityOntology/#Accommodation"
    }
  ],
  "id": "accommodation/85_accommodation_confirmation",
  "state": true,
  "url": "http://surf.scss.tcd.ie/_provider_/accommodation/85_accommodation_confirmation"
}