{
  "outputs": [
    {
      "name": "_LATITUDE",
      "type": "http://127.0.0.1/ontology/protont.owl#latitude",
      "desc": "Output of service Postal Address geocoder service."
    },
    {
      "name": "_LONGITUDE",
      "type": "http://127.0.0.1/ontology/protont.owl#longitude",
      "desc": "Output of service Postal Address geocoder service."
    }
  ],
  "capability": "atomic",
  "file": "geocodeUSAddress.owls",
  "provider": {
    "type": "webservice"
  },
  "inputs": [
    {
      "name": "_ADDRESS",
      "type": "http://127.0.0.1/ontology/protonu.owl#Address",
      "desc": "Input of service Postal Address geocoder service."
    },
    {
      "name": "_CITY",
      "type": "http://127.0.0.1/ontology/protonu.owl#City",
      "desc": "Input of service Postal Address geocoder service."
    },
    {
      "name": "_STATE",
      "type": "http://127.0.0.1/ontology/protonu.owl#State",
      "desc": "Input of service Postal Address geocoder service."
    },
    {
      "name": "_ZIPCODE",
      "type": "http://127.0.0.1/ontology/geographydataset.owl#PostalCode",
      "desc": "Input of service Postal Address geocoder service."
    }
  ],
  "name": "Postal Address geocoder service.",
  "description": "This service returns latitude and longitude location of a given US structured postal address, where address city, state and zipcode are also given. If the address is not found, an error is returned.",
  "domains": [
    {
      "name": "Geography",
      "url": "http://www.surf.scss.tcd.ie/cityOntology/#Geography"
    }
  ],
  "id": "geography/address_location_service",
  "state": true,
  "url": "http://surf.scss.tcd.ie/_provider_/geography/address_location_service"
}