{
  "outputs": [
    {
      "name": "_NOVEL",
      "type": "http://127.0.0.1/ontology/books.owl#Novel",
      "desc": "Output of service Author Novel RecommendedPrice Service"
    },
    {
      "name": "_RECOMMENDEDPRICE",
      "type": "http://127.0.0.1/ontology/concept.owl#RecommendedPrice",
      "desc": "Output of service Author Novel RecommendedPrice Service"
    }
  ],
  "capability": "atomic",
  "file": "author_novelrecommendedprice_service.owls",
  "provider": {
    "type": "webservice"
  },
  "inputs": [
    {
      "name": "_AUTHOR",
      "type": "http://127.0.0.1/ontology/books.owl#Author",
      "desc": "Input of service Author Novel RecommendedPrice Service"
    }
  ],
  "name": "Author Novel RecommendedPrice Service",
  "description": "This service returns novels written by the given author. The recommended price is also informed.",
  "domains": [
    {
      "name": "Entertainment_Products",
      "url": "http://www.surf.scss.tcd.ie/cityOntology/#Entertainment_Products"
    },
    {
      "name": "Educational",
      "url": "http://www.surf.scss.tcd.ie/cityOntology/#Educational"
    }
  ],
  "id": "books/author_novelrecommendedprice_service",
  "state": true,
  "url": "http://surf.scss.tcd.ie/_provider_/books/author_novelrecommendedprice_service"
}