{
    "capability": "atomic",
    "description": "This service informs about butter items that are available in a given grocery store and its available quantity.",
    "domains": [
        {
            "name": "Food_and_Drinks",
            "url": "http://www.surf.scss.tcd.ie/cityOntology/#Food_and_Drinks"
        }
    ],
    "file": "grocerystore_butterquantity_service.owls",
    "id": "food/grocerystore_butterquantity_service",
    "inputs": [
        {
            "desc": "Input of service GroceryStore Butter Quantity Service",
            "name": "_GROCERYSTORE",
            "type": "http://127.0.0.1/ontology/Mid-level-ontology.owl#GroceryStore"
        }
    ],
    "name": "GroceryStore Butter Quantity Service",
    "outputs": [
        {
            "desc": "Output of service GroceryStore Butter Quantity Service",
            "name": "_BUTTER",
            "type": "http://127.0.0.1/ontology/Mid-level-ontology.owl#Butter"
        },
        {
            "desc": "Output of service GroceryStore Butter Quantity Service",
            "name": "_QUANTITY",
            "type": "http://127.0.0.1/ontology/support.owl#Quantity"
        }
    ],
    "provider": {
        "type": "wsdn"
    },
    "state": true,
    "url": "http://surf.scss.tcd.ie/_provider_/food/grocerystore_butterquantity_service"
}