{
  "outputs": [
    {
      "name": "_MAXPRICE",
      "type": "http://127.0.0.1/ontology/concept.owl#MaxPrice",
      "desc": "Output of service Beverage MaxPrice Quantity Service"
    },
    {
      "name": "_QUANTITY",
      "type": "http://127.0.0.1/ontology/support.owl#Quantity",
      "desc": "Output of service Beverage MaxPrice Quantity Service"
    }
  ],
  "capability": "atomic",
  "file": "beverage_maxpricequantity_service.owls",
  "provider": {
    "type": "webservice"
  },
  "inputs": [
    {
      "name": "_BEVERAGE",
      "type": "http://127.0.0.1/ontology/SUMO.owl#Beverage",
      "desc": "Input of service Beverage MaxPrice Quantity Service"
    }
  ],
  "name": "Beverage MaxPrice Quantity Service",
  "description": "This service informs the quantity and maximum pruchase market price of a given beverage product.",
  "domains": [
    {
      "name": "Food_and_Drinks",
      "url": "http://www.surf.scss.tcd.ie/cityOntology/#Food_and_Drinks"
    }
  ],
  "id": "food/beverage_maxpricequantity_service",
  "state": true,
  "url": "http://surf.scss.tcd.ie/_provider_/food/beverage_maxpricequantity_service"
}