{
  "outputs": [
    {
      "name": "_ACCOMMODATION",
      "type": "http://127.0.0.1/ontology/travel.owl#Accommodation",
      "desc": "Output of service City Accommodation Service"
    }
  ],
  "capability": "atomic",
  "file": "city_accommodation_service.owls",
  "provider": {
    "type": "wsdn"
  },
  "inputs": [
    {
      "name": "_CITY",
      "type": "http://127.0.0.1/ontology/portal.owl#City",
      "desc": "Input of service City Accommodation Service"
    }
  ],
  "name": "City Accommodation Service",
  "description": "This service returns information about accommodations in a given city.",
  "domains": [
    {
      "name": "Travel",
      "url": "http://www.surf.scss.tcd.ie/cityOntology/#Travel"
    },
    {
      "name": "Accommodation",
      "url": "http://www.surf.scss.tcd.ie/cityOntology/#Accommodation"
    }
  ],
  "id": "accommodation/city_accommodation_service",
  "state": true,
  "url": "http://surf.scss.tcd.ie/_provider_/accommodation/city_accommodation_service"
}