{
  "outputs": [
    {
      "name": "_ORGANIZATION",
      "type": "http://127.0.0.1/ontology/finance_th_web.owl#organization",
      "desc": "Output of service Geopolitical-Entity Organization OccupationalTrade Service"
    },
    {
      "name": "_OCCUPATIONALTRADE",
      "type": "http://127.0.0.1/ontology/Mid-level-ontology.owl#OccupationalTrade",
      "desc": "Output of service Geopolitical-Entity Organization OccupationalTrade Service"
    }
  ],
  "capability": "atomic",
  "file": "geopolitical-entity_organizationoccupationaltrade_service.owls",
  "provider": {
    "type": "asp"
  },
  "inputs": [
    {
      "name": "_GEOPOLITICAL-ENTITY",
      "type": "http://127.0.0.1/ontology/portal.owl#Geopolitical-Entity",
      "desc": "Input of service Geopolitical-Entity Organization OccupationalTrade Service"
    }
  ],
  "name": "Geopolitical-Entity Organization OccupationalTrade Service",
  "description": "This service finds occupational trade positions in a given geopolitical entity and also returns organization who offers that job.",
  "domains": [
    {
      "name": "Educational",
      "url": "http://www.surf.scss.tcd.ie/cityOntology/#Educational"
    }
  ],
  "id": "education/geopolitical-entity_organizationoccupationaltrade_service",
  "state": true,
  "url": "http://surf.scss.tcd.ie/_provider_/education/geopolitical-entity_organizationoccupationaltrade_service"
}