{
  "outputs": [
    {
      "name": "_PRICE",
      "type": "http://127.0.0.1/ontology/concept.owl#Price",
      "desc": "Output of service 2for 1 Price service"
    },
    {
      "name": "_MESSAGE",
      "type": "http://127.0.0.1/ontology/portal.owl#Message",
      "desc": "Output of service 2for 1 Price service"
    }
  ],
  "capability": "atomic",
  "file": "dvdplayermp3player_pricemessage_service.owls",
  "provider": {
    "type": "wsdn"
  },
  "inputs": [
    {
      "name": "_MP3PLAYER",
      "type": "http://127.0.0.1/ontology/my_ontology.owl#MP3Player",
      "desc": "Input of service 2for 1 Price service"
    },
    {
      "name": "_DVDPLAYER",
      "type": "http://127.0.0.1/ontology/my_ontology.owl#DVDPlayer",
      "desc": "Input of service 2for 1 Price service"
    }
  ],
  "name": "2for 1 Price service",
  "description": "This service returns prices of offers of a set of DVD player brand and MP3Player brandand also returns a message of its shipping costs.",
  "domains": [
    {
      "name": "Technology",
      "url": "http://www.surf.scss.tcd.ie/cityOntology/#Technology"
    }
  ],
  "id": "technology/dvdplayermp3player_pricemessage_service",
  "state": true,
  "url": "http://surf.scss.tcd.ie/_provider_/technology/dvdplayermp3player_pricemessage_service"
}