{
  "outputs": [
    {
      "name": "_PRICE",
      "type": "http://127.0.0.1/ontology/concept.owl#Price",
      "desc": "Output of service MD 2For 1 Price service"
    }
  ],
  "capability": "atomic",
  "file": "dvdplayermp3player_price_MDservice.owls",
  "provider": {
    "type": "asp"
  },
  "inputs": [
    {
      "name": "_MP3PLAYER",
      "type": "http://127.0.0.1/ontology/my_ontology.owl#MP3Player",
      "desc": "Input of service MD 2For 1 Price service"
    },
    {
      "name": "_DVDPLAYER",
      "type": "http://127.0.0.1/ontology/my_ontology.owl#DVDPlayer",
      "desc": "Input of service MD 2For 1 Price service"
    }
  ],
  "name": "MD 2For 1 Price service",
  "description": "MD is the most used service to find latest purchase prices on the market of a given set of MP3Player and DVD Player.",
  "domains": [
    {
      "name": "Technology",
      "url": "http://www.surf.scss.tcd.ie/cityOntology/#Technology"
    }
  ],
  "id": "technology/dvdplayermp3player_price_service",
  "state": true,
  "url": "http://surf.scss.tcd.ie/_provider_/technology/dvdplayermp3player_price_service"
}