{
  "outputs": [
    {
      "name": "_predicting",
      "type": "string",
      "desc": "Output of service HistoricalPredicting"
    }
  ],
  "provider": {
    "type": "wsdn"
  },
  "inputs": [
    {
      "name": "_hospital",
      "type": "string",
      "desc": "Input of service HistoricalPredicting"
    }
  ],
  "name": "HistoricalPredicting",
  "description": "This service informs you about the predicting process, that is used for complex syndrome,avialable in a certain hospital.",
  "domains": [
    {
      "name": "Arts",
      "url": "http://www.surf.scss.tcd.ie/cityOntology/#Arts"
    }
  ],
  "id": "health/hospital_predicting_service",
  "state": true,
  "url": "http://surf.scss.tcd.ie/_provider_/health/hospital_predicting_service"
}