{
    "capability": "atomic",
    "description": "This service informs the prices of certain lemonfruit type available on the lemonfruit market. The prices are for 1Kg of lemonfruit.",
    "domains": [
        {
            "name": "Food_and_Drinks",
            "url": "http://www.surf.scss.tcd.ie/cityOntology/#Food_and_Drinks"
        }
    ],
    "file": "lemonfruit_price_service.owls",
    "id": "food/lemonfruit_price_service",
    "inputs": [
        {
            "desc": "Input of service Lemonfruit Price Service",
            "name": "_LEMONFRUIT",
            "type": "http://127.0.0.1/ontology/Mid-level-ontology.owl#LemonFruit"
        }
    ],
    "name": "Lemonfruit Price Service",
    "outputs": [
        {
            "desc": "Output of service Lemonfruit Price Service",
            "name": "_PRICE",
            "type": "http://127.0.0.1/ontology/concept.owl#Price"
        }
    ],
    "provider": {
        "type": "asp"
    },
    "state": true,
    "url": "http://surf.scss.tcd.ie/_provider_/food/lemonfruit_price_service"
}