{
  "outputs": [
    {
      "name": "_hotel",
      "type": "string",
      "desc": "Output of service HotelInfoService"
    }
  ],
  "provider": {
    "type": "webservice"
  },
  "inputs": [
    {
      "name": "_village",
      "type": "string",
      "desc": "Input of service HotelInfoService"
    },
    {
      "name": "_country",
      "type": "string",
      "desc": "Input of service HotelInfoService"
    }
  ],
  "name": "HotelInfoService",
  "description": "This service returns information of a hotel, it needs two inputs country and village.",
  "domains": [
    {
      "name": "Research_and_Science",
      "url": "http://www.surf.scss.tcd.ie/cityOntology/#Research_and_Science"
    }
  ],
  "id": "tourism/countryvillage_hotel_service",
  "state": true,
  "url": "http://surf.scss.tcd.ie/_provider_/tourism/countryvillage_hotel_service"
}