{
  "outputs": [
    {
      "name": "_LUXURYHOTEL",
      "type": "http://127.0.0.1/ontology/travel.owl#LuxuryHotel",
      "desc": "Output of service LuxuryHotelInfoService"
    }
  ],
  "capability": "atomic",
  "file": "countrycity_luxuryhotel_service.owls",
  "provider": {
    "type": "webservice"
  },
  "inputs": [
    {
      "name": "_CITY",
      "type": "http://127.0.0.1/ontology/travel.owl#City",
      "desc": "Input of service LuxuryHotelInfoService"
    },
    {
      "name": "_COUNTRY",
      "type": "http://127.0.0.1/ontology/portal.owl#Country",
      "desc": "Input of service LuxuryHotelInfoService"
    }
  ],
  "name": "LuxuryHotelInfoService",
  "description": "This service is a recommended service to know about the available luxury hotelsin the given city of the country.",
  "domains": [
    {
      "name": "Travel",
      "url": "http://www.surf.scss.tcd.ie/cityOntology/#Travel"
    },
    {
      "name": "Accommodation",
      "url": "http://www.surf.scss.tcd.ie/cityOntology/#Accommodation"
    }
  ],
  "id": "accommodation/countrycity_luxuryhotel_service",
  "state": true,
  "url": "http://surf.scss.tcd.ie/_provider_/accommodation/countrycity_luxuryhotel_service"
}