{
  "outputs": [
    {
      "name": "_BOOK",
      "type": "http://127.0.0.1/ontology/portal.owl#Book",
      "desc": "Output of service BookSearchingService"
    },
    {
      "name": "_AUTHOR",
      "type": "http://127.0.0.1/ontology/books.owl#Author",
      "desc": "Output of service BookSearchingService"
    },
    {
      "name": "_PUBLISHER",
      "type": "http://127.0.0.1/ontology/books.owl#Publisher",
      "desc": "Output of service BookSearchingService"
    }
  ],
  "capability": "atomic",
  "file": "publication-number_bookauthorpublisher_service.owls",
  "provider": {
    "type": "webservice"
  },
  "inputs": [
    {
      "name": "_PUBLICATION-NUMBER",
      "type": "http://127.0.0.1/ontology/portal.owl#Publication-Number",
      "desc": "Input of service BookSearchingService"
    }
  ],
  "name": "BookSearchingService",
  "description": "This service returns a book on the given publication number, alsoits publisher and authors.",
  "domains": [
    {
      "name": "Educational",
      "url": "http://www.surf.scss.tcd.ie/cityOntology/#Educational"
    }
  ],
  "id": "education/publication-number_bookauthorpublisher_service",
  "state": true,
  "url": "http://surf.scss.tcd.ie/_provider_/education/publication-number_bookauthorpublisher_service"
}