{
  "outputs": [
    {
      "name": "_MAXPRICE",
      "type": "http://127.0.0.1/ontology/concept.owl#MaxPrice",
      "desc": "Output of service Auto Bicycle MaxPrice service"
    }
  ],
  "capability": "atomic",
  "file": "autobicycle_maxprice_service.owls",
  "provider": {
    "type": "webservice"
  },
  "inputs": [
    {
      "name": "_BICYCLE",
      "type": "http://127.0.0.1/ontology/my_ontology.owl#Bicycle",
      "desc": "Input of service Auto Bicycle MaxPrice service"
    },
    {
      "name": "_AUTO",
      "type": "http://127.0.0.1/ontology/my_ontology.owl#Auto",
      "desc": "Input of service Auto Bicycle MaxPrice service"
    }
  ],
  "name": "Auto Bicycle MaxPrice service",
  "description": "This service returns the max purchase price of the given pair of an auto modeland a bicycle model.",
  "domains": [
    {
      "name": "Vehicle_Sale_and_Rent",
      "url": "http://www.surf.scss.tcd.ie/cityOntology/#Vehicle_Sale_and_Rent"
    }
  ],
  "id": "vehicle/autobicycle_maxprice_service",
  "state": true,
  "url": "http://surf.scss.tcd.ie/_provider_/vehicle/autobicycle_maxprice_service"
}