{
    "capability": "atomic",
    "description": "This service returns family destinations which provide given activity.",
    "domains": [
        {
            "name": "Activity",
            "url": "http://www.surf.scss.tcd.ie/cityOntology/#Activity"
        }
    ],
    "file": "activity_familydestination_service.owls",
    "id": "travel/activity_familydestination_service",
    "inputs": [
        {
            "desc": "Input of service Activity FamilyDestination Service",
            "name": "_ACTIVITY",
            "type": "http://127.0.0.1/ontology/travel.owl#Activity"
        }
    ],
    "name": "Activity FamilyDestination Service",
    "outputs": [
        {
            "desc": "Output of service Activity FamilyDestination Service",
            "name": "_FAMILYDESTINATION",
            "type": "http://127.0.0.1/ontology/travel.owl#FamilyDestination"
        }
    ],
    "provider": {
        "type": "wsdn"
    },
    "state": true,
    "url": "http://surf.scss.tcd.ie/_provider_/travel/activity_familydestination_service"
}