{
    "capability": "atomic",
    "description": "This service returns names of available hotels in a city, where city and country are given by the user.The city must be located in the given country.",
    "domains": [
        {
            "name": "Accommodation",
            "url": "http://www.surf.scss.tcd.ie/cityOntology/#Accommodation"
        }
    ],
    "file": "countrycity_hotel_service.owls",
    "id": "travel/countrycity_hotel_service",
    "inputs": [
        {
            "desc": "Input of service HotelInfoService",
            "name": "_CITY",
            "type": "http://127.0.0.1/ontology/portal.owl#City"
        },
        {
            "desc": "Input of service HotelInfoService",
            "name": "_COUNTRY",
            "type": "http://127.0.0.1/ontology/portal.owl#Country"
        }
    ],
    "name": "HotelInfoService",
    "outputs": [
        {
            "desc": "Output of service HotelInfoService",
            "name": "_HOTEL",
            "type": "http://127.0.0.1/ontology/travel.owl#Hotel"
        }
    ],
    "provider": {
        "type": "wsdn"
    },
    "state": true,
    "url": "http://surf.scss.tcd.ie/_provider_/travel/countrycity_hotel_service"
}