{
  "outputs": [
    {
      "name": "_RURALAREA",
      "type": "http://127.0.0.1/ontology/travel.owl#RuralArea",
      "desc": "Output of service SportsRuralAreaService"
    }
  ],
  "capability": "atomic",
  "file": "sports_ruralarea_service.owls",
  "provider": {
    "type": "wsdn"
  },
  "inputs": [
    {
      "name": "_SPORTS",
      "type": "http://127.0.0.1/ontology/travel.owl#Sports",
      "desc": "Input of service SportsRuralAreaService"
    }
  ],
  "name": "SportsRuralAreaService",
  "description": "This is a nice service to know aboutthe rural area where you can recreate with sports especially hiking and surfing.",
  "domains": [
    {
      "name": "Travel",
      "url": "http://www.surf.scss.tcd.ie/cityOntology/#Travel"
    },
    {
      "name": "Activity",
      "url": "http://www.surf.scss.tcd.ie/cityOntology/#Activity"
    },
    {
      "name": "Sport",
      "url": "http://www.surf.scss.tcd.ie/cityOntology/#Sport"
    },
    {
      "name": "Leisure",
      "url": "http://www.surf.scss.tcd.ie/cityOntology/#Leisure"
    }
  ],
  "id": "activity/sports_ruralarea_service",
  "state": true,
  "url": "http://surf.scss.tcd.ie/_provider_/activity/sports_ruralarea_service"
}