{
  "outputs": [
    {
      "name": "_POSTAL-ADDRESS",
      "type": "http://127.0.0.1/ontology/portal.owl#Postal-Address",
      "desc": "Output of service Academic Postal-Address Service"
    }
  ],
  "capability": "atomic",
  "file": "academic_postal-address_service.owls",
  "provider": {
    "type": "wsdn"
  },
  "inputs": [
    {
      "name": "_ACADEMIC",
      "type": "http://127.0.0.1/ontology/portal.owl#Academic",
      "desc": "Input of service Academic Postal-Address Service"
    }
  ],
  "name": "Academic Postal-Address Service",
  "description": "This service returns an office postal address of an academic who works in a university.",
  "domains": [
    {
      "name": "Educational",
      "url": "http://www.surf.scss.tcd.ie/cityOntology/#Educational"
    }
  ],
  "id": "education/academic_postal-address_service",
  "state": true,
  "url": "http://surf.scss.tcd.ie/_provider_/education/academic_postal-address_service"
}