{
  "outputs": [
    {
      "name": "_COFFEE",
      "type": "http://127.0.0.1/ontology/my_ontology.owl#Coffee",
      "desc": "Output of service MaxPriceCoffeeWhiskey Service"
    },
    {
      "name": "_WHISKEY",
      "type": "http://127.0.0.1/ontology/my_ontology.owl#Whiskey",
      "desc": "Output of service MaxPriceCoffeeWhiskey Service"
    }
  ],
  "capability": "atomic",
  "file": "maxprice_coffeewhiskey_service.owls",
  "provider": {
    "type": "asp"
  },
  "inputs": [
    {
      "name": "_MAXPRICE",
      "type": "http://127.0.0.1/ontology/concept.owl#MaxPrice",
      "desc": "Input of service MaxPriceCoffeeWhiskey Service"
    }
  ],
  "name": "MaxPriceCoffeeWhiskey Service",
  "description": "This service is used to get coffee and whiskey (products) for the given maximum price.",
  "domains": [
    {
      "name": "Food_and_Drinks",
      "url": "http://www.surf.scss.tcd.ie/cityOntology/#Food_and_Drinks"
    }
  ],
  "id": "food/maxprice_coffeewhiskey_service",
  "state": true,
  "url": "http://surf.scss.tcd.ie/_provider_/food/maxprice_coffeewhiskey_service"
}