{
  "outputs": [
    {
      "name": "_recommendedpriceineuro",
      "type": "string",
      "desc": "Output of service Ben service"
    }
  ],
  "provider": {
    "type": "asp"
  },
  "inputs": [
    {
      "name": "_preparedfood",
      "type": "string",
      "desc": "Input of service Ben service"
    }
  ],
  "name": "Ben service",
  "description": "Ben service returns recommended price in Euro of a prepared food.",
  "domains": [
    {
      "name": "Arts",
      "url": "http://www.surf.scss.tcd.ie/cityOntology/#Arts"
    }
  ],
  "id": "retail/preparedfood_recommendedpriceineuro_service",
  "state": true,
  "url": "http://surf.scss.tcd.ie/_provider_/retail/preparedfood_recommendedpriceineuro_service"
}