{
  "outputs": [
    {
      "name": "_SCHOLARSHIP",
      "type": "http://127.0.0.1/ontology/Mid-level-ontology.owl#Scholarship",
      "desc": "Output of service GermanGovernmentAwardScholarshipService"
    }
  ],
  "capability": "atomic",
  "file": "award_scholarship_GermanGovservice.owls",
  "provider": {
    "type": "wsdn"
  },
  "inputs": [
    {
      "name": "_AWARD",
      "type": "http://127.0.0.1/ontology/portal.owl#Award",
      "desc": "Input of service GermanGovernmentAwardScholarshipService"
    }
  ],
  "name": "GermanGovernmentAwardScholarshipService",
  "description": "It is an attractive service to know about the scholarship offered for the award by the german government.",
  "domains": [
    {
      "name": "Educational",
      "url": "http://www.surf.scss.tcd.ie/cityOntology/#Educational"
    },
    {
      "name": "Government_and_Planning",
      "url": "http://www.surf.scss.tcd.ie/cityOntology/#Government_and_Planning"
    }
  ],
  "id": "education/award_scholarship_GermanGovservice",
  "state": true,
  "url": "http://surf.scss.tcd.ie/_provider_/education/award_scholarship_GermanGovservice"
}