{
  "outputs": [
    {
      "name": "_ACCOMMODATION",
      "type": "http://127.0.0.1/ontology/travel.owl#Accommodation",
      "desc": "Output of service AccomodationInfoService"
    }
  ],
  "capability": "atomic",
  "file": "citycountry_accommodation_service.owls",
  "provider": {
    "type": "webservice"
  },
  "inputs": [
    {
      "name": "_COUNTRY",
      "type": "http://127.0.0.1/ontology/portal.owl#Country",
      "desc": "Input of service AccomodationInfoService"
    },
    {
      "name": "_CITY",
      "type": "http://127.0.0.1/ontology/travel.owl#City",
      "desc": "Input of service AccomodationInfoService"
    }
  ],
  "name": "AccomodationInfoService",
  "description": "This service returns accomodation information, hotel, resturant etcin the city of the given country.",
  "domains": [
    {
      "name": "Travel",
      "url": "http://www.surf.scss.tcd.ie/cityOntology/#Travel"
    }
  ],
  "id": "travel/citycountry_accommodation_service",
  "state": true,
  "url": "http://surf.scss.tcd.ie/_provider_/travel/citycountry_accommodation_service"
}