{
  "outputs": [
    {
      "name": "_CITY",
      "type": "http://127.0.0.1/ontology/protonu.owl#City",
      "desc": "Output of service Zip code info service."
    },
    {
      "name": "_STATE",
      "type": "http://127.0.0.1/ontology/protonu.owl#State",
      "desc": "Output of service Zip code info service."
    },
    {
      "name": "_TIMEZONE",
      "type": "http://127.0.0.1/ontology/protonu.owl#TimeZone",
      "desc": "Output of service Zip code info service."
    },
    {
      "name": "_DAYLIGHTSAVINGTIME",
      "type": "http://127.0.0.1/ontology/geographydataset.owl#daylightSavingTime",
      "desc": "Output of service Zip code info service."
    }
  ],
  "capability": "atomic",
  "file": "getZipCodeInfo.owls",
  "provider": {
    "type": "asp"
  },
  "inputs": [
    {
      "name": "_LICENSEKEY",
      "type": "http://127.0.0.1/ontology/geographydataset.owl#Code",
      "desc": "Input of service Zip code info service."
    },
    {
      "name": "_ZIPCODE",
      "type": "http://127.0.0.1/ontology/geographydataset.owl#US5DigitZipCode",
      "desc": "Input of service Zip code info service."
    }
  ],
  "name": "Zip code info service.",
  "description": "This service returns general information about a given US Zip Code (including city, state name, time zone, daylight saving time). For using this service valid License Key should be provided.",
  "domains": [
    {
      "name": "Geography",
      "url": "http://www.surf.scss.tcd.ie/cityOntology/#Geography"
    },
    {
      "name": "Travel",
      "url": "http://www.surf.scss.tcd.ie/cityOntology/#Travel"
    }
  ],
  "id": "travel/getZipCodeInfo",
  "state": true,
  "url": "http://surf.scss.tcd.ie/_provider_/travel/getZipCodeInfo"
}