{
    "capability": "atomic",
    "description": "This service returns list of food items available at the certain retail store and their quality condition also.",
    "domains": [
        {
            "name": "Food_and_Drinks",
            "url": "http://www.surf.scss.tcd.ie/cityOntology/#Food_and_Drinks"
        }
    ],
    "file": "retailstore_foodquality_service.owls",
    "id": "food/retailstore_foodquality_service",
    "inputs": [
        {
            "desc": "Input of service RetailStoreFoodService",
            "name": "_RETAILSTORE",
            "type": "http://127.0.0.1/ontology/Mid-level-ontology.owl#RetailStore"
        }
    ],
    "name": "RetailStoreFoodService",
    "outputs": [
        {
            "desc": "Output of service RetailStoreFoodService",
            "name": "_FOOD",
            "type": "http://127.0.0.1/ontology/SUMO.owl#Food"
        },
        {
            "desc": "Output of service RetailStoreFoodService",
            "name": "_QUALITY",
            "type": "http://127.0.0.1/ontology/finance_th_web.owl#quality"
        }
    ],
    "provider": {
        "type": "wsdn"
    },
    "state": true,
    "url": "http://surf.scss.tcd.ie/_provider_/food/retailstore_foodquality_service"
}