{
  "outputs": [
    {
      "name": "_CITY",
      "type": "http://127.0.0.1/ontology/travel.owl#City",
      "desc": "Output of service Activity City Service"
    }
  ],
  "capability": "atomic",
  "file": "activity_city_service.owls",
  "provider": {
    "type": "asp"
  },
  "inputs": [
    {
      "name": "_ACTIVITY",
      "type": "http://127.0.0.1/ontology/travel.owl#Activity",
      "desc": "Input of service Activity City Service"
    }
  ],
  "name": "Activity City Service",
  "description": "This service returns names of cities which provide given activity.",
  "domains": [
    {
      "name": "Travel",
      "url": "http://www.surf.scss.tcd.ie/cityOntology/#Travel"
    }
  ],
  "id": "travel/activity_city_service",
  "state": true,
  "url": "http://surf.scss.tcd.ie/_provider_/travel/activity_city_service"
}