{
  "outputs": [
    {
      "name": "_PRICE",
      "type": "http://127.0.0.1/ontology/concept.owl#Price",
      "desc": "Output of service KAHN BookFinderPriceService"
    },
    {
      "name": "_BOOK",
      "type": "http://127.0.0.1/ontology/books.owl#Book",
      "desc": "Output of service KAHN BookFinderPriceService"
    }
  ],
  "capability": "atomic",
  "file": "title_pricebook_service.owls",
  "provider": {
    "type": "asp"
  },
  "inputs": [
    {
      "name": "_TITLE",
      "type": "http://127.0.0.1/ontology/books.owl#Title",
      "desc": "Input of service KAHN BookFinderPriceService"
    }
  ],
  "name": "KAHN BookFinderPriceService",
  "description": "KAHN is a recommended service to find high valuable bookswith their price on the given title.",
  "domains": [
    {
      "name": "Entertainment_Products",
      "url": "http://www.surf.scss.tcd.ie/cityOntology/#Entertainment_Products"
    }
  ],
  "id": "books/title_pricebook_service",
  "state": true,
  "url": "http://surf.scss.tcd.ie/_provider_/books/title_pricebook_service"
}