{
  "outputs": [
    {
      "name": "_RECOMMENDEDPRICE",
      "type": "http://127.0.0.1/ontology/concept.owl#RecommendedPrice",
      "desc": "Output of service FoodRecommendPriceService"
    }
  ],
  "capability": "atomic",
  "file": "food_recommendedprice_service.owls",
  "provider": {
    "type": "webservice"
  },
  "inputs": [
    {
      "name": "_FOOD",
      "type": "http://127.0.0.1/ontology/SUMO.owl#Food",
      "desc": "Input of service FoodRecommendPriceService"
    }
  ],
  "name": "FoodRecommendPriceService",
  "description": "This service informs the latest recommend price of the given food item on the market.",
  "domains": [
    {
      "name": "Food_and_Drinks",
      "url": "http://www.surf.scss.tcd.ie/cityOntology/#Food_and_Drinks"
    }
  ],
  "id": "food/food_recommendedprice_service",
  "state": true,
  "url": "http://surf.scss.tcd.ie/_provider_/food/food_recommendedprice_service"
}