{
  "outputs": [
    {
      "name": "_PRICE",
      "type": "http://127.0.0.1/ontology/concept.owl#Price",
      "desc": "Output of service Auto1PersonBicyclePrice service"
    }
  ],
  "capability": "atomic",
  "file": "auto1personbicycle_price_service.owls",
  "provider": {
    "type": "wsdn"
  },
  "inputs": [
    {
      "name": "_1PERSONBICYCLE",
      "type": "http://127.0.0.1/ontology/my_ontology.owl#OnePersonBicycle",
      "desc": "Input of service Auto1PersonBicyclePrice service"
    },
    {
      "name": "_AUTO",
      "type": "http://127.0.0.1/ontology/my_ontology.owl#Auto",
      "desc": "Input of service Auto1PersonBicyclePrice service"
    }
  ],
  "name": "Auto1PersonBicyclePrice service",
  "description": "This service returns purchase price of the given pair of an auto modeland 1(one) person bicycle model.",
  "domains": [
    {
      "name": "Vehicle_Sale_and_Rent",
      "url": "http://www.surf.scss.tcd.ie/cityOntology/#Vehicle_Sale_and_Rent"
    }
  ],
  "id": "vehicle/auto1personbicycle_price_service",
  "state": true,
  "url": "http://surf.scss.tcd.ie/_provider_/vehicle/auto1personbicycle_price_service"
}