{
  "outputs": [
    {
      "name": "_CITY",
      "type": "http://127.0.0.1/ontology/travel.owl#City",
      "desc": "Output of service SurfingGenericAgentCityService"
    }
  ],
  "capability": "atomic",
  "file": "surfinggeneric-agent_city_service.owls",
  "provider": {
    "type": "asp"
  },
  "inputs": [
    {
      "name": "_GENERIC-AGENT",
      "type": "http://127.0.0.1/ontology/portal.owl#Generic-Agent",
      "desc": "Input of service SurfingGenericAgentCityService"
    },
    {
      "name": "_SURFING",
      "type": "http://127.0.0.1/ontology/travel.owl#Surfing",
      "desc": "Input of service SurfingGenericAgentCityService"
    }
  ],
  "name": "SurfingGenericAgentCityService",
  "description": "This service returns city of a reputable generic agent who is responsiblefor sports especially surfing.",
  "domains": [
    {
      "name": "Travel",
      "url": "http://www.surf.scss.tcd.ie/cityOntology/#Travel"
    }
  ],
  "id": "travel/surfinggeneric-agent_city_service",
  "state": true,
  "url": "http://surf.scss.tcd.ie/_provider_/travel/surfinggeneric-agent_city_service"
}