{
  "outputs": [
    {
      "name": "_AUTHOR",
      "type": "http://127.0.0.1/ontology/books.owl#Author",
      "desc": "Output of service BookAuthorPriceService"
    },
    {
      "name": "_PRICE",
      "type": "http://127.0.0.1/ontology/concept.owl#Price",
      "desc": "Output of service BookAuthorPriceService"
    }
  ],
  "capability": "atomic",
  "file": "book_authorprice_Novelservice.owls",
  "provider": {
    "type": "webservice"
  },
  "inputs": [
    {
      "name": "_BOOK",
      "type": "http://127.0.0.1/ontology/books.owl#Book",
      "desc": "Input of service BookAuthorPriceService"
    }
  ],
  "name": "BookAuthorPriceService",
  "description": "This service returns author\u0027s first and last name and the purchase price of a given book, short-story or novel title.",
  "domains": [
    {
      "name": "Entertainment_Products",
      "url": "http://www.surf.scss.tcd.ie/cityOntology/#Entertainment_Products"
    }
  ],
  "id": "books/book_authorprice_service",
  "state": true,
  "url": "http://surf.scss.tcd.ie/_provider_/books/book_authorprice_service"
}