{
  "outputs": [
    {
      "name": "_SLR",
      "type": "http://127.0.0.1/ontology/extendedCamera.owl#SLR",
      "desc": "Output of service RetailStore SLR Price service"
    },
    {
      "name": "_PRICE",
      "type": "http://127.0.0.1/ontology/concept.owl#Price",
      "desc": "Output of service RetailStore SLR Price service"
    }
  ],
  "capability": "atomic",
  "file": "retailstore_slrprice_service.owls",
  "provider": {
    "type": "asp"
  },
  "inputs": [
    {
      "name": "_RETAILSTORE",
      "type": "http://127.0.0.1/ontology/Mid-level-ontology.owl#RetailStore",
      "desc": "Input of service RetailStore SLR Price service"
    }
  ],
  "name": "RetailStore SLR Price service",
  "description": "This service informs you the price for a slr camera available in a given retail store.",
  "domains": [
    {
      "name": "Technology",
      "url": "http://www.surf.scss.tcd.ie/cityOntology/#Technology"
    }
  ],
  "id": "technology/retailstore_slrprice_service",
  "state": true,
  "url": "http://surf.scss.tcd.ie/_provider_/technology/retailstore_slrprice_service"
}