{
  "outputs": [
    {
      "name": "_CORPORATION",
      "type": "http://127.0.0.1/ontology/finance_th_web.owl#corporation",
      "desc": "Output of service Geographical-Region Corporation Profession Service"
    },
    {
      "name": "_PROFESSION",
      "type": "http://127.0.0.1/ontology/Mid-level-ontology.owl#Profession",
      "desc": "Output of service Geographical-Region Corporation Profession Service"
    }
  ],
  "capability": "atomic",
  "file": "geographical-region_corporationprofession_service.owls",
  "provider": {
    "type": "asp"
  },
  "inputs": [
    {
      "name": "_GEOGRAPHICAL-REGION",
      "type": "http://127.0.0.1/ontology/portal.owl#Geographical-Region",
      "desc": "Input of service Geographical-Region Corporation Profession Service"
    }
  ],
  "name": "Geographical-Region Corporation Profession Service",
  "description": "This service finds profession positions in a given geopolitical regions and also returns corporation who offers that job.",
  "domains": [
    {
      "name": "Industry",
      "url": "http://www.surf.scss.tcd.ie/cityOntology/#Industry"
    }
  ],
  "id": "industry/geographical-region_corporationprofession_service",
  "state": true,
  "url": "http://surf.scss.tcd.ie/_provider_/industry/geographical-region_corporationprofession_service"
}