{
    "capability": "atomic",
    "description": "This service returns certain type diagnostic process available in the certain care organization.",
    "domains": [
        {
            "name": "Health",
            "url": "http://www.surf.scss.tcd.ie/cityOntology/#Health"
        }
    ],
    "file": "careorganization_diagnosticprocess_service.owls",
    "id": "medical/careorganization_diagnosticprocess_service",
    "inputs": [
        {
            "desc": "Input of service CareOrganization DiagnosticProcess Service",
            "name": "_CAREORGANIZATION",
            "type": "http://127.0.0.1/ontology/Mid-level-ontology.owl#CareOrganization"
        }
    ],
    "name": "CareOrganization DiagnosticProcess Service",
    "outputs": [
        {
            "desc": "Output of service CareOrganization DiagnosticProcess Service",
            "name": "_DIAGNOSTICPROCESS",
            "type": "http://127.0.0.1/ontology/SUMO.owl#DiagnosticProcess"
        }
    ],
    "provider": {
        "type": "asp"
    },
    "state": true,
    "url": "http://surf.scss.tcd.ie/_provider_/medical/careorganization_diagnosticprocess_service"
}