{
  "outputs": [
    {
      "name": "_book",
      "type": "string",
      "desc": "Output of service Ziku BookFinderPriceService"
    },
    {
      "name": "_price",
      "type": "string",
      "desc": "Output of service Ziku BookFinderPriceService"
    }
  ],
  "provider": {
    "type": "webservice"
  },
  "inputs": [
    {
      "name": "_author",
      "type": "string",
      "desc": "Input of service Ziku BookFinderPriceService"
    }
  ],
  "name": "Ziku BookFinderPriceService",
  "description": "Ziku is a frequent usable service to return books written by the given authorand their prices also.",
  "domains": [
    {
      "name": "Waste",
      "url": "http://www.surf.scss.tcd.ie/cityOntology/#Waste"
    }
  ],
  "id": "retail/author_bookprice_service",
  "state": true,
  "url": "http://surf.scss.tcd.ie/_provider_/retail/author_bookprice_service"
}