{
  "outputs": [
    {
      "name": "_SELECTEDACCOMMODATION",
      "type": "http://www.surf.scss.tcd.ie/IoTservices.owl#selectedAccommodation",
      "desc": "Output of service accommodation_selection"
    }
  ],
  "provider": {
    "type": "asp"
  },
  "inputs": [
    {
      "name": "_ACCOMMODATIONLIST",
      "type": "http://www.surf.scss.tcd.ie/IoTservices.owl#accommodationList",
      "desc": "Input of service accommodation_selection"
    }
  ],
  "name": "accommodation_selection",
  "description": "This is the service accommodation_selection",
  "domains": [
    {
      "name": "Accommodation",
      "url": "http://www.surf.scss.tcd.ie/cityOntology/#Accommodation"
    }
  ],
  "id": "accommodation/83_accommodation_selection",
  "state": true,
  "url": "http://surf.scss.tcd.ie/_provider_/accommodation/83_accommodation_selection"
}