{
  "outputs": [
    {
      "name": "_INVESTIGATING",
      "type": "http://127.0.0.1/ontology/SUMO.owl#Investigating",
      "desc": "Output of service HospitalInvestService"
    },
    {
      "name": "_ADDRESS",
      "type": "http://127.0.0.1/ontology/portal.owl#Address",
      "desc": "Output of service HospitalInvestService"
    }
  ],
  "capability": "atomic",
  "file": "hospital_investigatingaddress_service.owls",
  "provider": {
    "type": "asp"
  },
  "inputs": [
    {
      "name": "_HOSPITAL",
      "type": "http://127.0.0.1/ontology/Mid-level-ontology.owl#Hospital",
      "desc": "Input of service HospitalInvestService"
    }
  ],
  "name": "HospitalInvestService",
  "description": "This service returns investigating facility in the given hospital and its address.",
  "domains": [
    {
      "name": "Health",
      "url": "http://www.surf.scss.tcd.ie/cityOntology/#Health"
    }
  ],
  "id": "medical/hospital_investigatingaddress_service",
  "state": true,
  "url": "http://surf.scss.tcd.ie/_provider_/medical/hospital_investigatingaddress_service"
}