{
  "outputs": [
    {
      "name": "_PRODUCTS",
      "type": "http://www.surf.scss.tcd.ie/IoTservices.owl#products",
      "desc": "Output of service buy_technology_products"
    }
  ],
  "provider": {
    "type": "wsdn"
  },
  "inputs": [
    {
      "name": "_PRODUCTDATA",
      "type": "http://www.surf.scss.tcd.ie/IoTservices.owl#productData",
      "desc": "Input of service buy_technology_products"
    }
  ],
  "name": "buy_technology_products",
  "description": "This is the service buy_technology_products",
  "domains": [
    {
      "name": "Technology",
      "url": "http://www.surf.scss.tcd.ie/cityOntology/#Technology"
    }
  ],
  "id": "technology/131_buy_technology_products",
  "state": true,
  "url": "http://surf.scss.tcd.ie/_provider_/technology/131_buy_technology_products"
}