{
    "capability": "atomic",
    "description": "This service informs about funding offered for the academic-degree by the german government. The funding's duration is informed as well.",
    "domains": [
        {
            "name": "Educational",
            "url": "http://www.surf.scss.tcd.ie/cityOntology/#Educational"
        }
    ],
    "file": "academic-degree_fundingduration_GermanGovservice.owls",
    "id": "education/academic-degree_fundingduration_service",
    "inputs": [
        {
            "desc": "Input of service GermanGovernment Academic-Degree Funding Duration Service",
            "name": "_ACADEMIC-DEGREE",
            "type": "http://127.0.0.1/ontology/portal.owl#Academic-Degree"
        }
    ],
    "name": "GermanGovernment Academic-Degree Funding Duration Service",
    "outputs": [
        {
            "desc": "Output of service GermanGovernment Academic-Degree Funding Duration Service",
            "name": "_FUNDING",
            "type": "http://127.0.0.1/ontology/SUMO.owl#Funding"
        },
        {
            "desc": "Output of service GermanGovernment Academic-Degree Funding Duration Service",
            "name": "_DURATION",
            "type": "http://127.0.0.1/ontology/support.owl#Duration"
        }
    ],
    "provider": {
        "type": "webservice"
    },
    "state": true,
    "url": "http://surf.scss.tcd.ie/_provider_/education/academic-degree_fundingduration_service"
}