{
  "outputs": [
    {
      "name": "_price",
      "type": "string",
      "desc": "Output of service BookPriceService"
    },
    {
      "name": "_review",
      "type": "string",
      "desc": "Output of service BookPriceService"
    },
    {
      "name": "_book1",
      "type": "string",
      "desc": "Output of service BookPriceService"
    }
  ],
  "provider": {
    "type": "asp"
  },
  "inputs": [
    {
      "name": "_book",
      "type": "string",
      "desc": "Input of service BookPriceService"
    }
  ],
  "name": "BookPriceService",
  "description": "This service is delegated to return a suitable price of a book,with its review and other recommended books.",
  "domains": [
    {
      "name": "Transport_and_Mobility",
      "url": "http://www.surf.scss.tcd.ie/cityOntology/#Transport_and_Mobility"
    }
  ],
  "id": "retail/book_pricereviewbook_service",
  "state": true,
  "url": "http://surf.scss.tcd.ie/_provider_/retail/book_pricereviewbook_service"
}