{
    "capability": "atomic",
    "description": "Tizon is a rival US company of the book providers.It provides a web service to return recommended purchase price of a book in dollars.",
    "domains": [
        {
            "name": "Research_and_Science",
            "url": "http://www.surf.scss.tcd.ie/cityOntology/#Research_and_Science"
        }
    ],
    "file": "Tizonbook_recommendedpriceindollar_service.owls",
    "id": "books/book_recommendedpriceindollar_service",
    "inputs": [
        {
            "desc": "Input of service Tizon RecommendedPriceService",
            "name": "_BOOK",
            "type": "http://127.0.0.1/ontology/books.owl#Book"
        }
    ],
    "name": "Tizon RecommendedPriceService",
    "outputs": [
        {
            "desc": "Output of service Tizon RecommendedPriceService",
            "name": "_RECOMMENDEDPRICEINDOLLAR",
            "type": "http://127.0.0.1/ontology/concept.owl#RecommendedPriceInDollar"
        }
    ],
    "provider": {
        "type": "wsdn"
    },
    "state": true,
    "url": "http://surf.scss.tcd.ie/_provider_/books/book_recommendedpriceindollar_service"
}