{
    "capability": "atomic",
    "description": "This service finds occupational trade positions in a given country and also returns company who offers that job.",
    "domains": [
        {
            "name": "Industry",
            "url": "http://www.surf.scss.tcd.ie/cityOntology/#Industry"
        }
    ],
    "file": "country_companyoccupationaltrade_service.owls",
    "id": "education/country_companyoccupationaltrade_service",
    "inputs": [
        {
            "desc": "Input of service Country Company OccupationalTrade Service",
            "name": "_COUNTRY",
            "type": "http://127.0.0.1/ontology/portal.owl#Country"
        }
    ],
    "name": "Country Company OccupationalTrade Service",
    "outputs": [
        {
            "desc": "Output of service Country Company OccupationalTrade Service",
            "name": "_COMPANY",
            "type": "http://127.0.0.1/ontology/finance_th_web.owl#company"
        },
        {
            "desc": "Output of service Country Company OccupationalTrade Service",
            "name": "_OCCUPATIONALTRADE",
            "type": "http://127.0.0.1/ontology/Mid-level-ontology.owl#OccupationalTrade"
        }
    ],
    "provider": {
        "type": "webservice"
    },
    "state": true,
    "url": "http://surf.scss.tcd.ie/_provider_/education/country_companyoccupationaltrade_service"
}