{
  "outputs": [
    {
      "name": "_ADDRESS",
      "type": "http://127.0.0.1/ontology/portal.owl#Address",
      "desc": "Output of service Researcher address service"
    }
  ],
  "capability": "atomic",
  "file": "researcher-in-academia_address_service.owls",
  "provider": {
    "type": "wsdn"
  },
  "inputs": [
    {
      "name": "_RESEARCHER-IN-ACADEMIA",
      "type": "http://127.0.0.1/ontology/portal.owl#Researcher-In-Academia",
      "desc": "Input of service Researcher address service"
    }
  ],
  "name": "Researcher address service",
  "description": "This service returns an addresses, whether email or postal (home or office) address, of a researcher who works in academia.",
  "domains": [
    {
      "name": "Educational",
      "url": "http://www.surf.scss.tcd.ie/cityOntology/#Educational"
    },
    {
      "name": "Research_and_Science",
      "url": "http://www.surf.scss.tcd.ie/cityOntology/#Research_and_Science"
    }
  ],
  "id": "education/researcher-in-academia_address_service",
  "state": true,
  "url": "http://surf.scss.tcd.ie/_provider_/education/researcher-in-academia_address_service"
}