{
  "outputs": [
    {
      "name": "_recommendedpriceineuro",
      "type": "string",
      "desc": "Output of service BreadBiscuitPriceService"
    },
    {
      "name": "_taxedpriceineuro",
      "type": "string",
      "desc": "Output of service BreadBiscuitPriceService"
    }
  ],
  "provider": {
    "type": "webservice"
  },
  "inputs": [
    {
      "name": "_breadorbiscuit",
      "type": "string",
      "desc": "Input of service BreadBiscuitPriceService"
    }
  ],
  "name": "BreadBiscuitPriceService",
  "description": "This service returns recommended price and tax price (in euros) of certain bread or biscuit..",
  "domains": [
    {
      "name": "Food_and_Drinks",
      "url": "http://www.surf.scss.tcd.ie/cityOntology/#Food_and_Drinks"
    }
  ],
  "id": "retail/breadorbiscuit_recommendedpriceineurotaxedpriceineuro_service",
  "state": true,
  "url": "http://surf.scss.tcd.ie/_provider_/retail/breadorbiscuit_recommendedpriceineurotaxedpriceineuro_service"
}