{
  "outputs": [
    {
      "name": "_COLABEER",
      "type": "http://127.0.0.1/ontology/my_ontology.owl#ColaBeer",
      "desc": "Output of service ColaBeerService"
    }
  ],
  "capability": "atomic",
  "file": "maxprice_colabeer_service.owls",
  "provider": {
    "type": "asp"
  },
  "inputs": [
    {
      "name": "_MAXPRICE",
      "type": "http://127.0.0.1/ontology/concept.owl#MaxPrice",
      "desc": "Input of service ColaBeerService"
    }
  ],
  "name": "ColaBeerService",
  "description": "This service offer a ColaBeer for the given maximum price.",
  "domains": [
    {
      "name": "Food_and_Drinks",
      "url": "http://www.surf.scss.tcd.ie/cityOntology/#Food_and_Drinks"
    }
  ],
  "id": "food/maxprice_colabeer_service",
  "state": true,
  "url": "http://surf.scss.tcd.ie/_provider_/food/maxprice_colabeer_service"
}