{
  "outputs": [
    {
      "name": "_drought",
      "type": "string",
      "desc": "Output of service Geopolitica-Entity Drought Service"
    }
  ],
  "provider": {
    "type": "wsdn"
  },
  "inputs": [
    {
      "name": "_geopolitical-entity",
      "type": "string",
      "desc": "Input of service Geopolitica-Entity Drought Service"
    }
  ],
  "name": "Geopolitica-Entity Drought Service",
  "description": "This service informs about droughts of a given geopolitical entity.",
  "domains": [
    {
      "name": "Finance",
      "url": "http://www.surf.scss.tcd.ie/cityOntology/#Finance"
    }
  ],
  "id": "environmental/geopolitical-entity_drought_service",
  "state": true,
  "url": "http://surf.scss.tcd.ie/_provider_/environmental/geopolitical-entity_drought_service"
}