{
  "outputs": [
    {
      "name": "_LENDING",
      "type": "http://127.0.0.1/ontology/SUMO.owl#Lending",
      "desc": "Output of service Academic Degree GovernmentOrganization Lending Service"
    }
  ],
  "capability": "atomic",
  "file": "academic-degreegovernmentorganization_lending_service.owls",
  "provider": {
    "type": "webservice"
  },
  "inputs": [
    {
      "name": "_GOVERNMENTORGANIZATION",
      "type": "http://127.0.0.1/ontology/SUMO.owl#GovernmentOrganization",
      "desc": "Input of service Academic Degree GovernmentOrganization Lending Service"
    },
    {
      "name": "_ACADEMIC-DEGREE",
      "type": "http://127.0.0.1/ontology/portal.owl#Academic-Degree",
      "desc": "Input of service Academic Degree GovernmentOrganization Lending Service"
    }
  ],
  "name": "Academic Degree GovernmentOrganization Lending Service",
  "description": "This service provides you information about lending offered by a given government organization for a given academic degree.",
  "domains": [
    {
      "name": "Educational",
      "url": "http://www.surf.scss.tcd.ie/cityOntology/#Educational"
    }
  ],
  "id": "education/academic-degreegovernmentorganization_lending_service",
  "state": true,
  "url": "http://surf.scss.tcd.ie/_provider_/education/academic-degreegovernmentorganization_lending_service"
}