{
  "outputs": [
    {
      "name": "_TECHNOLOGY",
      "type": "http://127.0.0.1/ontology/portal.owl#Technology",
      "desc": "Output of service ExpensiveCarTechnology service"
    }
  ],
  "capability": "atomic",
  "file": "expensivecar_technology_service.owls",
  "provider": {
    "type": "webservice"
  },
  "inputs": [
    {
      "name": "_EXPENSIVECAR",
      "type": "http://127.0.0.1/ontology/my_ontology.owl#ExpensiveCar",
      "desc": "Input of service ExpensiveCarTechnology service"
    }
  ],
  "name": "ExpensiveCarTechnology service",
  "description": "This service returns information of the used technology in a given expensive car model.",
  "domains": [
    {
      "name": "Vehicle_Sale_and_Rent",
      "url": "http://www.surf.scss.tcd.ie/cityOntology/#Vehicle_Sale_and_Rent"
    }
  ],
  "id": "vehicle/expensivecar_technology_service",
  "state": true,
  "url": "http://surf.scss.tcd.ie/_provider_/vehicle/expensivecar_technology_service"
}