{
  "outputs": [
    {
      "name": "_TAXFREEPRICE",
      "type": "http://127.0.0.1/ontology/concept.owl#TaxFreePrice",
      "desc": "Output of service Meat TaxFreePrice Physical-Quantity Service"
    },
    {
      "name": "_PHYSICAL-QUANTITY",
      "type": "http://127.0.0.1/ontology/support.owl#Physical-Quantity",
      "desc": "Output of service Meat TaxFreePrice Physical-Quantity Service"
    }
  ],
  "capability": "atomic",
  "file": "meat_taxfreepricephysical-quantity_Aldiservice.owls",
  "provider": {
    "type": "asp"
  },
  "inputs": [
    {
      "name": "_MEAT",
      "type": "http://127.0.0.1/ontology/SUMO.owl#Meat",
      "desc": "Input of service Meat TaxFreePrice Physical-Quantity Service"
    }
  ],
  "name": "Meat TaxFreePrice Physical-Quantity Service",
  "description": "This service informs the physical-quantity and approximately tax free price of a given meat item.",
  "domains": [
    {
      "name": "Educational",
      "url": "http://www.surf.scss.tcd.ie/cityOntology/#Educational"
    }
  ],
  "id": "education/meat_taxfreepricephysical-quantity_service",
  "state": true,
  "url": "http://surf.scss.tcd.ie/_provider_/education/meat_taxfreepricephysical-quantity_service"
}