{
  "outputs": [
    {
      "name": "_RECOMMENDEDPRICEINDOLLAR",
      "type": "http://127.0.0.1/ontology/concept.owl#RecommendedPriceInDollar",
      "desc": "Output of service CarRecommendedPrice service"
    }
  ],
  "capability": "atomic",
  "file": "car_recommendedpriceindollar_service.owls",
  "provider": {
    "type": "wsdn"
  },
  "inputs": [
    {
      "name": "_CAR",
      "type": "http://127.0.0.1/ontology/my_ontology.owl#Car",
      "desc": "Input of service CarRecommendedPrice service"
    }
  ],
  "name": "CarRecommendedPrice service",
  "description": "This service returns recommended purchase price of a given car brand/model in Dollars.",
  "domains": [
    {
      "name": "Vehicle_Sale_and_Rent",
      "url": "http://www.surf.scss.tcd.ie/cityOntology/#Vehicle_Sale_and_Rent"
    }
  ],
  "id": "vehicle/car_recommendedpriceindollar_service",
  "state": true,
  "url": "http://surf.scss.tcd.ie/_provider_/vehicle/car_recommendedpriceindollar_service"
}