{
  "outputs": [
    {
      "name": "_BOOK",
      "type": "http://127.0.0.1/ontology/portal.owl#Book",
      "desc": "Output of service AcademicBookNumberSearch"
    }
  ],
  "capability": "atomic",
  "file": "AcademicBookNumberSearch.owls",
  "provider": {
    "type": "asp"
  },
  "inputs": [
    {
      "name": "_ACADEMIC-ITEM-NUMBER",
      "type": "http://127.0.0.1/ontology/portal.owl#Academic-Item-Number",
      "desc": "Input of service AcademicBookNumberSearch"
    }
  ],
  "name": "AcademicBookNumberSearch",
  "description": "Searches for a book title using the provided Academic Book-Item Number",
  "domains": [
    {
      "name": "Educational",
      "url": "http://www.surf.scss.tcd.ie/cityOntology/#Educational"
    }
  ],
  "id": "education/academic-item-number_book_service",
  "state": true,
  "url": "http://surf.scss.tcd.ie/_provider_/education/academic-item-number_book_service"
}