{
  "outputs": [
    {
      "name": "_RECOMMENDEDPRICEINDOLLAR",
      "type": "http://127.0.0.1/ontology/concept.owl#RecommendedPriceInDollar",
      "desc": "Output of service ScienceFictionNovelUserRecommendedPrice Service"
    }
  ],
  "capability": "atomic",
  "file": "science-fiction-noveluser_recommendedpriceindollar_service.owls",
  "provider": {
    "type": "wsdn"
  },
  "inputs": [
    {
      "name": "_USER",
      "type": "http://127.0.0.1/ontology/books.owl#User",
      "desc": "Input of service ScienceFictionNovelUserRecommendedPrice Service"
    },
    {
      "name": "_SCIENCE-FICTION-NOVEL",
      "type": "http://127.0.0.1/ontology/books.owl#Science-Fiction-Novel",
      "desc": "Input of service ScienceFictionNovelUserRecommendedPrice Service"
    }
  ],
  "name": "ScienceFictionNovelUserRecommendedPrice Service",
  "description": "This service returns recommended purchase price in dollars of a science-fiction novel for an authorized user. The price depends of the users purchase history.",
  "domains": [
    {
      "name": "Entertainment_Products",
      "url": "http://www.surf.scss.tcd.ie/cityOntology/#Entertainment_Products"
    }
  ],
  "id": "books/science-fiction-noveluser_recommendedpriceindollar_service",
  "state": true,
  "url": "http://surf.scss.tcd.ie/_provider_/books/science-fiction-noveluser_recommendedpriceindollar_service"
}