{
  "outputs": [
    {
      "name": "_URBANAREA",
      "type": "http://127.0.0.1/ontology/travel.owl#UrbanArea",
      "desc": "Output of service Hiking UrbanArea Service"
    }
  ],
  "capability": "atomic",
  "file": "hiking_urbanarea_service.owls",
  "provider": {
    "type": "asp"
  },
  "inputs": [
    {
      "name": "_HIKING",
      "type": "http://127.0.0.1/ontology/travel.owl#Hiking",
      "desc": "Input of service Hiking UrbanArea Service"
    }
  ],
  "name": "Hiking UrbanArea Service",
  "description": "This service returns the best urban areas for given hiking type.",
  "domains": [
    {
      "name": "Travel",
      "url": "http://www.surf.scss.tcd.ie/cityOntology/#Travel"
    }
  ],
  "id": "travel/hiking_urbanarea_service",
  "state": true,
  "url": "http://surf.scss.tcd.ie/_provider_/travel/hiking_urbanarea_service"
}