{
    "capability": "atomic",
    "description": "This service informs about droughts of a given geographical region.",
    "domains": [
        {
            "name": "Travel",
            "url": "http://www.surf.scss.tcd.ie/cityOntology/#Travel"
        }
    ],
    "file": "geographical-region_drought_service.owls",
    "id": "travel/geographical-region_drought_service",
    "inputs": [
        {
            "desc": "Input of service Geographical-Region Drought Service",
            "name": "_GEOGRAPHICAL-REGION",
            "type": "http://127.0.0.1/ontology/portal.owl#Geographical-Region"
        }
    ],
    "name": "Geographical-Region Drought Service",
    "outputs": [
        {
            "desc": "Output of service Geographical-Region Drought Service",
            "name": "_DROUGHT",
            "type": "http://127.0.0.1/ontology/Mid-level-ontology.owl#Drought"
        }
    ],
    "provider": {
        "type": "wsdn"
    },
    "state": true,
    "url": "http://surf.scss.tcd.ie/_provider_/travel/geographical-region_drought_service"
}