{
  "outputs": [
    {
      "name": "_CONSTRUCTIONINFO",
      "type": "http://www.surf.scss.tcd.ie/IoTservices.owl#constructionInfo",
      "desc": "Output of service construction_monitoring_configurator"
    }
  ],
  "provider": {
    "type": "ws"
  },
  "inputs": [
    {
      "name": "_CONSTRUCTIONMONITORINGPARAMETERS",
      "type": "http://www.surf.scss.tcd.ie/IoTservices.owl#constructionMonitoringParameters",
      "desc": "Input of service construction_monitoring_configurator"
    }
  ],
  "name": "construction_monitoring_configurator",
  "description": "This is the service construction_monitoring_configurator",
  "domains": [
    {
      "name": "Safety_and_Emergencies",
      "url": "http://www.surf.scss.tcd.ie/cityOntology/#Safety_and_Emergencies"
    },
    {
      "name": "Construction",
      "url": "http://www.surf.scss.tcd.ie/cityOntology/#Construction"
    }
  ],
  "id": "construction/40_construction_monitoring_configurator",
  "state": true,
  "url": "http://surf.scss.tcd.ie/_provider_/construction/40_construction_monitoring_configurator"
}