{
  "outputs": [
    {
      "name": "_lightning",
      "type": "string",
      "desc": "Output of service Geopolitica-Entity Lightning Service"
    }
  ],
  "provider": {
    "type": "asp"
  },
  "inputs": [
    {
      "name": "_geopolitical-entity",
      "type": "string",
      "desc": "Input of service Geopolitica-Entity Lightning Service"
    }
  ],
  "name": "Geopolitica-Entity Lightning Service",
  "description": "This service informs about lightnings of a given geopolitical entity.",
  "domains": [
    {
      "name": "Foundations_and_Charity",
      "url": "http://www.surf.scss.tcd.ie/cityOntology/#Foundations_and_Charity"
    }
  ],
  "id": "environmental/geopolitical-entity_lightning_service",
  "state": true,
  "url": "http://surf.scss.tcd.ie/_provider_/environmental/geopolitical-entity_lightning_service"
}