{
  "outputs": [
    {
      "name": "_POSTALCODE",
      "type": "http://127.0.0.1/ontology/geographydataset.owl#PostalCode",
      "desc": "Output of service Nearby Postal Codes Finder Service."
    }
  ],
  "capability": "atomic",
  "file": "findNearbyPostalCodes.owls",
  "provider": {
    "type": "webservice"
  },
  "inputs": [
    {
      "name": "_LICENSEKEY",
      "type": "http://127.0.0.1/ontology/geographydataset.owl#Code",
      "desc": "Input of service Nearby Postal Codes Finder Service."
    },
    {
      "name": "_RADIUS",
      "type": "http://127.0.0.1/ontology/geographydataset.owl#GeographicDistanceKilometerLengthUnit",
      "desc": "Input of service Nearby Postal Codes Finder Service."
    },
    {
      "name": "_MAX-RESULTS",
      "type": "http://127.0.0.1/ontology/protont.owl#Number",
      "desc": "Input of service Nearby Postal Codes Finder Service."
    },
    {
      "name": "_LATITUDE",
      "type": "http://127.0.0.1/ontology/protont.owl#latitude",
      "desc": "Input of service Nearby Postal Codes Finder Service."
    },
    {
      "name": "_LONGITUDE",
      "type": "http://127.0.0.1/ontology/protont.owl#longitude",
      "desc": "Input of service Nearby Postal Codes Finder Service."
    }
  ],
  "name": "Nearby Postal Codes Finder Service.",
  "description": "This service finds postal codes close to the given location (latitude/longitude pair) in a distance of a given radius. The maximum number of returned results is also specified by the user.For using this service valid License Key should be provided.",
  "domains": [
    {
      "name": "Geography",
      "url": "http://www.surf.scss.tcd.ie/cityOntology/#Geography"
    },
    {
      "name": "Travel",
      "url": "http://www.surf.scss.tcd.ie/cityOntology/#Travel"
    }
  ],
  "id": "travel/findNearbyPostalCodes",
  "state": true,
  "url": "http://surf.scss.tcd.ie/_provider_/travel/findNearbyPostalCodes"
}