{
  "outputs": [
    {
      "name": "_PRICE",
      "type": "http://127.0.0.1/ontology/concept.owl#Price",
      "desc": "Output of service HandyCameraPriceService"
    },
    {
      "name": "_CELLPHONEWITHCAMERA",
      "type": "http://127.0.0.1/ontology/extendedCamera.owl#CellPhoneWithCamera",
      "desc": "Output of service HandyCameraPriceService"
    }
  ],
  "capability": "atomic",
  "file": "shoppingmall_pricecellphonewithcamera_service.owls",
  "provider": {
    "type": "webservice"
  },
  "inputs": [
    {
      "name": "_SHOPPINGMALL",
      "type": "http://127.0.0.1/ontology/Mid-level-ontology.owl#ShoppingMall",
      "desc": "Input of service HandyCameraPriceService"
    }
  ],
  "name": "HandyCameraPriceService",
  "description": "This service informs you for a cellphone with camera and its price, available in the certain shoppingmall.",
  "domains": [
    {
      "name": "Technology",
      "url": "http://www.surf.scss.tcd.ie/cityOntology/#Technology"
    }
  ],
  "id": "technology/shoppingmall_pricecellphonewithcamera_service",
  "state": true,
  "url": "http://surf.scss.tcd.ie/_provider_/technology/shoppingmall_pricecellphonewithcamera_service"
}