{
  "outputs": [
    {
      "name": "_ADDRESS",
      "type": "http://127.0.0.1/ontology/portal.owl#Address",
      "desc": "Output of service Reader-in-academia address  service"
    }
  ],
  "capability": "atomic",
  "file": "reader-in-academia_address_service.owls",
  "provider": {
    "type": "wsdn"
  },
  "inputs": [
    {
      "name": "_READER-IN-ACADEMIA",
      "type": "http://127.0.0.1/ontology/portal.owl#Reader-In-Academia",
      "desc": "Input of service Reader-in-academia address  service"
    }
  ],
  "name": "Reader-in-academia address  service",
  "description": "This service returns an address of a reader in academia.",
  "domains": [
    {
      "name": "Educational",
      "url": "http://www.surf.scss.tcd.ie/cityOntology/#Educational"
    }
  ],
  "id": "education/reader-in-academia_address_service",
  "state": true,
  "url": "http://surf.scss.tcd.ie/_provider_/education/reader-in-academia_address_service"
}