{
  "outputs": [
    {
      "name": "_RECOMMENDEDPRICEINEURO",
      "type": "http://127.0.0.1/ontology/concept.owl#RecommendedPriceInEuro",
      "desc": "Output of service Ben service"
    }
  ],
  "capability": "atomic",
  "file": "Ben_service.owls",
  "provider": {
    "type": "webservice"
  },
  "inputs": [
    {
      "name": "_PREPAREDFOOD",
      "type": "http://127.0.0.1/ontology/Mid-level-ontology.owl#PreparedFood",
      "desc": "Input of service Ben service"
    }
  ],
  "name": "Ben service",
  "description": "Ben service returns latest recommended price in Euro of a given prepared food in the market.",
  "domains": [
    {
      "name": "Food_and_Drinks",
      "url": "http://www.surf.scss.tcd.ie/cityOntology/#Food_and_Drinks"
    }
  ],
  "id": "food/preparedfood_recommendedpriceineuro_service",
  "state": true,
  "url": "http://surf.scss.tcd.ie/_provider_/food/preparedfood_recommendedpriceineuro_service"
}