{
  "outputs": [
    {
      "name": "_PRICE",
      "type": "http://127.0.0.1/ontology/concept.owl#Price",
      "desc": "Output of service Food Price Quantity Service"
    },
    {
      "name": "_QUANTITY",
      "type": "http://127.0.0.1/ontology/support.owl#Quantity",
      "desc": "Output of service Food Price Quantity Service"
    }
  ],
  "capability": "atomic",
  "file": "food_pricequantity_Aldiservice.owls",
  "provider": {
    "type": "wsdn"
  },
  "inputs": [
    {
      "name": "_FOOD",
      "type": "http://127.0.0.1/ontology/SUMO.owl#Food",
      "desc": "Input of service Food Price Quantity Service"
    }
  ],
  "name": "Food Price Quantity Service",
  "description": "This services informs the price and the available quantity of a given food item.",
  "domains": [
    {
      "name": "Educational",
      "url": "http://www.surf.scss.tcd.ie/cityOntology/#Educational"
    }
  ],
  "id": "education/food_pricequantity_service",
  "state": true,
  "url": "http://surf.scss.tcd.ie/_provider_/education/food_pricequantity_service"
}