{
    "description": "This is the service buy_technology_products",
    "domains": [
        {
            "name": "Technology",
            "url": "http://www.surf.scss.tcd.ie/cityOntology/#Technology"
        }
    ],
    "id": "technology/131_buy_technology_products",
    "inputs": [
        {
            "desc": "Input of service buy_technology_products",
            "name": "_PRODUCTDATA",
            "type": "http://www.surf.scss.tcd.ie/IoTservices.owl#productData"
        }
    ],
    "name": "buy_technology_products",
    "outputs": [
        {
            "desc": "Output of service buy_technology_products",
            "name": "_PRODUCTS",
            "type": "http://www.surf.scss.tcd.ie/IoTservices.owl#products"
        }
    ],
    "provider": {
        "type": "wsdn"
    },
    "state": true,
    "url": "http://surf.scss.tcd.ie/_provider_/technology/131_buy_technology_products"
}