{
  "outputs": [
    {
      "name": "_BEER",
      "type": "http://127.0.0.1/ontology/my_ontology.owl#Beer",
      "desc": "Output of service 2in1ColaBeerService"
    },
    {
      "name": "_COLA",
      "type": "http://127.0.0.1/ontology/my_ontology.owl#Cola",
      "desc": "Output of service 2in1ColaBeerService"
    }
  ],
  "capability": "atomic",
  "file": "maxprice_beercola_service.owls",
  "provider": {
    "type": "wsdn"
  },
  "inputs": [
    {
      "name": "_MAXPRICE",
      "type": "http://127.0.0.1/ontology/concept.owl#MaxPrice",
      "desc": "Input of service 2in1ColaBeerService"
    }
  ],
  "name": "2in1ColaBeerService",
  "description": "This service offer Cola and Beer for the given maximum price.",
  "domains": [
    {
      "name": "Food_and_Drinks",
      "url": "http://www.surf.scss.tcd.ie/cityOntology/#Food_and_Drinks"
    }
  ],
  "id": "food/maxprice_beercola_service",
  "state": true,
  "url": "http://surf.scss.tcd.ie/_provider_/food/maxprice_beercola_service"
}