{
  "outputs": [
    {
      "name": "_CONTENTBEARINGOBJECT",
      "type": "http://127.0.0.1/ontology/SUMO.owl#ContentBearingObject",
      "desc": "Output of service CoffeeWhiskeyPriceInfo Service"
    },
    {
      "name": "_WHISKEY",
      "type": "http://127.0.0.1/ontology/my_ontology.owl#Whiskey",
      "desc": "Output of service CoffeeWhiskeyPriceInfo Service"
    },
    {
      "name": "_COFFEE",
      "type": "http://127.0.0.1/ontology/my_ontology.owl#Coffee",
      "desc": "Output of service CoffeeWhiskeyPriceInfo Service"
    }
  ],
  "capability": "atomic",
  "file": "recommendedprice_contentbearingobjectwhiskeycoffee_service.owls",
  "provider": {
    "type": "wsdn"
  },
  "inputs": [
    {
      "name": "_RECOMMENDEDPRICE",
      "type": "http://127.0.0.1/ontology/concept.owl#RecommendedPrice",
      "desc": "Input of service CoffeeWhiskeyPriceInfo Service"
    }
  ],
  "name": "CoffeeWhiskeyPriceInfo Service",
  "description": "This service returns a coffee and a whiskey for the given recommended price,also it returns proposition of the products.",
  "domains": [
    {
      "name": "Food_and_Drinks",
      "url": "http://www.surf.scss.tcd.ie/cityOntology/#Food_and_Drinks"
    }
  ],
  "id": "food/recommendedprice_contentbearingobjectwhiskeycoffee_service",
  "state": true,
  "url": "http://surf.scss.tcd.ie/_provider_/food/recommendedprice_contentbearingobjectwhiskeycoffee_service"
}