{
  "outputs": [
    {
      "name": "_FUNDING",
      "type": "http://127.0.0.1/ontology/SUMO.owl#Funding",
      "desc": "Output of service GovernmentProjectileWeaponFundingService"
    }
  ],
  "capability": "atomic",
  "file": "projectilegovernment_funding_service.owls",
  "provider": {
    "type": "webservice"
  },
  "inputs": [
    {
      "name": "_GOVERNMENT",
      "type": "http://127.0.0.1/ontology/SUMO.owl#Government",
      "desc": "Input of service GovernmentProjectileWeaponFundingService"
    },
    {
      "name": "_PROJECTILE",
      "type": "http://127.0.0.1/ontology/Mid-level-ontology.owl#Projectile",
      "desc": "Input of service GovernmentProjectileWeaponFundingService"
    }
  ],
  "name": "GovernmentProjectileWeaponFundingService",
  "description": "This service returns you the funding provided for a Projectile weapon, misiles, by the given government.",
  "domains": [
    {
      "name": "Government_and_Planning",
      "url": "http://www.surf.scss.tcd.ie/cityOntology/#Government_and_Planning"
    }
  ],
  "id": "weapon/projectilegovernment_funding_service",
  "state": true,
  "url": "http://surf.scss.tcd.ie/_provider_/weapon/projectilegovernment_funding_service"
}