{
  "outputs": [
    {
      "name": "_DIAGNOSTICPROCESS",
      "type": "http://127.0.0.1/ontology/SUMO.owl#DiagnosticProcess",
      "desc": "Output of service CareOrganization DiagnosticProcess Service"
    }
  ],
  "capability": "atomic",
  "file": "careorganization_diagnosticprocess_service.owls",
  "provider": {
    "type": "asp"
  },
  "inputs": [
    {
      "name": "_CAREORGANIZATION",
      "type": "http://127.0.0.1/ontology/Mid-level-ontology.owl#CareOrganization",
      "desc": "Input of service CareOrganization DiagnosticProcess Service"
    }
  ],
  "name": "CareOrganization DiagnosticProcess Service",
  "description": "This service returns certain type diagnostic process available in the certain care organization.",
  "domains": [
    {
      "name": "Health",
      "url": "http://www.surf.scss.tcd.ie/cityOntology/#Health"
    }
  ],
  "id": "medical/careorganization_diagnosticprocess_service",
  "state": true,
  "url": "http://surf.scss.tcd.ie/_provider_/medical/careorganization_diagnosticprocess_service"
}