{
  "outputs": [
    {
      "name": "_PUBLICATION",
      "type": "http://127.0.0.1/ontology/portal.owl#Publication",
      "desc": "Output of service BookProviderService"
    },
    {
      "name": "_AUTHOR",
      "type": "http://127.0.0.1/ontology/books.owl#Author",
      "desc": "Output of service BookProviderService"
    }
  ],
  "capability": "atomic",
  "file": "isbn_publicationauthor_service.owls",
  "provider": {
    "type": "webservice"
  },
  "inputs": [
    {
      "name": "_ISBN",
      "type": "http://127.0.0.1/ontology/portal.owl#ISBN",
      "desc": "Input of service BookProviderService"
    }
  ],
  "name": "BookProviderService",
  "description": "This service provides a publication title and its author, on the given ISBN.",
  "domains": [
    {
      "name": "Educational",
      "url": "http://www.surf.scss.tcd.ie/cityOntology/#Educational"
    }
  ],
  "id": "education/isbn_publicationauthor_service",
  "state": true,
  "url": "http://surf.scss.tcd.ie/_provider_/education/isbn_publicationauthor_service"
}