{
  "outputs": [
    {
      "name": "_PROFESSION",
      "type": "http://127.0.0.1/ontology/Mid-level-ontology.owl#Profession",
      "desc": "Output of service Municipal-Entity Profession PartTimePosition Service"
    },
    {
      "name": "_PARTTIMEPOSITION",
      "type": "http://127.0.0.1/ontology/Mid-level-ontology.owl#PartTimePosition",
      "desc": "Output of service Municipal-Entity Profession PartTimePosition Service"
    }
  ],
  "capability": "atomic",
  "file": "municipal-unit_professionparttimeposition_service.owls",
  "provider": {
    "type": "wsdn"
  },
  "inputs": [
    {
      "name": "_MUNICIPAL-ENTITY",
      "type": "http://127.0.0.1/ontology/portal.owl#Municipal-Unit",
      "desc": "Input of service Municipal-Entity Profession PartTimePosition Service"
    }
  ],
  "name": "Municipal-Entity Profession PartTimePosition Service",
  "description": "This service returns part time positions offering for professions in a given municipal-unit.",
  "domains": [
    {
      "name": "Government_and_Planning",
      "url": "http://www.surf.scss.tcd.ie/cityOntology/#Government_and_Planning"
    }
  ],
  "id": "governmentandplanning/municipal-unit_professionparttimeposition_service",
  "state": true,
  "url": "http://surf.scss.tcd.ie/_provider_/governmentandplanning/municipal-unit_professionparttimeposition_service"
}