{
  "outputs": [
    {
      "name": "_PUBLICATION",
      "type": "http://127.0.0.1/ontology/portal.owl#Publication",
      "desc": "Output of service Academic-Number Publication Service"
    }
  ],
  "capability": "atomic",
  "file": "academic-item-number_publication_service.owls",
  "provider": {
    "type": "asp"
  },
  "inputs": [
    {
      "name": "_ACADEMIC-ITEM-NUMBER",
      "type": "http://127.0.0.1/ontology/portal.owl#Academic-Item-Number",
      "desc": "Input of service Academic-Number Publication Service"
    }
  ],
  "name": "Academic-Number Publication Service",
  "description": "Returns a publication using the academic item number",
  "domains": [
    {
      "name": "Educational",
      "url": "http://www.surf.scss.tcd.ie/cityOntology/#Educational"
    }
  ],
  "id": "education/academic-item-number_publication_service",
  "state": true,
  "url": "http://surf.scss.tcd.ie/_provider_/education/academic-item-number_publication_service"
}