{
  "outputs": [
    {
      "name": "_INTERNALCHANGE",
      "type": "http://127.0.0.1/ontology/SUMO.owl#InternalChange",
      "desc": "Output of service GIS service"
    }
  ],
  "capability": "atomic",
  "file": "geopolitical-entity_internalchange_service.owls",
  "provider": {
    "type": "webservice"
  },
  "inputs": [
    {
      "name": "_GEOPOLITICAL-ENTITY",
      "type": "http://127.0.0.1/ontology/portal.owl#Geopolitical-Entity",
      "desc": "Input of service GIS service"
    }
  ],
  "name": "GIS service",
  "description": "GIS service informs you about internal change, like weather conditionand soil material, of the given geopolitical entity.",
  "domains": [
    {
      "name": "Travel",
      "url": "http://www.surf.scss.tcd.ie/cityOntology/#Travel"
    }
  ],
  "id": "travel/geopolitical-entity_internalchange_service",
  "state": true,
  "url": "http://surf.scss.tcd.ie/_provider_/travel/geopolitical-entity_internalchange_service"
}