{
  "outputs": [
    {
      "name": "_PROFESSION",
      "type": "http://127.0.0.1/ontology/Mid-level-ontology.owl#Profession",
      "desc": "Output of service ProfessionOffer"
    }
  ],
  "capability": "atomic",
  "file": "country_profession_service.owls",
  "provider": {
    "type": "wsdn"
  },
  "inputs": [
    {
      "name": "_COUNTRY",
      "type": "http://127.0.0.1/ontology/portal.owl#Country",
      "desc": "Input of service ProfessionOffer"
    }
  ],
  "name": "ProfessionOffer",
  "description": "This service returns available profession jobs in a given country.",
  "domains": [
    {
      "name": "Industry",
      "url": "http://www.surf.scss.tcd.ie/cityOntology/#Industry"
    }
  ],
  "id": "industry/country_profession_service",
  "state": true,
  "url": "http://surf.scss.tcd.ie/_provider_/industry/country_profession_service"
}