{
  "outputs": [
    {
      "name": "_RECOMMENDEDPRICE",
      "type": "http://127.0.0.1/ontology/concept.owl#RecommendedPrice",
      "desc": "Output of service Butter RecommendedPrice Service"
    }
  ],
  "capability": "atomic",
  "file": "butter_recommendedprice_service.owls",
  "provider": {
    "type": "asp"
  },
  "inputs": [
    {
      "name": "_BUTTER",
      "type": "http://127.0.0.1/ontology/Mid-level-ontology.owl#Butter",
      "desc": "Input of service Butter RecommendedPrice Service"
    }
  ],
  "name": "Butter RecommendedPrice Service",
  "description": "This service returns recommended price of some butter brand. The amount of butter is 1kg.",
  "domains": [
    {
      "name": "Food_and_Drinks",
      "url": "http://www.surf.scss.tcd.ie/cityOntology/#Food_and_Drinks"
    }
  ],
  "id": "food/butter_recommendedprice_service",
  "state": true,
  "url": "http://surf.scss.tcd.ie/_provider_/food/butter_recommendedprice_service"
}