{
  "outputs": [
    {
      "name": "_COMPACT",
      "type": "http://127.0.0.1/ontology/extendedCamera.owl#Compact",
      "desc": "Output of service MercantileOrganization Compact Price service"
    },
    {
      "name": "_PRICE",
      "type": "http://127.0.0.1/ontology/concept.owl#Price",
      "desc": "Output of service MercantileOrganization Compact Price service"
    }
  ],
  "capability": "atomic",
  "file": "mercantileorganization_compactprice_service.owls",
  "provider": {
    "type": "webservice"
  },
  "inputs": [
    {
      "name": "_MERCANTILEORGANIZATION",
      "type": "http://127.0.0.1/ontology/SUMO.owl#MercantileOrganization",
      "desc": "Input of service MercantileOrganization Compact Price service"
    }
  ],
  "name": "MercantileOrganization Compact Price service",
  "description": "This service informs you the price for a compact camera available in a given mercantile organization.",
  "domains": [
    {
      "name": "Payment_and_Delivery",
      "url": "http://www.surf.scss.tcd.ie/cityOntology/#Payment_and_Delivery"
    }
  ],
  "id": "payment/mercantileorganization_compactprice_service",
  "state": true,
  "url": "http://surf.scss.tcd.ie/_provider_/payment/mercantileorganization_compactprice_service"
}