{
  "outputs": [
    {
      "name": "_TECHNOLOGY",
      "type": "http://127.0.0.1/ontology/portal.owl#Technology",
      "desc": "Output of service CarTechnology service"
    }
  ],
  "capability": "atomic",
  "file": "car_technology_service.owls",
  "provider": {
    "type": "webservice"
  },
  "inputs": [
    {
      "name": "_CAR",
      "type": "http://127.0.0.1/ontology/my_ontology.owl#Car",
      "desc": "Input of service CarTechnology service"
    }
  ],
  "name": "CarTechnology service",
  "description": "This service returns information of the used technology, e.g. GPS, ABS, etc. in the given car model.",
  "domains": [
    {
      "name": "Vehicle_Sale_and_Rent",
      "url": "http://www.surf.scss.tcd.ie/cityOntology/#Vehicle_Sale_and_Rent"
    }
  ],
  "id": "vehicle/car_technology_service",
  "state": true,
  "url": "http://surf.scss.tcd.ie/_provider_/vehicle/car_technology_service"
}