{
  "outputs": [
    {
      "name": "_postal-address",
      "type": "string",
      "desc": "Output of service Academic Postal-Address Service"
    }
  ],
  "provider": {
    "type": "wsdn"
  },
  "inputs": [
    {
      "name": "_academic",
      "type": "string",
      "desc": "Input of service Academic Postal-Address Service"
    }
  ],
  "name": "Academic Postal-Address Service",
  "description": "This service returns an address of an academic of a university.",
  "domains": [
    {
      "name": "Furniture_and_Housing",
      "url": "http://www.surf.scss.tcd.ie/cityOntology/#Furniture_and_Housing"
    }
  ],
  "id": "educational/academic_postal-address_service",
  "state": true,
  "url": "http://surf.scss.tcd.ie/_provider_/educational/academic_postal-address_service"
}