{
  "outputs": [
    {
      "name": "_BREADORBISCUIT",
      "type": "http://127.0.0.1/ontology/Mid-level-ontology.owl#BreadOrBiscuit",
      "desc": "Output of service RetailStore BreadOrBiscuit Quantity Service"
    },
    {
      "name": "_QUANTITY",
      "type": "http://127.0.0.1/ontology/support.owl#Quantity",
      "desc": "Output of service RetailStore BreadOrBiscuit Quantity Service"
    }
  ],
  "capability": "atomic",
  "file": "retailstore_breadorbiscuitquantity_service.owls",
  "provider": {
    "type": "webservice"
  },
  "inputs": [
    {
      "name": "_RETAILSTORE",
      "type": "http://127.0.0.1/ontology/Mid-level-ontology.owl#RetailStore",
      "desc": "Input of service RetailStore BreadOrBiscuit Quantity Service"
    }
  ],
  "name": "RetailStore BreadOrBiscuit Quantity Service",
  "description": "This service informs you whether bread or biscuit are available in a given retail store and its quantity.",
  "domains": [
    {
      "name": "Food_and_Drinks",
      "url": "http://www.surf.scss.tcd.ie/cityOntology/#Food_and_Drinks"
    }
  ],
  "id": "food/retailstore_breadorbiscuitquantity_service",
  "state": true,
  "url": "http://surf.scss.tcd.ie/_provider_/food/retailstore_breadorbiscuitquantity_service"
}