{
  "outputs": [
    {
      "name": "_SUNSET",
      "type": "http://127.0.0.1/ontology/geographydataset.owl#Sunset",
      "desc": "Output of service Sunrise,Sunset and Twilight Time Calcutator Service."
    },
    {
      "name": "_SUNSET-TWILIGHT",
      "type": "http://127.0.0.1/ontology/geographydataset.owl#Twilight",
      "desc": "Output of service Sunrise,Sunset and Twilight Time Calcutator Service."
    },
    {
      "name": "_SUNRISE",
      "type": "http://127.0.0.1/ontology/geographydataset.owl#Sunrise",
      "desc": "Output of service Sunrise,Sunset and Twilight Time Calcutator Service."
    },
    {
      "name": "_SUNRISE-TWILIGHT",
      "type": "http://127.0.0.1/ontology/geographydataset.owl#Twilight",
      "desc": "Output of service Sunrise,Sunset and Twilight Time Calcutator Service."
    }
  ],
  "capability": "atomic",
  "file": "getSunsetSunriseTwilightTime.owls",
  "provider": {
    "type": "webservice"
  },
  "inputs": [
    {
      "name": "_LICENSEKEY",
      "type": "http://127.0.0.1/ontology/geographydataset.owl#Code",
      "desc": "Input of service Sunrise,Sunset and Twilight Time Calcutator Service."
    },
    {
      "name": "_DATE",
      "type": "http://127.0.0.1/ontology/protonu.owl#Date",
      "desc": "Input of service Sunrise,Sunset and Twilight Time Calcutator Service."
    },
    {
      "name": "_LATITUDE",
      "type": "http://127.0.0.1/ontology/protont.owl#latitude",
      "desc": "Input of service Sunrise,Sunset and Twilight Time Calcutator Service."
    },
    {
      "name": "_LONGITUDE",
      "type": "http://127.0.0.1/ontology/protont.owl#longitude",
      "desc": "Input of service Sunrise,Sunset and Twilight Time Calcutator Service."
    },
    {
      "name": "_TIMEZONE",
      "type": "http://127.0.0.1/ontology/protonu.owl#TimeZone",
      "desc": "Input of service Sunrise,Sunset and Twilight Time Calcutator Service."
    }
  ],
  "name": "Sunrise,Sunset and Twilight Time Calcutator Service.",
  "description": "This service calculates Sunrise,Sunset and Twilight times for a certain date of a given location worldwide (latitude/longitude pair). The time zone of the given location is also provided.For using this service valid License Key should be provided.",
  "domains": [
    {
      "name": "Geography",
      "url": "http://www.surf.scss.tcd.ie/cityOntology/#Geography"
    },
    {
      "name": "Travel",
      "url": "http://www.surf.scss.tcd.ie/cityOntology/#Travel"
    }
  ],
  "id": "travel/getSunsetSunriseTwilightTime",
  "state": true,
  "url": "http://surf.scss.tcd.ie/_provider_/travel/getSunsetSunriseTwilightTime"
}