{
  "outputs": [
    {
      "name": "_beach",
      "type": "string",
      "desc": "Output of service SurfingBeachService"
    }
  ],
  "provider": {
    "type": "webservice"
  },
  "inputs": [
    {
      "name": "_surfing",
      "type": "string",
      "desc": "Input of service SurfingBeachService"
    }
  ],
  "name": "SurfingBeachService",
  "description": "This is the best service to know aboutthe beach for surfing.",
  "domains": [
    {
      "name": "Sport",
      "url": "http://www.surf.scss.tcd.ie/cityOntology/#Sport"
    }
  ],
  "id": "tourism/surfing_beach_service",
  "state": true,
  "url": "http://surf.scss.tcd.ie/_provider_/tourism/surfing_beach_service"
}