{
  "outputs": [
    {
      "name": "_POSTAL-ADDRESS",
      "type": "http://127.0.0.1/ontology/portal.owl#Postal-Address",
      "desc": "Output of service Employee postal address  service"
    }
  ],
  "capability": "atomic",
  "file": "employee_postal-address_service.owls",
  "provider": {
    "type": "webservice"
  },
  "inputs": [
    {
      "name": "_EMPLOYEE",
      "type": "http://127.0.0.1/ontology/portal.owl#Employee",
      "desc": "Input of service Employee postal address  service"
    }
  ],
  "name": "Employee postal address  service",
  "description": "This service returns an postal address of an employee.",
  "domains": [
    {
      "name": "Industry",
      "url": "http://www.surf.scss.tcd.ie/cityOntology/#Industry"
    }
  ],
  "id": "industry/employee_postal-address_service",
  "state": true,
  "url": "http://surf.scss.tcd.ie/_provider_/industry/employee_postal-address_service"
}