{
  "outputs": [
    {
      "name": "buildingIntrusionAlert",
      "type": "alert"
    }
  ],
  "provider": {
    "type": "wsdn"
  },
  "inputs": [
    {
      "name": "buildingInfo",
      "type": "xml"
    }
  ],
  "name": "building_intruder_detection",
  "description": "This is the service building_intruder_detection",
  "domains": [
    {
      "name": "Safety_and_Emergencies",
      "url": "http://www.surf.scss.tcd.ie/cityOntology/#Safety_and_Emergencies"
    },
    {
      "name": "Buildings",
      "url": "http://www.surf.scss.tcd.ie/cityOntology/#Buildings"
    }
  ],
  "id": "38/building_intruder_detection",
  "state": true,
  "url": "http://surf.scss.tcd.ie/_provider_/building_intruder_detection"
}