{
  "outputs": [
    {
      "name": "_AUTHOR",
      "type": "http://127.0.0.1/ontology/books.owl#Author",
      "desc": "Output of service BAT Service"
    },
    {
      "name": "_BOOK-TYPE",
      "type": "http://127.0.0.1/ontology/books.owl#Book-Type",
      "desc": "Output of service BAT Service"
    }
  ],
  "capability": "atomic",
  "file": "book_authorbook-type_service.owls",
  "provider": {
    "type": "webservice"
  },
  "inputs": [
    {
      "name": "_BOOK",
      "type": "http://127.0.0.1/ontology/books.owl#Book",
      "desc": "Input of service BAT Service"
    }
  ],
  "name": "BAT Service",
  "description": "BAT service is one of most reliable service to return author name and book-type of the given book title.",
  "domains": [
    {
      "name": "Educational",
      "url": "http://www.surf.scss.tcd.ie/cityOntology/#Educational"
    }
  ],
  "id": "education/book_authorbook-type_service",
  "state": true,
  "url": "http://surf.scss.tcd.ie/_provider_/education/book_authorbook-type_service"
}