{
  "outputs": [
    {
      "name": "_FUNDING",
      "type": "http://127.0.0.1/ontology/SUMO.owl#Funding",
      "desc": "Output of service Government Academic Degree Scholarship Service"
    }
  ],
  "capability": "atomic",
  "file": "awardgovernment_funding_service.owls",
  "provider": {
    "type": "webservice"
  },
  "inputs": [
    {
      "name": "_GOVERNMENT",
      "type": "http://127.0.0.1/ontology/SUMO.owl#Government",
      "desc": "Input of service Government Academic Degree Scholarship Service"
    },
    {
      "name": "_AWARD",
      "type": "http://127.0.0.1/ontology/portal.owl#Award",
      "desc": "Input of service Government Academic Degree Scholarship Service"
    }
  ],
  "name": "Government Academic Degree Scholarship Service",
  "description": "This service provides infos about fundings offered by a given government for a given award.",
  "domains": [
    {
      "name": "Educational",
      "url": "http://www.surf.scss.tcd.ie/cityOntology/#Educational"
    }
  ],
  "id": "education/awardgovernment_funding_service",
  "state": true,
  "url": "http://surf.scss.tcd.ie/_provider_/education/awardgovernment_funding_service"
}