{
  "outputs": [
    {
      "name": "_TAXEDPRICE",
      "type": "http://127.0.0.1/ontology/concept.owl#TaxedPrice",
      "desc": "Output of service Sandwich TaxedPrice Service"
    }
  ],
  "capability": "atomic",
  "file": "sandwich_taxedprice_service.owls",
  "provider": {
    "type": "wsdn"
  },
  "inputs": [
    {
      "name": "_SANDWICH",
      "type": "http://127.0.0.1/ontology/Mid-level-ontology.owl#Sandwich",
      "desc": "Input of service Sandwich TaxedPrice Service"
    }
  ],
  "name": "Sandwich TaxedPrice Service",
  "description": "This service returns latest taxed price of given sandwich type.",
  "domains": [
    {
      "name": "Food_and_Drinks",
      "url": "http://www.surf.scss.tcd.ie/cityOntology/#Food_and_Drinks"
    }
  ],
  "id": "food/sandwich_taxedprice_service",
  "state": true,
  "url": "http://surf.scss.tcd.ie/_provider_/food/sandwich_taxedprice_service"
}