{
    "capability": "atomic",
    "description": "This service offer a delicious drink for a maximum price,for example cola.",
    "domains": [
        {
            "name": "Food_and_Drinks",
            "url": "http://www.surf.scss.tcd.ie/cityOntology/#Food_and_Drinks"
        }
    ],
    "file": "maxprice_drinks_service.owls",
    "id": "food/maxprice_drinks_service",
    "inputs": [
        {
            "desc": "Input of service DrinksService",
            "name": "_MAXPRICE",
            "type": "http://127.0.0.1/ontology/concept.owl#MaxPrice"
        }
    ],
    "name": "DrinksService",
    "outputs": [
        {
            "desc": "Output of service DrinksService",
            "name": "_DRINKS",
            "type": "http://127.0.0.1/ontology/my_ontology.owl#Drinks"
        }
    ],
    "provider": {
        "type": "webservice"
    },
    "state": true,
    "url": "http://surf.scss.tcd.ie/_provider_/food/maxprice_drinks_service"
}