{
  "outputs": [
    {
      "name": "_LUXURYHOTEL",
      "type": "http://127.0.0.1/ontology/travel.owl#LuxuryHotel",
      "desc": "Output of service Geopolitical-Entity LuxuryHotel Service"
    }
  ],
  "capability": "atomic",
  "file": "geopolitical-entity_luxuryhotel_service.owls",
  "provider": {
    "type": "asp"
  },
  "inputs": [
    {
      "name": "_GEOPOLITICAL-ENTITY",
      "type": "http://127.0.0.1/ontology/portal.owl#Geopolitical-Entity",
      "desc": "Input of service Geopolitical-Entity LuxuryHotel Service"
    }
  ],
  "name": "Geopolitical-Entity LuxuryHotel Service",
  "description": "This service is a favourite service that returns luxury hotels info of the given geopolitical-entity.",
  "domains": [
    {
      "name": "Travel",
      "url": "http://www.surf.scss.tcd.ie/cityOntology/#Travel"
    },
    {
      "name": "Accommodation",
      "url": "http://www.surf.scss.tcd.ie/cityOntology/#Accommodation"
    }
  ],
  "id": "accommodation/geopolitical-entity_luxuryhotel_service",
  "state": true,
  "url": "http://surf.scss.tcd.ie/_provider_/accommodation/geopolitical-entity_luxuryhotel_service"
}