{
  "outputs": [
    {
      "name": "_PRICE",
      "type": "http://127.0.0.1/ontology/concept.owl#Price",
      "desc": "Output of service MachinePrice"
    }
  ],
  "capability": "atomic",
  "file": "machine_price_service.owls",
  "provider": {
    "type": "asp"
  },
  "inputs": [
    {
      "name": "_MACHINE",
      "type": "http://127.0.0.1/ontology/my_ontology.owl#Machine",
      "desc": "Input of service MachinePrice"
    }
  ],
  "name": "MachinePrice",
  "description": "This site recommends purchase price for grind machine.",
  "domains": [
    {
      "name": "Technology",
      "url": "http://www.surf.scss.tcd.ie/cityOntology/#Technology"
    }
  ],
  "id": "technology/machine_price_service",
  "state": true,
  "url": "http://surf.scss.tcd.ie/_provider_/technology/machine_price_service"
}