{
  "outputs": [
    {
      "name": "_DISTANCE",
      "type": "http://127.0.0.1/ontology/geographydataset.owl#GeographicDistance",
      "desc": "Output of service Distance calculator between two locations"
    }
  ],
  "capability": "atomic",
  "file": "calculateDistanceUsingSphericalGeometry.owls",
  "provider": {
    "type": "wsdn"
  },
  "inputs": [
    {
      "name": "_LATITUDE1",
      "type": "http://127.0.0.1/ontology/protont.owl#latitude",
      "desc": "Input of service Distance calculator between two locations"
    },
    {
      "name": "_LONGITUDE1",
      "type": "http://127.0.0.1/ontology/protont.owl#longitude",
      "desc": "Input of service Distance calculator between two locations"
    },
    {
      "name": "_LATITUDE2",
      "type": "http://127.0.0.1/ontology/protont.owl#latitude",
      "desc": "Input of service Distance calculator between two locations"
    },
    {
      "name": "_LONGITUDE2",
      "type": "http://127.0.0.1/ontology/protont.owl#longitude",
      "desc": "Input of service Distance calculator between two locations"
    }
  ],
  "name": "Distance calculator between two locations",
  "description": "This service calculates the distance in kilometers between two locations using longitude and latitude. This is calculated using spherical geometry. The distance is a straight line.",
  "domains": [
    {
      "name": "Geography",
      "url": "http://www.surf.scss.tcd.ie/cityOntology/#Geography"
    },
    {
      "name": "Travel",
      "url": "http://www.surf.scss.tcd.ie/cityOntology/#Travel"
    }
  ],
  "id": "travel/calculateDistanceUsingSphericalGeometry",
  "state": true,
  "url": "http://surf.scss.tcd.ie/_provider_/travel/calculateDistanceUsingSphericalGeometry"
}