{
  "outputs": [
    {
      "name": "_SKILLEDOCCUPATION",
      "type": "http://127.0.0.1/ontology/Mid-level-ontology.owl#SkilledOccupation",
      "desc": "Output of service countryJobs service"
    },
    {
      "name": "_TIMEDURATION",
      "type": "http://127.0.0.1/ontology/SUMO.owl#TimeDuration",
      "desc": "Output of service countryJobs service"
    }
  ],
  "capability": "atomic",
  "file": "country_skilledoccupationtimeduration_service.owls",
  "provider": {
    "type": "asp"
  },
  "inputs": [
    {
      "name": "_COUNTRY",
      "type": "http://127.0.0.1/ontology/portal.owl#Country",
      "desc": "Input of service countryJobs service"
    }
  ],
  "name": "countryJobs service",
  "description": "This service returns skilled occupation job in a given country and its time duration.",
  "domains": [
    {
      "name": "Educational",
      "url": "http://www.surf.scss.tcd.ie/cityOntology/#Educational"
    }
  ],
  "id": "education/country_skilledoccupationtimeduration_service",
  "state": true,
  "url": "http://surf.scss.tcd.ie/_provider_/education/country_skilledoccupationtimeduration_service"
}