{
  "outputs": [
    {
      "name": "_PRICE",
      "type": "http://127.0.0.1/ontology/concept.owl#Price",
      "desc": "Output of service ScienceFictionNovel priceAuthor Service"
    },
    {
      "name": "_AUTHOR",
      "type": "http://127.0.0.1/ontology/books.owl#Author",
      "desc": "Output of service ScienceFictionNovel priceAuthor Service"
    }
  ],
  "capability": "atomic",
  "file": "science-fiction-novel_priceauthor_service.owls",
  "provider": {
    "type": "webservice"
  },
  "inputs": [
    {
      "name": "_SCIENCE-FICTION-NOVEL",
      "type": "http://127.0.0.1/ontology/books.owl#Science-Fiction-Novel",
      "desc": "Input of service ScienceFictionNovel priceAuthor Service"
    }
  ],
  "name": "ScienceFictionNovel priceAuthor Service",
  "description": "ScienceFictionNovel is an attractive service to get price and author of a science-fiction novel.",
  "domains": [
    {
      "name": "Entertainment_Products",
      "url": "http://www.surf.scss.tcd.ie/cityOntology/#Entertainment_Products"
    },
    {
      "name": "Educational",
      "url": "http://www.surf.scss.tcd.ie/cityOntology/#Educational"
    }
  ],
  "id": "books/science-fiction-novel_priceauthor_service",
  "state": true,
  "url": "http://surf.scss.tcd.ie/_provider_/books/science-fiction-novel_priceauthor_service"
}