{
  "outputs": [
    {
      "name": "_map",
      "type": "string",
      "desc": "Output of service CountaryMap Service"
    }
  ],
  "provider": {
    "type": "asp"
  },
  "inputs": [
    {
      "name": "_country",
      "type": "string",
      "desc": "Input of service CountaryMap Service"
    }
  ],
  "name": "CountaryMap Service",
  "description": "This service returns a map of a given countary. This map is useful to finda route for traveling between two cities.",
  "domains": [
    {
      "name": "Arts",
      "url": "http://www.surf.scss.tcd.ie/cityOntology/#Arts"
    }
  ],
  "id": "mobility/country_map_service",
  "state": true,
  "url": "http://surf.scss.tcd.ie/_provider_/mobility/country_map_service"
}