{
  "outputs": [
    {
      "name": "_SLR",
      "type": "http://127.0.0.1/ontology/extendedCamera.owl#SLR",
      "desc": "Output of service MercantileOrganization SLR Price service"
    },
    {
      "name": "_PRICE",
      "type": "http://127.0.0.1/ontology/concept.owl#Price",
      "desc": "Output of service MercantileOrganization SLR Price service"
    }
  ],
  "capability": "atomic",
  "file": "mercantileorganization_slrprice_service.owls",
  "provider": {
    "type": "webservice"
  },
  "inputs": [
    {
      "name": "_MERCANTILEORGANIZATION",
      "type": "http://127.0.0.1/ontology/SUMO.owl#MercantileOrganization",
      "desc": "Input of service MercantileOrganization SLR Price service"
    }
  ],
  "name": "MercantileOrganization SLR Price service",
  "description": "This service informs you the price for a slr camera available in a given mercantile organization.",
  "domains": [
    {
      "name": "Technology",
      "url": "http://www.surf.scss.tcd.ie/cityOntology/#Technology"
    }
  ],
  "id": "technology/mercantileorganization_slrprice_service",
  "state": true,
  "url": "http://surf.scss.tcd.ie/_provider_/technology/mercantileorganization_slrprice_service"
}