{
  "outputs": [
    {
      "name": "_POSTALCODE",
      "type": "http://127.0.0.1/ontology/geographydataset.owl#PostalCode",
      "desc": "Output of service City matcher service."
    },
    {
      "name": "_TIMEZONE",
      "type": "http://127.0.0.1/ontology/protonu.owl#TimeZone",
      "desc": "Output of service City matcher service."
    },
    {
      "name": "_STATE",
      "type": "http://127.0.0.1/ontology/protonu.owl#State",
      "desc": "Output of service City matcher service."
    },
    {
      "name": "_MATCHED-CITY",
      "type": "http://127.0.0.1/ontology/protonu.owl#City",
      "desc": "Output of service City matcher service."
    },
    {
      "name": "_COUNTRY",
      "type": "http://127.0.0.1/ontology/protonu.owl#Country",
      "desc": "Output of service City matcher service."
    }
  ],
  "capability": "atomic",
  "file": "getListOfMatchingCities.owls",
  "provider": {
    "type": "wsdn"
  },
  "inputs": [
    {
      "name": "_USERID",
      "type": "http://127.0.0.1/ontology/geographydataset.owl#UniqueIdentifier",
      "desc": "Input of service City matcher service."
    },
    {
      "name": "_CITY",
      "type": "http://127.0.0.1/ontology/protonu.owl#City",
      "desc": "Input of service City matcher service."
    }
  ],
  "name": "City matcher service.",
  "description": "This service returns a list of matching cities for the given city name. For each matching city, the state and country name,the time zone, the postal code are given. If a city has several postal codes, multiple corresponding entries are returned.For using this service valid UserID should be provided.",
  "domains": [
    {
      "name": "Geography",
      "url": "http://www.surf.scss.tcd.ie/cityOntology/#Geography"
    }
  ],
  "id": "geography/list_matching_cities_service",
  "state": true,
  "url": "http://surf.scss.tcd.ie/_provider_/geography/list_matching_cities_service"
}