{
  "outputs": [
    {
      "name": "_MAXPRICE",
      "type": "http://127.0.0.1/ontology/concept.owl#MaxPrice",
      "desc": "Output of service DVCameraPriceService"
    },
    {
      "name": "_DIGITAL-VIDEO",
      "type": "http://127.0.0.1/ontology/extendedCamera.owl#Digital-Video",
      "desc": "Output of service DVCameraPriceService"
    }
  ],
  "capability": "atomic",
  "file": "shoppingmall_maxpricedigital-video_service.owls",
  "provider": {
    "type": "asp"
  },
  "inputs": [
    {
      "name": "_SHOPPINGMALL",
      "type": "http://127.0.0.1/ontology/Mid-level-ontology.owl#ShoppingMall",
      "desc": "Input of service DVCameraPriceService"
    }
  ],
  "name": "DVCameraPriceService",
  "description": "This service retruns a certain digital video camera with its maximum price availbility at a certain shopping mall",
  "domains": [
    {
      "name": "Technology",
      "url": "http://www.surf.scss.tcd.ie/cityOntology/#Technology"
    }
  ],
  "id": "technology/shoppingmall_maxpricedigital-video_service",
  "state": true,
  "url": "http://surf.scss.tcd.ie/_provider_/technology/shoppingmall_maxpricedigital-video_service"
}