{
  "outputs": [
    {
      "name": "_FOOD",
      "type": "http://127.0.0.1/ontology/SUMO.owl#Food",
      "desc": "Output of service RetailStore Food Quantity Service"
    },
    {
      "name": "_QUANTITY",
      "type": "http://127.0.0.1/ontology/support.owl#Quantity",
      "desc": "Output of service RetailStore Food Quantity Service"
    }
  ],
  "capability": "atomic",
  "file": "retailstore_foodquantity_service.owls",
  "provider": {
    "type": "wsdn"
  },
  "inputs": [
    {
      "name": "_RETAILSTORESTORE",
      "type": "http://127.0.0.1/ontology/Mid-level-ontology.owl#RetailStore",
      "desc": "Input of service RetailStore Food Quantity Service"
    }
  ],
  "name": "RetailStore Food Quantity Service",
  "description": "This service informs you about food items which are available in a given retail store and their available quantity.",
  "domains": [
    {
      "name": "Food_and_Drinks",
      "url": "http://www.surf.scss.tcd.ie/cityOntology/#Food_and_Drinks"
    }
  ],
  "id": "food/retailstore_foodquantity_service",
  "state": true,
  "url": "http://surf.scss.tcd.ie/_provider_/food/retailstore_foodquantity_service"
}