{
  "outputs": [
    {
      "name": "_WHISKEY",
      "type": "http://127.0.0.1/ontology/my_ontology.owl#Whiskey",
      "desc": "Output of service PriceCoffeeWhiskey Service"
    },
    {
      "name": "_COFFEE",
      "type": "http://127.0.0.1/ontology/my_ontology.owl#Coffee",
      "desc": "Output of service PriceCoffeeWhiskey Service"
    }
  ],
  "capability": "atomic",
  "file": "price_whiskeycoffee_Zikoservice.owls",
  "provider": {
    "type": "wsdn"
  },
  "inputs": [
    {
      "name": "_PRICE",
      "type": "http://127.0.0.1/ontology/concept.owl#Price",
      "desc": "Input of service PriceCoffeeWhiskey Service"
    }
  ],
  "name": "PriceCoffeeWhiskey Service",
  "description": "Ziko service is mostly used to find coffee and whiskey (products) for the given price.",
  "domains": [
    {
      "name": "Food_and_Drinks",
      "url": "http://www.surf.scss.tcd.ie/cityOntology/#Food_and_Drinks"
    }
  ],
  "id": "food/price_whiskeycoffee_service",
  "state": true,
  "url": "http://surf.scss.tcd.ie/_provider_/food/price_whiskeycoffee_service"
}