{
    "capability": "atomic",
    "description": "This service returns recommended prices of a set of MP3Player brand and DVD Player brand.",
    "domains": [
        {
            "name": "Technology",
            "url": "http://www.surf.scss.tcd.ie/cityOntology/#Technology"
        }
    ],
    "file": "dvdplayermp3player_Recprice_service.owls",
    "id": "technology/dvdplayermp3player_recprice_service",
    "inputs": [
        {
            "desc": "Input of service 2For 1 Price service",
            "name": "_MP3PLAYER",
            "type": "http://127.0.0.1/ontology/my_ontology.owl#MP3Player"
        },
        {
            "desc": "Input of service 2For 1 Price service",
            "name": "_DVDPLAYER",
            "type": "http://127.0.0.1/ontology/my_ontology.owl#DVDPlayer"
        }
    ],
    "name": "2For 1 Price service",
    "outputs": [
        {
            "desc": "Output of service 2For 1 Price service",
            "name": "_RECPRICE",
            "type": "http://127.0.0.1/ontology/concept.owl#RecommendedPrice"
        }
    ],
    "provider": {
        "type": "asp"
    },
    "state": true,
    "url": "http://surf.scss.tcd.ie/_provider_/technology/dvdplayermp3player_recprice_service"
}