{
  "outputs": [
    {
      "name": "_LENDING",
      "type": "http://127.0.0.1/ontology/SUMO.owl#Lending",
      "desc": "Output of service CityGovernement Lending Service"
    }
  ],
  "capability": "atomic",
  "file": "citygovernment_lending_service.owls",
  "provider": {
    "type": "wsdn"
  },
  "inputs": [
    {
      "name": "_CITYGOVERNMENT",
      "type": "http://127.0.0.1/ontology/Mid-level-ontology.owl#CityGovernment",
      "desc": "Input of service CityGovernement Lending Service"
    }
  ],
  "name": "CityGovernement Lending Service",
  "description": "This service gives you acknowledgement for the lending as a special offer from the given city government.",
  "domains": [
    {
      "name": "Industry",
      "url": "http://www.surf.scss.tcd.ie/cityOntology/#Industry"
    }
  ],
  "id": "industry/citygovernment_lending_service",
  "state": true,
  "url": "http://surf.scss.tcd.ie/_provider_/industry/citygovernment_lending_service"
}