{
  "outputs": [
    {
      "name": "_year",
      "type": "string",
      "desc": "Output of service car price service"
    },
    {
      "name": "_price",
      "type": "string",
      "desc": "Output of service car price service"
    }
  ],
  "provider": {
    "type": "asp"
  },
  "inputs": [
    {
      "name": "_auto",
      "type": "string",
      "desc": "Input of service car price service"
    }
  ],
  "name": "car price service",
  "description": "Some ones are interested to know price and model of an auto,this service is a nice service to fulfill the requirements.",
  "domains": [
    {
      "name": "Sport",
      "url": "http://www.surf.scss.tcd.ie/cityOntology/#Sport"
    }
  ],
  "id": "retail/auto_yearprice_service",
  "state": true,
  "url": "http://surf.scss.tcd.ie/_provider_/retail/auto_yearprice_service"
}