{
  "outputs": [
    {
      "name": "_PRICE",
      "type": "http://127.0.0.1/ontology/concept.owl#Price",
      "desc": "Output of service 4WheeledCar 2PersonBicyclePrice service"
    }
  ],
  "capability": "atomic",
  "file": "4wheeledcar2personbicycle_price_service.owls",
  "provider": {
    "type": "webservice"
  },
  "inputs": [
    {
      "name": "_2PERSONBICYCLE",
      "type": "http://127.0.0.1/ontology/my_ontology.owl#TwoPersonBicycle",
      "desc": "Input of service 4WheeledCar 2PersonBicyclePrice service"
    },
    {
      "name": "_4WHEELEDCAR",
      "type": "http://127.0.0.1/ontology/my_ontology.owl#FourWheeledCar",
      "desc": "Input of service 4WheeledCar 2PersonBicyclePrice service"
    }
  ],
  "name": "4WheeledCar 2PersonBicyclePrice service",
  "description": "This service returns renting price of the given pair of a four wheeled car model and two-person bicycle model.The renting price is for two day rent.",
  "id": "economy/4wheeledcar2personbicycle_price_service",
  "state": true,
  "url": "http://surf.scss.tcd.ie/_provider_/economy/4wheeledcar2personbicycle_price_service"
}