{
  "outputs": [
    {
      "name": "_PUBLISHER",
      "type": "http://127.0.0.1/ontology/books.owl#Publisher",
      "desc": "Output of service Publication Publisher Service"
    }
  ],
  "capability": "atomic",
  "file": "publication_publisher_service.owls",
  "provider": {
    "type": "wsdn"
  },
  "inputs": [
    {
      "name": "_PUBLICATION",
      "type": "http://127.0.0.1/ontology/books.owl#Publication",
      "desc": "Input of service Publication Publisher Service"
    }
  ],
  "name": "Publication Publisher Service",
  "description": "This service returns publisher of a certain publication.",
  "domains": [
    {
      "name": "Entertainment_Products",
      "url": "http://www.surf.scss.tcd.ie/cityOntology/#Entertainment_Products"
    },
    {
      "name": "Educational",
      "url": "http://www.surf.scss.tcd.ie/cityOntology/#Educational"
    }
  ],
  "id": "books/publication_publisher_service",
  "state": true,
  "url": "http://surf.scss.tcd.ie/_provider_/books/publication_publisher_service"
}