{
  "outputs": [
    {
      "name": "_READER",
      "type": "http://127.0.0.1/ontology/books.owl#Reader",
      "desc": "Output of service BookRRPService"
    },
    {
      "name": "_REVIEW",
      "type": "http://127.0.0.1/ontology/books.owl#Review",
      "desc": "Output of service BookRRPService"
    },
    {
      "name": "_PERSON",
      "type": "http://127.0.0.1/ontology/books.owl#Person",
      "desc": "Output of service BookRRPService"
    }
  ],
  "capability": "atomic",
  "file": "book_readerreviewperson_service.owls",
  "provider": {
    "type": "webservice"
  },
  "inputs": [
    {
      "name": "_BOOK",
      "type": "http://127.0.0.1/ontology/books.owl#Book",
      "desc": "Input of service BookRRPService"
    }
  ],
  "name": "BookRRPService",
  "description": "This service returns reader of the given book and his/her review also and the lastperson who already made his comments on that book.",
  "domains": [
    {
      "name": "Educational",
      "url": "http://www.surf.scss.tcd.ie/cityOntology/#Educational"
    },
    {
      "name": "Entertainment_Products",
      "url": "http://www.surf.scss.tcd.ie/cityOntology/#Entertainment_Products"
    }
  ],
  "id": "books/book_readerreviewperson_service",
  "state": true,
  "url": "http://surf.scss.tcd.ie/_provider_/books/book_readerreviewperson_service"
}