{
    "capability": "atomic",
    "description": "This service returns an home address of an educational-employee of a university.",
    "domains": [
        {
            "name": "Educational",
            "url": "http://www.surf.scss.tcd.ie/cityOntology/#Educational"
        }
    ],
    "file": "educational-employee_address_service.owls",
    "id": "education/educational-employee_address_service",
    "inputs": [
        {
            "desc": "Input of service Educational-Employee Address Service",
            "name": "_EDUCATIONAL-EMPLOYEE",
            "type": "http://127.0.0.1/ontology/portal.owl#Educational-Employee"
        }
    ],
    "name": "Educational-Employee Address Service",
    "outputs": [
        {
            "desc": "Output of service Educational-Employee Address Service",
            "name": "_ADDRESS",
            "type": "http://127.0.0.1/ontology/portal.owl#Address"
        }
    ],
    "provider": {
        "type": "webservice"
    },
    "state": true,
    "url": "http://surf.scss.tcd.ie/_provider_/education/educational-employee_address_service"
}