{
  "outputs": [
    {
      "name": "_BOOK",
      "type": "http://127.0.0.1/ontology/books.owl#Book",
      "desc": "Output of service BookSearch"
    }
  ],
  "capability": "atomic",
  "file": "BookSearchService.owls",
  "provider": {
    "type": "webservice"
  },
  "inputs": [
    {
      "name": "_TITLE",
      "type": "http://127.0.0.1/ontology/books.owl#Title",
      "desc": "Input of service BookSearch"
    }
  ],
  "name": "BookSearch",
  "description": "A book search engine service, which provides information of books whose title best matches the given string",
  
  "id": "education/title_book_service",
  "state": true,
  "url": "http://surf.scss.tcd.ie/_provider_/education/title_book_service"
}