{
  "outputs": [
    {
      "name": "_REPORT",
      "type": "http://127.0.0.1/ontology/Mid-level-ontology.owl#Report",
      "desc": "Output of service car report service"
    }
  ],
  "capability": "atomic",
  "file": "car_report_service.owls",
  "provider": {
    "type": "asp"
  },
  "inputs": [
    {
      "name": "_CAR",
      "type": "http://127.0.0.1/ontology/my_ontology.owl#Car",
      "desc": "Input of service car report service"
    }
  ],
  "name": "car report service",
  "description": "This service supply a critical report of analysis of a given car (new or used), including its price also.",
  "id": "economy/car_report_service",
  "state": true,
  "url": "http://surf.scss.tcd.ie/_provider_/economy/car_report_service"
}