{
  "outputs": [
    {
      "name": "_author",
      "type": "string",
      "desc": "Output of service BookAuthorPriceService"
    },
    {
      "name": "_price",
      "type": "string",
      "desc": "Output of service BookAuthorPriceService"
    }
  ],
  "provider": {
    "type": "asp"
  },
  "inputs": [
    {
      "name": "_book",
      "type": "string",
      "desc": "Input of service BookAuthorPriceService"
    }
  ],
  "name": "BookAuthorPriceService",
  "description": "This service returns author and price of a book, short-story or text book (but no novel).",
  "domains": [
    {
      "name": "Foundations_and_Charity",
      "url": "http://www.surf.scss.tcd.ie/cityOntology/#Foundations_and_Charity"
    }
  ],
  "id": "retail/book_authorprice_service",
  "state": true,
  "url": "http://surf.scss.tcd.ie/_provider_/retail/book_authorprice_service"
}