{
  "outputs": [
    {
      "name": "_AUTHOR1",
      "type": "http://127.0.0.1/ontology/books.owl#Author",
      "desc": "Output of service Science-Fiction-Novel Author Author"
    },
    {
      "name": "_AUTHOR2",
      "type": "http://127.0.0.1/ontology/books.owl#Author",
      "desc": "Output of service Science-Fiction-Novel Author Author"
    }
  ],
  "capability": "atomic",
  "file": "sfnovel_authorauthor_BookOntoservice.owls",
  "provider": {
    "type": "webservice"
  },
  "inputs": [
    {
      "name": "_SCIENCE-FICTION-NOVEL",
      "type": "http://127.0.0.1/ontology/books.owl#Science-Fiction-Novel",
      "desc": "Input of service Science-Fiction-Novel Author Author"
    }
  ],
  "name": "Science-Fiction-Novel Author Author",
  "description": "This service returns author or authors of a given science fiction novel.",
  "domains": [
    {
      "name": "Educational",
      "url": "http://www.surf.scss.tcd.ie/cityOntology/#Educational"
    }
  ],
  "id": "education/science-fiction-novel_authorauthor_service",
  "state": true,
  "url": "http://surf.scss.tcd.ie/_provider_/education/science-fiction-novel_authorauthor_service"
}