{
  "outputs": [
    {
      "name": "_FUNDING",
      "type": "http://127.0.0.1/ontology/SUMO.owl#Funding",
      "desc": "Output of service GovBllisticMissileFundingService"
    },
    {
      "name": "_RANGE",
      "type": "http://127.0.0.1/ontology/extendedCamera.owl#Range",
      "desc": "Output of service GovBllisticMissileFundingService"
    }
  ],
  "capability": "atomic",
  "file": "ballisticmissilegovernment_fundingrange_service.owls",
  "provider": {
    "type": "webservice"
  },
  "inputs": [
    {
      "name": "_GOVERNMENT",
      "type": "http://127.0.0.1/ontology/SUMO.owl#Government",
      "desc": "Input of service GovBllisticMissileFundingService"
    },
    {
      "name": "_BALLISTICMISSILE",
      "type": "http://127.0.0.1/ontology/Mid-level-ontology.owl#BallisticMissile",
      "desc": "Input of service GovBllisticMissileFundingService"
    }
  ],
  "name": "GovBllisticMissileFundingService",
  "description": "This service informs users about funding for the ballistic Missile type provided by the government, and target range of the missile.",
  "domains": [
    {
      "name": "Defense",
      "url": "http://www.surf.scss.tcd.ie/cityOntology/#Defense"
    }
  ],
  "id": "defense/ballisticmissilegovernment_fundingrange_service",
  "state": true,
  "url": "http://surf.scss.tcd.ie/_provider_/defense/ballisticmissilegovernment_fundingrange_service"
}