{
  "outputs": [
    {
      "name": "_PUBLICATION-REFERENCE",
      "type": "http://127.0.0.1/ontology/portal.owl#Publication-Reference",
      "desc": "Output of service Researcher postal address and publication references service"
    },
    {
      "name": "_POSTAL-ADDRESS",
      "type": "http://127.0.0.1/ontology/portal.owl#Postal-Address",
      "desc": "Output of service Researcher postal address and publication references service"
    }
  ],
  "capability": "atomic",
  "file": "researcher-in-academia_publication-referencepostal-address_.owls",
  "provider": {
    "type": "asp"
  },
  "inputs": [
    {
      "name": "_RESEARCHER-IN-ACADEMIA",
      "type": "http://127.0.0.1/ontology/portal.owl#Researcher-In-Academia",
      "desc": "Input of service Researcher postal address and publication references service"
    }
  ],
  "name": "Researcher postal address and publication references service",
  "description": "This service returns not only publication references of a researcher, but also its  postal address.",
  "domains": [
    {
      "name": "Educational",
      "url": "http://www.surf.scss.tcd.ie/cityOntology/#Educational"
    }
  ],
  "id": "education/researcher-in-academia_publication-referencepostal-address_service",
  "state": true,
  "url": "http://surf.scss.tcd.ie/_provider_/education/researcher-in-academia_publication-referencepostal-address_service"
}