{
  "outputs": [
    {
      "name": "callTaxi",
      "type": "call"
    }
  ],
  "provider": {
    "type": "asp"
  },
  "inputs": [
    {
      "name": "taxiLocation",
      "type": "json"
    },
    {
      "name": "taxiAvailability",
      "type": "json"
    }
  ],
  "name": "call_taxi",
  "description": "This is the service call_taxi",
  "domains": [
    {
      "name": "Transport_and_Mobility",
      "url": "http://www.surf.scss.tcd.ie/cityOntology/#Transport_and_Mobility"
    }
  ],
  "id": "12/call_taxi",
  "state": true,
  "url": "http://surf.scss.tcd.ie/_provider_/call_taxi"
}