{
  "outputs": [
    {
      "name": "_ATMID",
      "type": "http://www.surf.scss.tcd.ie/IoTservices.owl#atmId",
      "desc": "Output of service atm_detect_intruder"
    }
  ],
  "provider": {
    "type": "ws"
  },
  "inputs": [
    {
      "name": "_ATMCONFIG",
      "type": "http://www.surf.scss.tcd.ie/IoTservices.owl#atmConfig",
      "desc": "Input of service atm_detect_intruder"
    }
  ],
  "name": "atm_detect_intruder",
  "description": "This is the service atm_detect_intruder",
  "domains": [
    {
      "name": "Safety_and_Emergencies",
      "url": "http://www.surf.scss.tcd.ie/cityOntology/#Safety_and_Emergencies"
    },
    {
      "name": "Finance",
      "url": "http://www.surf.scss.tcd.ie/cityOntology/#Finance"
    }
  ],
  "id": "finance/114_atm_detect_intruder",
  "state": true,
  "url": "http://surf.scss.tcd.ie/_provider_/finance/114_atm_detect_intruder"
}