{
  "outputs": [
    {
      "name": "_PRICE",
      "type": "http://127.0.0.1/ontology/concept.owl#Price",
      "desc": "Output of service NovelPrice Service"
    }
  ],
  "capability": "atomic",
  "file": "novelperson_price_service.owls",
  "provider": {
    "type": "asp"
  },
  "inputs": [
    {
      "name": "_PERSON",
      "type": "http://127.0.0.1/ontology/books.owl#Person",
      "desc": "Input of service NovelPrice Service"
    },
    {
      "name": "_NOVEL",
      "type": "http://127.0.0.1/ontology/books.owl#Novel",
      "desc": "Input of service NovelPrice Service"
    }
  ],
  "name": "NovelPrice Service",
  "description": "This service returns purchase price of a novel for a certain person. The price is different for each person.",
  "domains": [
    {
      "name": "Entertainment_Products",
      "url": "http://www.surf.scss.tcd.ie/cityOntology/#Entertainment_Products"
    }
  ],
  "id": "books/novelperson_price_service",
  "state": true,
  "url": "http://surf.scss.tcd.ie/_provider_/books/novelperson_price_service"
}