{
  "outputs": [
    {
      "name": "_SCHOLARSHIP",
      "type": "http://127.0.0.1/ontology/Mid-level-ontology.owl#Scholarship",
      "desc": "Output of service GermanGovernmentAwardScholarshipService"
    },
    {
      "name": "_DURATION",
      "type": "http://127.0.0.1/ontology/support.owl#Duration",
      "desc": "Output of service GermanGovernmentAwardScholarshipService"
    }
  ],
  "capability": "atomic",
  "file": "award_scholarshipduration_SwissGovservice.owls",
  "provider": {
    "type": "webservice"
  },
  "inputs": [
    {
      "name": "_AWARD",
      "type": "http://127.0.0.1/ontology/portal.owl#Award",
      "desc": "Input of service GermanGovernmentAwardScholarshipService"
    }
  ],
  "name": "GermanGovernmentAwardScholarshipService",
  "description": "It is an attractive service to know about the scholarship offered for the award by the Swiss government.",
  "domains": [
    {
      "name": "Educational",
      "url": "http://www.surf.scss.tcd.ie/cityOntology/#Educational"
    }
  ],
  "id": "education/award_scholarshipduration_service",
  "state": true,
  "url": "http://surf.scss.tcd.ie/_provider_/education/award_scholarshipduration_service"
}