{
  "outputs": [
    {
      "name": "_ICON",
      "type": "http://127.0.0.1/ontology/SUMO.owl#Icon",
      "desc": "Output of service LocationTravelInfo Service"
    }
  ],
  "capability": "atomic",
  "file": "location_icon_service.owls",
  "provider": {
    "type": "asp"
  },
  "inputs": [
    {
      "name": "_LOCATION",
      "type": "http://127.0.0.1/ontology/portal.owl#Location",
      "desc": "Input of service LocationTravelInfo Service"
    }
  ],
  "name": "LocationTravelInfo Service",
  "description": "This service returns a set of icons reprsent roadway signs in the given location, andalso photographs of the location.",
  "domains": [
    {
      "name": "Travel",
      "url": "http://www.surf.scss.tcd.ie/cityOntology/#Travel"
    }
  ],
  "id": "travel/location_icon_service",
  "state": true,
  "url": "http://surf.scss.tcd.ie/_provider_/travel/location_icon_service"
}