{
  "outputs": [
    {
      "name": "_SKILLEDOCCUPATION",
      "type": "http://127.0.0.1/ontology/Mid-level-ontology.owl#SkilledOccupation",
      "desc": "Output of service CC service"
    }
  ],
  "capability": "atomic",
  "file": "companycountry_skilledoccupation_service.owls",
  "provider": {
    "type": "webservice"
  },
  "inputs": [
    {
      "name": "_COUNTRY",
      "type": "http://127.0.0.1/ontology/portal.owl#Country",
      "desc": "Input of service CC service"
    },
    {
      "name": "_COMPANY",
      "type": "http://127.0.0.1/ontology/portal.owl#Company",
      "desc": "Input of service CC service"
    }
  ],
  "name": "CC service",
  "description": "This service returns skilled occupation position in a certain company located in a certain country.If the company input is not given then the output is for all positions in the whole country.",
  "domains": [
    {
      "name": "Industry",
      "url": "http://www.surf.scss.tcd.ie/cityOntology/#Industry"
    }
  ],
  "id": "industry/companycountry_skilledoccupation_service",
  "state": true,
  "url": "http://surf.scss.tcd.ie/_provider_/industry/companycountry_skilledoccupation_service"
}