{
  "outputs": [
    {
      "name": "_EXPERIMENTING",
      "type": "http://127.0.0.1/ontology/SUMO.owl#Experimenting",
      "desc": "Output of service Hospital Experiment service"
    }
  ],
  "capability": "atomic",
  "file": "hospital_experimenting_service.owls",
  "provider": {
    "type": "wsdn"
  },
  "inputs": [
    {
      "name": "_HOSPITAL",
      "type": "http://127.0.0.1/ontology/Mid-level-ontology.owl#Hospital",
      "desc": "Input of service Hospital Experiment service"
    }
  ],
  "name": "Hospital Experiment service",
  "description": "This service returns the types of experiments which are organized by a certain given hospital.",
  "domains": [
    {
      "name": "Health",
      "url": "http://www.surf.scss.tcd.ie/cityOntology/#Health"
    }
  ],
  "id": "medical/hospital_experimenting_service",
  "state": true,
  "url": "http://surf.scss.tcd.ie/_provider_/medical/hospital_experimenting_service"
}