{
  "outputs": [
    {
      "name": "_BOOKEDROOM",
      "type": "http://www.surf.scss.tcd.ie/IoTservices.owl#bookedRoom",
      "desc": "Output of service book_room_campus"
    }
  ],
  "provider": {
    "type": "asp"
  },
  "inputs": [
    {
      "name": "_DISPLAYROOMINFO",
      "type": "http://www.surf.scss.tcd.ie/IoTservices.owl#displayRoomInfo",
      "desc": "Input of service book_room_campus"
    },
    {
      "name": "_DISPLAYVIDEO",
      "type": "http://www.surf.scss.tcd.ie/IoTservices.owl#displayVideo",
      "desc": "Input of service book_room_campus"
    }
  ],
  "name": "book_room_campus",
  "description": "This is the service book_room_campus",
  "domains": [
    {
      "name": "Educational",
      "url": "http://www.surf.scss.tcd.ie/cityOntology/#Educational"
    }
  ],
  "id": "education/66_book_room_campus",
  "state": true,
  "url": "http://surf.scss.tcd.ie/_provider_/education/66_book_room_campus"
}