{
  "outputs": [
    {
      "name": "_SKILLEDOCCUPATION",
      "type": "http://127.0.0.1/ontology/Mid-level-ontology.owl#SkilledOccupation",
      "desc": "Output of service CountrySkilledPositionsService"
    }
  ],
  "capability": "atomic",
  "file": "country_skilledoccupation_jobsservice.owls",
  "provider": {
    "type": "asp"
  },
  "inputs": [
    {
      "name": "_COUNTRY",
      "type": "http://127.0.0.1/ontology/portal.owl#Country",
      "desc": "Input of service CountrySkilledPositionsService"
    }
  ],
  "name": "CountrySkilledPositionsService",
  "description": "This service returns Skilled positions available in the certain country.",
  "domains": [
    {
      "name": "Industry",
      "url": "http://www.surf.scss.tcd.ie/cityOntology/#Industry"
    }
  ],
  "id": "industry/country_skilledoccupation_jobsservice",
  "state": true,
  "url": "http://surf.scss.tcd.ie/_provider_/industry/country_skilledoccupation_jobsservice"
}