{
  "outputs": [
    {
      "name": "_DROUGHT",
      "type": "http://127.0.0.1/ontology/Mid-level-ontology.owl#Drought",
      "desc": "Output of service Municipal-Unity Drought Service"
    }
  ],
  "capability": "atomic",
  "file": "municipal-unit_drought_service.owls",
  "provider": {
    "type": "asp"
  },
  "inputs": [
    {
      "name": "_MUNICIPAL-UNIT",
      "type": "http://127.0.0.1/ontology/portal.owl#Municipal-Unit",
      "desc": "Input of service Municipal-Unity Drought Service"
    }
  ],
  "name": "Municipal-Unity Drought Service",
  "description": "This service informs about drought in a given municipal-unit.",
  "domains": [
    {
      "name": "Travel",
      "url": "http://www.surf.scss.tcd.ie/cityOntology/#Travel"
    }
  ],
  "id": "travel/municipal-unit_drought_service",
  "state": true,
  "url": "http://surf.scss.tcd.ie/_provider_/travel/municipal-unit_drought_service"
}