{
  "outputs": [
    {
      "name": "_TAXILOCATION",
      "type": "http://www.surf.scss.tcd.ie/IoTservices.owl#taxiLocation",
      "desc": "Output of service taxi_location"
    }
  ],
  "provider": {
    "type": "wsdn"
  },
  "inputs": [
    {
      "name": "_ROUTEPARAMETERS",
      "type": "http://www.surf.scss.tcd.ie/IoTservices.owl#routeParameters",
      "desc": "Input of service taxi_location"
    }
  ],
  "name": "taxi_location",
  "description": "This is the service taxi_location",
  "domains": [
    {
      "name": "Transport_and_Mobility",
      "url": "http://www.surf.scss.tcd.ie/cityOntology/#Transport_and_Mobility"
    }
  ],
  "id": "transportandmobility/10_taxi_location",
  "state": true,
  "url": "http://surf.scss.tcd.ie/_provider_/transportandmobility/10_taxi_location"
}