{
  "outputs": [
    {
      "name": "_FUNDING",
      "type": "http://127.0.0.1/ontology/SUMO.owl#Funding",
      "desc": "Output of service GovernmentFundingService"
    }
  ],
  "capability": "atomic",
  "file": "government_funding_ABombservice.owls",
  "provider": {
    "type": "asp"
  },
  "inputs": [
    {
      "name": "_GOVERNMENT",
      "type": "http://127.0.0.1/ontology/SUMO.owl#Government",
      "desc": "Input of service GovernmentFundingService"
    }
  ],
  "name": "GovernmentFundingService",
  "description": "This service returns the funding, specially for the atomic bomb, provided by the given government,",
  "domains": [
    {
      "name": "Government_and_Planning",
      "url": "http://www.surf.scss.tcd.ie/cityOntology/#Government_and_Planning"
    }
  ],
  "id": "weapon/government_funding_service",
  "state": true,
  "url": "http://surf.scss.tcd.ie/_provider_/weapon/government_funding_service"
}