{
    "capability": "atomic",
    "description": "This service informs you about diagnostic process and its time duration for a given medical clinic.",
    "domains": [
        {
            "name": "Health",
            "url": "http://www.surf.scss.tcd.ie/cityOntology/#Health"
        }
    ],
    "file": "medicalclinic_diagnosticprocesstimemeasure_service.owls",
    "id": "medical/medicalclinic_diagnosticprocesstimemeasure_service",
    "inputs": [
        {
            "desc": "Input of service MedicalClinic DiagnosticProcess TimeMeasure service",
            "name": "_MEDICALCLINIC",
            "type": "http://127.0.0.1/ontology/Mid-level-ontology.owl#MedicalClinic"
        }
    ],
    "name": "MedicalClinic DiagnosticProcess TimeMeasure service",
    "outputs": [
        {
            "desc": "Output of service MedicalClinic DiagnosticProcess TimeMeasure service",
            "name": "_DIAGNOSTICPROCESS",
            "type": "http://127.0.0.1/ontology/SUMO.owl#DiagnosticProcess"
        },
        {
            "desc": "Output of service MedicalClinic DiagnosticProcess TimeMeasure service",
            "name": "_TIMEMEASURE",
            "type": "http://127.0.0.1/ontology/SUMO.owl#TimeMeasure"
        }
    ],
    "provider": {
        "type": "webservice"
    },
    "state": true,
    "url": "http://surf.scss.tcd.ie/_provider_/medical/medicalclinic_diagnosticprocesstimemeasure_service"
}