{
  "outputs": [
    {
      "name": "_RECOMMENDEDPRICEINDOLLAR",
      "type": "http://127.0.0.1/ontology/concept.owl#RecommendedPriceInDollar",
      "desc": "Output of service ZAD service"
    }
  ],
  "capability": "atomic",
  "file": "ZAD_service.owls",
  "provider": {
    "type": "wsdn"
  },
  "inputs": [
    {
      "name": "_PREPAREDFOOD",
      "type": "http://127.0.0.1/ontology/Mid-level-ontology.owl#PreparedFood",
      "desc": "Input of service ZAD service"
    }
  ],
  "name": "ZAD service",
  "description": "ZAD is mostly used service that returns recommended market purchase price in dollars of a given prepared food item.",
  "domains": [
    {
      "name": "Payment_and_Delivery",
      "url": "http://www.surf.scss.tcd.ie/cityOntology/#Payment_and_Delivery"
    }
  ],
  "id": "payment/ZAD_service",
  "state": true,
  "url": "http://surf.scss.tcd.ie/_provider_/payment/ZAD_service"
}