{
  "outputs": [
    {
      "name": "_GIVING",
      "type": "http://127.0.0.1/ontology/SUMO.owl#Giving",
      "desc": "Output of service Government BallisticMissile Giving Service"
    },
    {
      "name": "_RANGE",
      "type": "http://127.0.0.1/ontology/extendedCamera.owl#Range",
      "desc": "Output of service Government BallisticMissile Giving Service"
    }
  ],
  "capability": "atomic",
  "file": "ballisticmissilegovernment_givingrange_service.owls",
  "provider": {
    "type": "webservice"
  },
  "inputs": [
    {
      "name": "_GOVERNMENT",
      "type": "http://127.0.0.1/ontology/SUMO.owl#Government",
      "desc": "Input of service Government BallisticMissile Giving Service"
    },
    {
      "name": "_BALLISTICMISSILE",
      "type": "http://127.0.0.1/ontology/Mid-level-ontology.owl#BallisticMissile",
      "desc": "Input of service Government BallisticMissile Giving Service"
    }
  ],
  "name": "Government BallisticMissile Giving Service",
  "description": "This service informs users about giving for the given ballistic Missile type provided by the government, and target range of the missile.",
  "domains": [
    {
      "name": "Government_and_Planning",
      "url": "http://www.surf.scss.tcd.ie/cityOntology/#Government_and_Planning"
    }
  ],
  "id": "weapon/ballisticmissilegovernment_givingrange_service",
  "state": true,
  "url": "http://surf.scss.tcd.ie/_provider_/weapon/ballisticmissilegovernment_givingrange_service"
}