{
  "outputs": [
    {
      "name": "_DIAGNOSTICPROCESS",
      "type": "http://127.0.0.1/ontology/SUMO.owl#DiagnosticProcess",
      "desc": "Output of service Hospital DiagnosticProcess TimeInterval service"
    },
    {
      "name": "_TIMEINTERVAL",
      "type": "http://127.0.0.1/ontology/SUMO.owl#TimeInterval",
      "desc": "Output of service Hospital DiagnosticProcess TimeInterval service"
    }
  ],
  "capability": "atomic",
  "file": "hospital_diagnosticprocesstimeinterval_service.owls",
  "provider": {
    "type": "webservice"
  },
  "inputs": [
    {
      "name": "_HOSPITAL",
      "type": "http://127.0.0.1/ontology/Mid-level-ontology.owl#Hospital",
      "desc": "Input of service Hospital DiagnosticProcess TimeInterval service"
    }
  ],
  "name": "Hospital DiagnosticProcess TimeInterval service",
  "description": "This service informs you about diagnostic process and its time duration for a given hospital.",
  "domains": [
    {
      "name": "Health",
      "url": "http://www.surf.scss.tcd.ie/cityOntology/#Health"
    }
  ],
  "id": "medical/hospital_diagnosticprocesstimeinterval_service",
  "state": true,
  "url": "http://surf.scss.tcd.ie/_provider_/medical/hospital_diagnosticprocesstimeinterval_service"
}