{
  "outputs": [
    {
      "name": "_PROFESSION",
      "type": "http://127.0.0.1/ontology/Mid-level-ontology.owl#Profession",
      "desc": "Output of service Geopolitical-Entity Profession TimeMeasure service"
    },
    {
      "name": "_TIMEMEASURE",
      "type": "http://127.0.0.1/ontology/SUMO.owl#TimeMeasure",
      "desc": "Output of service Geopolitical-Entity Profession TimeMeasure service"
    }
  ],
  "capability": "atomic",
  "file": "geopolitical-entity_professiontimemeasure_service.owls",
  "provider": {
    "type": "asp"
  },
  "inputs": [
    {
      "name": "_GEOPOLITICAL-ENTITY",
      "type": "http://127.0.0.1/ontology/portal.owl#Geopolitical-Entity",
      "desc": "Input of service Geopolitical-Entity Profession TimeMeasure service"
    }
  ],
  "name": "Geopolitical-Entity Profession TimeMeasure service",
  "description": "This service returns profession job in a given geopolitical-entity and its timemeasure (duration).",
  "domains": [
    {
      "name": "Educational",
      "url": "http://www.surf.scss.tcd.ie/cityOntology/#Educational"
    }
  ],
  "id": "education/geopolitical-entity_professiontimemeasure_service",
  "state": true,
  "url": "http://surf.scss.tcd.ie/_provider_/education/geopolitical-entity_professiontimemeasure_service"
}