{
  "outputs": [
    {
      "name": "_NOVEL",
      "type": "http://127.0.0.1/ontology/books.owl#Novel",
      "desc": "Output of service Author Novel Price Service"
    },
    {
      "name": "_PRICE",
      "type": "http://127.0.0.1/ontology/concept.owl#Price",
      "desc": "Output of service Author Novel Price Service"
    }
  ],
  "capability": "atomic",
  "file": "author_novelprice_service.owls",
  "provider": {
    "type": "webservice"
  },
  "inputs": [
    {
      "name": "_AUTHOR",
      "type": "http://127.0.0.1/ontology/books.owl#Author",
      "desc": "Input of service Author Novel Price Service"
    }
  ],
  "name": "Author Novel Price Service",
  "description": "This service returns novels written by the given authorand their price as well.",
  "domains": [
    {
      "name": "Entertainment_Products",
      "url": "http://www.surf.scss.tcd.ie/cityOntology/#Entertainment_Products"
    }
  ],
  "id": "books/author_novelprice_service",
  "state": true,
  "url": "http://surf.scss.tcd.ie/_provider_/books/author_novelprice_service"
}