{
  "outputs": [
    {
      "name": "_RECOMMENDEDPRICEINEURO",
      "type": "http://127.0.0.1/ontology/concept.owl#RecommendedPriceInEuro",
      "desc": "Output of service CarCycle Recommended Price service"
    }
  ],
  "capability": "atomic",
  "file": "cyclecar_recommendedpriceineuro_service.owls",
  "provider": {
    "type": "webservice"
  },
  "inputs": [
    {
      "name": "_CAR",
      "type": "http://127.0.0.1/ontology/my_ontology.owl#Car",
      "desc": "Input of service CarCycle Recommended Price service"
    },
    {
      "name": "_CYCLE",
      "type": "http://127.0.0.1/ontology/my_ontology.owl#Cycle",
      "desc": "Input of service CarCycle Recommended Price service"
    }
  ],
  "name": "CarCycle Recommended Price service",
  "description": "This service returns recommended weekly renting price in Euroof the given pair of a car model and a cycle model.",
  "id": "economy/cyclecar_recommendedpriceineuro_service",
  "state": true,
  "url": "http://surf.scss.tcd.ie/_provider_/economy/cyclecar_recommendedpriceineuro_service"
}