{
  "outputs": [
    {
      "name": "_MAP",
      "type": "http://127.0.0.1/ontology/Mid-level-ontology.owl#Map",
      "desc": "Output of service City2CityRouteFinderService"
    }
  ],
  "capability": "atomic",
  "file": "citycity_map_service.owls",
  "provider": {
    "type": "webservice"
  },
  "inputs": [
    {
      "name": "_CITY1",
      "type": "http://127.0.0.1/ontology/portal.owl#City",
      "desc": "Input of service City2CityRouteFinderService"
    },
    {
      "name": "_CITY2",
      "type": "http://127.0.0.1/ontology/portal.owl#City",
      "desc": "Input of service City2CityRouteFinderService"
    }
  ],
  "name": "City2CityRouteFinderService",
  "description": "This service has an artificial intelligence power and able to returnan optimal path between two cities.",
  "domains": [
    {
      "name": "Travel",
      "url": "http://www.surf.scss.tcd.ie/cityOntology/#Travel"
    },
    {
      "name": "Geography",
      "url": "http://www.surf.scss.tcd.ie/cityOntology/#Geography"
    }
  ],
  "id": "travel/citycity_map_service",
  "state": true,
  "url": "http://surf.scss.tcd.ie/_provider_/travel/citycity_map_service"
}