{
  "outputs": [
    {
      "name": "_LENDING",
      "type": "http://127.0.0.1/ontology/SUMO.owl#Lending",
      "desc": "Output of service GermanGovernment Academic-Degree Lending Duration Service"
    },
    {
      "name": "_DURATION",
      "type": "http://127.0.0.1/ontology/support.owl#Duration",
      "desc": "Output of service GermanGovernment Academic-Degree Lending Duration Service"
    }
  ],
  "capability": "atomic",
  "file": "academic-degree_lendingduration_GermanGovservice.owls",
  "provider": {
    "type": "asp"
  },
  "inputs": [
    {
      "name": "_ACADEMIC-DEGREE",
      "type": "http://127.0.0.1/ontology/portal.owl#Academic-Degree",
      "desc": "Input of service GermanGovernment Academic-Degree Lending Duration Service"
    }
  ],
  "name": "GermanGovernment Academic-Degree Lending Duration Service",
  "description": "This service informs about lending offered for the academic-degree by the german government. The lending\u0027s duration is informed as well.",
  "domains": [
    {
      "name": "Educational",
      "url": "http://www.surf.scss.tcd.ie/cityOntology/#Educational"
    }
  ],
  "id": "education/academic-degree_lendingduration_service",
  "state": true,
  "url": "http://surf.scss.tcd.ie/_provider_/education/academic-degree_lendingduration_service"
}