{
  "outputs": [
    {
      "name": "_LATITUDE",
      "type": "http://127.0.0.1/ontology/protont.owl#latitude",
      "desc": "Output of service Address coordinates finder service."
    },
    {
      "name": "_LONGITUDE",
      "type": "http://127.0.0.1/ontology/protont.owl#longitude",
      "desc": "Output of service Address coordinates finder service."
    },
    {
      "name": "_ADDRESS",
      "type": "http://127.0.0.1/ontology/protonu.owl#Address",
      "desc": "Output of service Address coordinates finder service."
    }
  ],
  "capability": "atomic",
  "file": "getCoordinatesOfAddress.owls",
  "provider": {
    "type": "wsdn"
  },
  "inputs": [
    {
      "name": "_STREET",
      "type": "http://127.0.0.1/ontology/protonu.owl#Street",
      "desc": "Input of service Address coordinates finder service."
    },
    {
      "name": "_CITY",
      "type": "http://127.0.0.1/ontology/protonu.owl#City",
      "desc": "Input of service Address coordinates finder service."
    },
    {
      "name": "_STATE",
      "type": "http://127.0.0.1/ontology/protonu.owl#State",
      "desc": "Input of service Address coordinates finder service."
    },
    {
      "name": "_COUNTRY",
      "type": "http://127.0.0.1/ontology/protonu.owl#Country",
      "desc": "Input of service Address coordinates finder service."
    },
    {
      "name": "_POSTALCODE",
      "type": "http://127.0.0.1/ontology/geographydataset.owl#PostalCode",
      "desc": "Input of service Address coordinates finder service."
    }
  ],
  "name": "Address coordinates finder service.",
  "description": "This service module allows you to find the specific latitude and longitude for an address world wide. The address can be provided as either a single string or a structured set of parameters.The user gives street, city, state, country and postal code as input parameters, and the service returns list of matching addresses and their coordinates.",
  "domains": [
    {
      "name": "Geography",
      "url": "http://www.surf.scss.tcd.ie/cityOntology/#Geography"
    },
    {
      "name": "Travel",
      "url": "http://www.surf.scss.tcd.ie/cityOntology/#Travel"
    }
  ],
  "id": "travel/getCoordinatesOfAddress",
  "state": true,
  "url": "http://surf.scss.tcd.ie/_provider_/travel/getCoordinatesOfAddress"
}