{
  "outputs": [
    {
      "name": "_HOMEINTRUSIONALERT",
      "type": "http://www.surf.scss.tcd.ie/IoTservices.owl#homeIntrusionAlert",
      "desc": "Output of service home_intruder_detection"
    }
  ],
  "provider": {
    "type": "wsdn"
  },
  "inputs": [
    {
      "name": "_HOMEINFORMATION",
      "type": "http://www.surf.scss.tcd.ie/IoTservices.owl#homeInformation",
      "desc": "Input of service home_intruder_detection"
    }
  ],
  "name": "home_intruder_detection",
  "description": "This is the service home_intruder_detection",
  "domains": [
    {
      "name": "Safety_and_Emergencies",
      "url": "http://www.surf.scss.tcd.ie/cityOntology/#Safety_and_Emergencies"
    }
  ],
  "id": "safetyandemergencies/30_home_intruder_detection",
  "state": true,
  "url": "http://surf.scss.tcd.ie/_provider_/safetyandemergencies/30_home_intruder_detection"
}