{
  "outputs": [
    {
      "name": "_PRICE",
      "type": "http://127.0.0.1/ontology/concept.owl#Price",
      "desc": "Output of service 2 for 1 Price service"
    }
  ],
  "capability": "atomic",
  "file": "wirelessplayerwmaplayer_price_service.owls",
  "provider": {
    "type": "asp"
  },
  "inputs": [
    {
      "name": "_WMAPLAYER",
      "type": "http://127.0.0.1/ontology/my_ontology.owl#WMAPlayer",
      "desc": "Input of service 2 for 1 Price service"
    },
    {
      "name": "_WIRELESSPLAYER",
      "type": "http://127.0.0.1/ontology/my_ontology.owl#WirelessPlayer",
      "desc": "Input of service 2 for 1 Price service"
    }
  ],
  "name": "2 for 1 Price service",
  "description": "This service returns a current pruchase price of a set of a WMA Player brand and Wireless player brand.",
  "domains": [
    {
      "name": "Technology",
      "url": "http://www.surf.scss.tcd.ie/cityOntology/#Technology"
    }
  ],
  "id": "technology/wirelessplayerwmaplayer_price_service",
  "state": true,
  "url": "http://surf.scss.tcd.ie/_provider_/technology/wirelessplayerwmaplayer_price_service"
}