{
  "outputs": [
    {
      "name": "_professor-in-academia",
      "type": "string",
      "desc": "Output of service Pioneer HigherEducationalOrganizationProfessors"
    }
  ],
  "provider": {
    "type": "webservice"
  },
  "inputs": [
    {
      "name": "_higher-educational-organization",
      "type": "string",
      "desc": "Input of service Pioneer HigherEducationalOrganizationProfessors"
    }
  ],
  "name": "Pioneer HigherEducationalOrganizationProfessors",
  "description": "It is a pioneer service that returns professors of the given higher educational organization.",
  "domains": [
    {
      "name": "Logistic",
      "url": "http://www.surf.scss.tcd.ie/cityOntology/#Logistic"
    }
  ],
  "id": "educational/higher-educational-organization_professor-in-academia_service",
  "state": true,
  "url": "http://surf.scss.tcd.ie/_provider_/educational/higher-educational-organization_professor-in-academia_service"
}