{
  "outputs": [
    {
      "name": "_AUTHOR",
      "type": "http://127.0.0.1/ontology/books.owl#Author",
      "desc": "Output of service Science-Fiction-Novel Author Price Service"
    },
    {
      "name": "_PRICE",
      "type": "http://127.0.0.1/ontology/concept.owl#Price",
      "desc": "Output of service Science-Fiction-Novel Author Price Service"
    }
  ],
  "capability": "atomic",
  "file": "science-fiction-novel_authorprice_service.owls",
  "provider": {
    "type": "wsdn"
  },
  "inputs": [
    {
      "name": "_SCIENCE-FICTION-NOVEL",
      "type": "http://127.0.0.1/ontology/books.owl#Science-Fiction-Novel",
      "desc": "Input of service Science-Fiction-Novel Author Price Service"
    }
  ],
  "name": "Science-Fiction-Novel Author Price Service",
  "description": "This service returns author and price of a given science-fiction-novel title.",
  "domains": [
    {
      "name": "Entertainment_Products",
      "url": "http://www.surf.scss.tcd.ie/cityOntology/#Entertainment_Products"
    },
    {
      "name": "Educational",
      "url": "http://www.surf.scss.tcd.ie/cityOntology/#Educational"
    }
  ],
  "id": "books/science-fiction-novel_authorprice_service",
  "state": true,
  "url": "http://surf.scss.tcd.ie/_provider_/books/science-fiction-novel_authorprice_service"
}