{
  "outputs": [
    {
      "name": "_PRICE",
      "type": "http://127.0.0.1/ontology/concept.owl#Price",
      "desc": "Output of service Car2PersonBicyclePrice service"
    }
  ],
  "capability": "atomic",
  "file": "car2personbicycle_price_service.owls",
  "provider": {
    "type": "wsdn"
  },
  "inputs": [
    {
      "name": "_2PERSONBICYCLE",
      "type": "http://127.0.0.1/ontology/my_ontology.owl#TwoPersonBicycle",
      "desc": "Input of service Car2PersonBicyclePrice service"
    },
    {
      "name": "_CAR",
      "type": "http://127.0.0.1/ontology/my_ontology.owl#Car",
      "desc": "Input of service Car2PersonBicyclePrice service"
    }
  ],
  "name": "Car2PersonBicyclePrice service",
  "description": "This service returns purchase price of the pair of a car modeland 2(two) person bicycle model.",
  "domains": [
    {
      "name": "Vehicle_Sale_and_Rent",
      "url": "http://www.surf.scss.tcd.ie/cityOntology/#Vehicle_Sale_and_Rent"
    }
  ],
  "id": "vehicle/car2personbicycle_price_service",
  "state": true,
  "url": "http://surf.scss.tcd.ie/_provider_/vehicle/car2personbicycle_price_service"
}