{
  "outputs": [
    {
      "name": "_recommendedprice",
      "type": "string",
      "desc": "Output of service Coffee RecommendedPrice Service"
    }
  ],
  "provider": {
    "type": "wsdn"
  },
  "inputs": [
    {
      "name": "_coffee",
      "type": "string",
      "desc": "Input of service Coffee RecommendedPrice Service"
    }
  ],
  "name": "Coffee RecommendedPrice Service",
  "description": "This service returns recommended price of coffee.",
  "domains": [
    {
      "name": "Construction",
      "url": "http://www.surf.scss.tcd.ie/cityOntology/#Construction"
    }
  ],
  "id": "retail/coffee_recommendedprice_service",
  "state": true,
  "url": "http://surf.scss.tcd.ie/_provider_/retail/coffee_recommendedprice_service"
}