{
    "capability": "atomic",
    "description": "This service informs you whether butter is available in a given retail store and its quantity.",
    "domains": [
        {
            "name": "Food_and_Drinks",
            "url": "http://www.surf.scss.tcd.ie/cityOntology/#Food_and_Drinks"
        }
    ],
    "file": "retailstore_butterquantity_service.owls",
    "id": "food/retailstore_butterquantity_service",
    "inputs": [
        {
            "desc": "Input of service RetailStore Butter Quantity Service",
            "name": "_RETAILSTORE",
            "type": "http://127.0.0.1/ontology/Mid-level-ontology.owl#RetailStore"
        }
    ],
    "name": "RetailStore Butter Quantity Service",
    "outputs": [
        {
            "desc": "Output of service RetailStore Butter Quantity Service",
            "name": "_BUTTER",
            "type": "http://127.0.0.1/ontology/Mid-level-ontology.owl#Butter"
        },
        {
            "desc": "Output of service RetailStore Butter Quantity Service",
            "name": "_QUANTITY",
            "type": "http://127.0.0.1/ontology/support.owl#Quantity"
        }
    ],
    "provider": {
        "type": "asp"
    },
    "state": true,
    "url": "http://surf.scss.tcd.ie/_provider_/food/retailstore_butterquantity_service"
}