{
  "outputs": [
    {
      "name": "_PRICE",
      "type": "http://127.0.0.1/ontology/concept.owl#Price",
      "desc": "Output of service FastCar Price Report service"
    },
    {
      "name": "_REPORT",
      "type": "http://127.0.0.1/ontology/Mid-level-ontology.owl#Report",
      "desc": "Output of service FastCar Price Report service"
    }
  ],
  "capability": "atomic",
  "file": "fastcar_pricereport_service.owls",
  "provider": {
    "type": "asp"
  },
  "inputs": [
    {
      "name": "_FASTCAR",
      "type": "http://127.0.0.1/ontology/my_ontology.owl#FastCar",
      "desc": "Input of service FastCar Price Report service"
    }
  ],
  "name": "FastCar Price Report service",
  "description": "This service returns not only price of a gieven fast car model, but also a short report about its specifications.",
  "domains": [
    {
      "name": "Vehicle_Sale_and_Rent",
      "url": "http://www.surf.scss.tcd.ie/cityOntology/#Vehicle_Sale_and_Rent"
    }
  ],
  "id": "vehicle/fastcar_pricereport_service",
  "state": true,
  "url": "http://surf.scss.tcd.ie/_provider_/vehicle/fastcar_pricereport_service"
}