{
  "outputs": [
    {
      "name": "_RECOMMENDEDPRICE",
      "type": "http://127.0.0.1/ontology/concept.owl#RecommendedPrice",
      "desc": "Output of service CD Player recommended Price service"
    }
  ],
  "capability": "atomic",
  "file": "cdplayer_recommendedprice_service.owls",
  "provider": {
    "type": "wsdn"
  },
  "inputs": [
    {
      "name": "_CDPLAYER",
      "type": "http://127.0.0.1/ontology/my_ontology.owl#CDPlayer",
      "desc": "Input of service CD Player recommended Price service"
    }
  ],
  "name": "CD Player recommended Price service",
  "description": "This service returns a recommended price of a CD player brand.",
  "domains": [
    {
      "name": "Technology",
      "url": "http://www.surf.scss.tcd.ie/cityOntology/#Technology"
    }
  ],
  "id": "technology/cdplayer_recommendedprice_service",
  "state": true,
  "url": "http://surf.scss.tcd.ie/_provider_/technology/cdplayer_recommendedprice_service"
}