{
  "outputs": [
    {
      "name": "_MAXPRICE",
      "type": "http://127.0.0.1/ontology/concept.owl#MaxPrice",
      "desc": "Output of service PreparedFood MaxPrice Service"
    }
  ],
  "capability": "atomic",
  "file": "preparedfood_maxprice_service.owls",
  "provider": {
    "type": "asp"
  },
  "inputs": [
    {
      "name": "_PREPAREDFOOD",
      "type": "http://127.0.0.1/ontology/Mid-level-ontology.owl#PreparedFood",
      "desc": "Input of service PreparedFood MaxPrice Service"
    }
  ],
  "name": "PreparedFood MaxPrice Service",
  "description": "This service returns current max purchase market price of certain prepared food item.",
  "domains": [
    {
      "name": "Food_and_Drinks",
      "url": "http://www.surf.scss.tcd.ie/cityOntology/#Food_and_Drinks"
    }
  ],
  "id": "food/preparedfood_maxprice_service",
  "state": true,
  "url": "http://surf.scss.tcd.ie/_provider_/food/preparedfood_maxprice_service"
}