{
    "capability": "atomic",
    "description": "It is an attractive service to know about lendings offered for the given award by the german government.",
    "domains": [
        {
            "name": "Educational",
            "url": "http://www.surf.scss.tcd.ie/cityOntology/#Educational"
        }
    ],
    "file": "award_lending_GermanGovservice.owls",
    "id": "education/award_lending_service",
    "inputs": [
        {
            "desc": "Input of service Award Lending Germangoverment Service",
            "name": "_AWARD",
            "type": "http://127.0.0.1/ontology/portal.owl#Award"
        }
    ],
    "name": "Award Lending Germangoverment Service",
    "outputs": [
        {
            "desc": "Output of service Award Lending Germangoverment Service",
            "name": "_LENDING",
            "type": "http://127.0.0.1/ontology/SUMO.owl#Lending"
        }
    ],
    "provider": {
        "type": "asp"
    },
    "state": true,
    "url": "http://surf.scss.tcd.ie/_provider_/education/award_lending_service"
}