{
  "outputs": [
    {
      "name": "_STUDENTCONTENT",
      "type": "http://www.surf.scss.tcd.ie/IoTservices.owl#studentContent",
      "desc": "Output of service course_content_delivery"
    }
  ],
  "provider": {
    "type": "asp"
  },
  "inputs": [
    {
      "name": "_STUDYPLAN",
      "type": "http://www.surf.scss.tcd.ie/IoTservices.owl#studyPlan",
      "desc": "Input of service course_content_delivery"
    }
  ],
  "name": "course_content_delivery",
  "description": "This is the service course_content_delivery",
  "domains": [
    {
      "name": "Educational",
      "url": "http://www.surf.scss.tcd.ie/cityOntology/#Educational"
    }
  ],
  "id": "education/50_course_content_delivery",
  "state": true,
  "url": "http://surf.scss.tcd.ie/_provider_/education/50_course_content_delivery"
}