{
  "outputs": [
    {
      "name": "_price",
      "type": "string",
      "desc": "Output of service AutoPrice"
    }
  ],
  "provider": {
    "type": "wsdn"
  },
  "inputs": [
    {
      "name": "_auto",
      "type": "string",
      "desc": "Input of service AutoPrice"
    }
  ],
  "name": "AutoPrice",
  "description": "A wonderful list of price of auto is available.",
  "domains": [
    {
      "name": "Touristic_Place",
      "url": "http://www.surf.scss.tcd.ie/cityOntology/#Touristic_Place"
    }
  ],
  "id": "retail/auto_price_service",
  "state": true,
  "url": "http://surf.scss.tcd.ie/_provider_/retail/auto_price_service"
}