{
  "outputs": [
    {
      "name": "_PROFESSOR-IN-ACADEMIA",
      "type": "http://127.0.0.1/ontology/portal.owl#Professor-In-Academia",
      "desc": "Output of service Pioneer HigherEducationalOrganizationProfessors"
    }
  ],
  "capability": "atomic",
  "file": "higher-educational-organization_professor-in-academia_Pioneerservice.owls",
  "provider": {
    "type": "webservice"
  },
  "inputs": [
    {
      "name": "_HIGHER-EDUCATIONAL-ORGANIZATION",
      "type": "http://127.0.0.1/ontology/portal.owl#Higher-Educational-Organization",
      "desc": "Input of service Pioneer HigherEducationalOrganizationProfessors"
    }
  ],
  "name": "Pioneer HigherEducationalOrganizationProfessors",
  "description": "It is a pioneer service that returns professors that work at a given higher educational organization.",
  "domains": [
    {
      "name": "Educational",
      "url": "http://www.surf.scss.tcd.ie/cityOntology/#Educational"
    }
  ],
  "id": "education/higher-educational-organization_professor-in-academia_Pioneerservice",
  "state": true,
  "url": "http://surf.scss.tcd.ie/_provider_/education/higher-educational-organization_professor-in-academia_Pioneerservice"
}