{
  "outputs": [
    {
      "name": "_LOWCOMEDYFILM",
      "type": "http://127.0.0.1/ontology/my_ontology.owl#LowComedyFilm",
      "desc": "Output of service LowComedy Action Film service"
    }
  ],
  "capability": "atomic",
  "file": "title_lowcomedyfilm_service.owls",
  "provider": {
    "type": "wsdn"
  },
  "inputs": [
    {
      "name": "_TITLE",
      "type": "http://127.0.0.1/ontology/books.owl#Title",
      "desc": "Input of service LowComedy Action Film service"
    }
  ],
  "name": "LowComedy Action Film service",
  "description": "This service returns film for a title, which is not only an action film but also a low comedy film",
  "domains": [
    {
      "name": "Communications",
      "url": "http://www.surf.scss.tcd.ie/cityOntology/#Communications"
    }
  ],
  "id": "communication/title_lowcomedyfilm_service",
  "state": true,
  "url": "http://surf.scss.tcd.ie/_provider_/communication/title_lowcomedyfilm_service"
}