{
  "outputs": [
    {
      "name": "_PRICE",
      "type": "http://127.0.0.1/ontology/concept.owl#Price",
      "desc": "Output of service DeoSFNPrice Service"
    }
  ],
  "capability": "atomic",
  "file": "DeoSFN_price_service.owls",
  "provider": {
    "type": "wsdn"
  },
  "inputs": [
    {
      "name": "_SCIENCE-FICTION-NOVEL",
      "type": "http://127.0.0.1/ontology/books.owl#Science-Fiction-Novel",
      "desc": "Input of service DeoSFNPrice Service"
    },
    {
      "name": "_USER",
      "type": "http://127.0.0.1/ontology/books.owl#User",
      "desc": "Input of service DeoSFNPrice Service"
    }
  ],
  "name": "DeoSFNPrice Service",
  "description": "Deo service is mostly used service that informs a certain registered user for the purchase price of a given science-fiction novel.",
  "domains": [
    {
      "name": "Entertainment_Products",
      "url": "http://www.surf.scss.tcd.ie/cityOntology/#Entertainment_Products"
    },
    {
      "name": "Educational",
      "url": "http://www.surf.scss.tcd.ie/cityOntology/#Educational"
    }
  ],
  "id": "books/DeoSFN_price_service",
  "state": true,
  "url": "http://surf.scss.tcd.ie/_provider_/books/DeoSFN_price_service"
}