{
  "outputs": [
    {
      "name": "_TAXEDPRICE",
      "type": "http://127.0.0.1/ontology/concept.owl#TaxedPrice",
      "desc": "Output of service Beverage TaxedPrice Physical-Quantity Service"
    },
    {
      "name": "_PHYSICAL-QUANTITY",
      "type": "http://127.0.0.1/ontology/support.owl#Physical-Quantity",
      "desc": "Output of service Beverage TaxedPrice Physical-Quantity Service"
    }
  ],
  "capability": "atomic",
  "file": "beverage_taxedpricephysical-quantity_service.owls",
  "provider": {
    "type": "webservice"
  },
  "inputs": [
    {
      "name": "_BEVERAGE",
      "type": "http://127.0.0.1/ontology/SUMO.owl#Beverage",
      "desc": "Input of service Beverage TaxedPrice Physical-Quantity Service"
    }
  ],
  "name": "Beverage TaxedPrice Physical-Quantity Service",
  "description": "This service informs the physical-quantity and approximately latest market taxedprice of a given beverage item.",
  "domains": [
    {
      "name": "Educational",
      "url": "http://www.surf.scss.tcd.ie/cityOntology/#Educational"
    },
    {
      "name": "Food_and_Drinks",
      "url": "http://www.surf.scss.tcd.ie/cityOntology/#Food_and_Drinks"
    }
  ],
  "id": "food/beverage_taxedpricephysical-quantity_service",
  "state": true,
  "url": "http://surf.scss.tcd.ie/_provider_/food/beverage_taxedpricephysical-quantity_service"
}