{
  "outputs": [
    {
      "name": "_price",
      "type": "string",
      "desc": "Output of service MonographPriceService"
    }
  ],
  "provider": {
    "type": "wsdn"
  },
  "inputs": [
    {
      "name": "_monograph",
      "type": "string",
      "desc": "Input of service MonographPriceService"
    }
  ],
  "name": "MonographPriceService",
  "description": "This service returns price of a monograph.",
  "domains": [
    {
      "name": "Marketing",
      "url": "http://www.surf.scss.tcd.ie/cityOntology/#Marketing"
    }
  ],
  "id": "retail/monograph_price_service",
  "state": true,
  "url": "http://surf.scss.tcd.ie/_provider_/retail/monograph_price_service"
}