{
  "outputs": [
    {
      "name": "_BOOK",
      "type": "http://127.0.0.1/ontology/portal.owl#Book",
      "desc": "Output of service BookProviderService"
    }
  ],
  "capability": "atomic",
  "file": "isbn_book_service.owls",
  "provider": {
    "type": "wsdn"
  },
  "inputs": [
    {
      "name": "_ISBN",
      "type": "http://127.0.0.1/ontology/portal.owl#ISBN",
      "desc": "Input of service BookProviderService"
    }
  ],
  "name": "BookProviderService",
  "description": "This service provides a book title on the given ISBN.",
  "domains": [
    {
      "name": "Educational",
      "url": "http://www.surf.scss.tcd.ie/cityOntology/#Educational"
    },
    {
      "name": "Entertainment_Products",
      "url": "http://www.surf.scss.tcd.ie/cityOntology/#Entertainment_Products"
    }
  ],
  "id": "books/isbn_book_service",
  "state": true,
  "url": "http://surf.scss.tcd.ie/_provider_/books/isbn_book_service"
}