{
  "outputs": [
    {
      "name": "_PRICE",
      "type": "http://127.0.0.1/ontology/concept.owl#Price",
      "desc": "Output of service Bicycle4Wheeledcar_Price_service"
    }
  ],
  "capability": "atomic",
  "file": "bicycle4wheeledcar_price_service.owls",
  "provider": {
    "type": "webservice"
  },
  "inputs": [
    {
      "name": "_4WHEELEDCAR",
      "type": "http://127.0.0.1/ontology/my_ontology.owl#FourWheeledCar",
      "desc": "Input of service Bicycle4Wheeledcar_Price_service"
    },
    {
      "name": "_BICYCLE",
      "type": "http://127.0.0.1/ontology/my_ontology.owl#Bicycle",
      "desc": "Input of service Bicycle4Wheeledcar_Price_service"
    }
  ],
  "name": "Bicycle4Wheeledcar_Price_service",
  "description": "This service returns purchase price of the given pair of a 4(four) wheeled car modeland a bicycle model.",
  "domains": [
    {
      "name": "Vehicle_Sale_and_Rent",
      "url": "http://www.surf.scss.tcd.ie/cityOntology/#Vehicle_Sale_and_Rent"
    }
  ],
  "id": "vehicle/bicycle4wheeledcar_price_service",
  "state": true,
  "url": "http://surf.scss.tcd.ie/_provider_/vehicle/bicycle4wheeledcar_price_service"
}