{
  "outputs": [
    {
      "name": "_city",
      "type": "string",
      "desc": "Output of service HikingSurfingCityService"
    }
  ],
  "provider": {
    "type": "asp"
  },
  "inputs": [
    {
      "name": "_surfing",
      "type": "string",
      "desc": "Input of service HikingSurfingCityService"
    },
    {
      "name": "_hiking",
      "type": "string",
      "desc": "Input of service HikingSurfingCityService"
    }
  ],
  "name": "HikingSurfingCityService",
  "description": "This is a nice service to know aboutthe city where you can find both sports hiking and surfing.",
  "domains": [
    {
      "name": "Health",
      "url": "http://www.surf.scss.tcd.ie/cityOntology/#Health"
    }
  ],
  "id": "tourism/hikingsurfing_city_service",
  "state": true,
  "url": "http://surf.scss.tcd.ie/_provider_/tourism/hikingsurfing_city_service"
}