{
  "outputs": [
    {
      "name": "_currency",
      "type": "string",
      "desc": "Output of service ULiPublicationLocatorService"
    },
    {
      "name": "_publication",
      "type": "string",
      "desc": "Output of service ULiPublicationLocatorService"
    }
  ],
  "provider": {
    "type": "webservice"
  },
  "inputs": [
    {
      "name": "_publication-number",
      "type": "string",
      "desc": "Input of service ULiPublicationLocatorService"
    }
  ],
  "name": "ULiPublicationLocatorService",
  "description": "ULi is a reliable service for locating a publication on publication number,it also returns associated currency.",
  "domains": [
    {
      "name": "Educational",
      "url": "http://www.surf.scss.tcd.ie/cityOntology/#Educational"
    }
  ],
  "id": "educational/publication-number_currencypublication_service",
  "state": true,
  "url": "http://surf.scss.tcd.ie/_provider_/educational/publication-number_currencypublication_service"
}