{
  "outputs": [
    {
      "name": "_VIDEOMEDIA",
      "type": "http://127.0.0.1/ontology/my_ontology.owl#VideoMedia",
      "desc": "Output of service AvailableVideoService"
    }
  ],
  "capability": "atomic",
  "file": "title_videomedia_service.owls",
  "provider": {
    "type": "webservice"
  },
  "inputs": [
    {
      "name": "_TITLE",
      "type": "http://127.0.0.1/ontology/books.owl#Title",
      "desc": "Input of service AvailableVideoService"
    }
  ],
  "name": "AvailableVideoService",
  "description": "This service returns list of available video medias for a given title.",
  "domains": [
    {
      "name": "Communications",
      "url": "http://www.surf.scss.tcd.ie/cityOntology/#Communications"
    }
  ],
  "id": "communication/title_videomedia_service",
  "state": true,
  "url": "http://surf.scss.tcd.ie/_provider_/communication/title_videomedia_service"
}