{
  "outputs": [
    {
      "name": "_SENIOR-RESEARCH-FELLOW-IN-ACADEMIA",
      "type": "http://127.0.0.1/ontology/portal.owl#Senior-Research-Fellow-In-Academia",
      "desc": "Output of service HigherEducationalOrganizationSeniorResearcherFellow"
    }
  ],
  "capability": "atomic",
  "file": "higher-educational-organization_senior-research-fellow-in-academia_Firstservice.owls",
  "provider": {
    "type": "wsdn"
  },
  "inputs": [
    {
      "name": "_HIGHER-EDUCATIONAL-ORGANIZATION",
      "type": "http://127.0.0.1/ontology/portal.owl#Higher-Educational-Organization",
      "desc": "Input of service HigherEducationalOrganizationSeniorResearcherFellow"
    }
  ],
  "name": "HigherEducationalOrganizationSeniorResearcherFellow",
  "description": "It is the first service that returns senior researcher fellow of the given higher educational organization.",
  "domains": [
    {
      "name": "Educational",
      "url": "http://www.surf.scss.tcd.ie/cityOntology/#Educational"
    },
    {
      "name": "Research_and_Science",
      "url": "http://www.surf.scss.tcd.ie/cityOntology/#Research_and_Science"
    }
  ],
  "id": "education/higher-educational-organization_senior-research-fellow-in-academia_Firstservice",
  "state": true,
  "url": "http://surf.scss.tcd.ie/_provider_/education/higher-educational-organization_senior-research-fellow-in-academia_Firstservice"
}