{
  "outputs": [
    {
      "name": "_UNILATERALGIVING",
      "type": "http://127.0.0.1/ontology/SUMO.owl#UnilateralGiving",
      "desc": "Output of service GovernmentDegreeSpecialOffersService"
    }
  ],
  "capability": "atomic",
  "file": "degreegovernment_unilateralgiving_service.owls",
  "provider": {
    "type": "webservice"
  },
  "inputs": [
    {
      "name": "_GOVERNMENT",
      "type": "http://127.0.0.1/ontology/SUMO.owl#Government",
      "desc": "Input of service GovernmentDegreeSpecialOffersService"
    },
    {
      "name": "_DEGREE",
      "type": "http://127.0.0.1/ontology/portal.owl#Degree",
      "desc": "Input of service GovernmentDegreeSpecialOffersService"
    }
  ],
  "name": "GovernmentDegreeSpecialOffersService",
  "description": "This service is mostly used to know about special financial help, honorary award, for the degree offered by the government.",
  "domains": [
    {
      "name": "Educational",
      "url": "http://www.surf.scss.tcd.ie/cityOntology/#Educational"
    }
  ],
  "id": "education/degreegovernment_unilateralgiving_service",
  "state": true,
  "url": "http://surf.scss.tcd.ie/_provider_/education/degreegovernment_unilateralgiving_service"
}