{
  "outputs": [
    {
      "name": "_LIGTHSTATUS",
      "type": "http://www.surf.scss.tcd.ie/IoTservices.owl#ligthStatus",
      "desc": "Output of service public_lighting"
    }
  ],
  "provider": {
    "type": "wsdn"
  },
  "inputs": [
    {
      "name": "_PUBLICAREA",
      "type": "http://www.surf.scss.tcd.ie/IoTservices.owl#publicArea",
      "desc": "Input of service public_lighting"
    },
    {
      "name": "_LIGTHINTENSITY",
      "type": "http://www.surf.scss.tcd.ie/IoTservices.owl#ligthIntensity",
      "desc": "Input of service public_lighting"
    }
  ],
  "name": "public_lighting",
  "description": "This is the service public_lighting",
  "domains": [
    {
      "name": "Transport_and_Mobility",
      "url": "http://www.surf.scss.tcd.ie/cityOntology/#Transport_and_Mobility"
    }
  ],
  "id": "transportandmobility/105_public_lighting",
  "state": true,
  "url": "http://surf.scss.tcd.ie/_provider_/transportandmobility/105_public_lighting"
}