{
  "outputs": [
    {
      "name": "_TAXEDPRICE",
      "type": "http://127.0.0.1/ontology/concept.owl#TaxedPrice",
      "desc": "Output of service car price service"
    },
    {
      "name": "_PRICE",
      "type": "http://127.0.0.1/ontology/concept.owl#Price",
      "desc": "Output of service car price service"
    }
  ],
  "capability": "atomic",
  "file": "car_taxedpriceprice_service.owls",
  "provider": {
    "type": "webservice"
  },
  "inputs": [
    {
      "name": "_CAR",
      "type": "http://127.0.0.1/ontology/my_ontology.owl#Car",
      "desc": "Input of service car price service"
    }
  ],
  "name": "car price service",
  "description": "This service returns not only purchase price of a car, but alsotell how much tax its price includes.",
  "domains": [
    {
      "name": "Vehicle_Sale_and_Rent",
      "url": "http://www.surf.scss.tcd.ie/cityOntology/#Vehicle_Sale_and_Rent"
    }
  ],
  "id": "vehicle/car_taxedpriceprice_service",
  "state": true,
  "url": "http://surf.scss.tcd.ie/_provider_/vehicle/car_taxedpriceprice_service"
}