{
  "outputs": [
    {
      "name": "_MAP",
      "type": "http://127.0.0.1/ontology/Mid-level-ontology.owl#Map",
      "desc": "Output of service CountaryMap Service"
    }
  ],
  "capability": "atomic",
  "file": "country_map_service.owls",
  "provider": {
    "type": "asp"
  },
  "inputs": [
    {
      "name": "_COUNTRY",
      "type": "http://127.0.0.1/ontology/portal.owl#Country",
      "desc": "Input of service CountaryMap Service"
    }
  ],
  "name": "CountaryMap Service",
  "description": "This service returns a map of a given countary. This map is useful to finda route for traveling between two cities.",
  "domains": [
    {
      "name": "Travel",
      "url": "http://www.surf.scss.tcd.ie/cityOntology/#Travel"
    },
    {
      "name": "Geography",
      "url": "http://www.surf.scss.tcd.ie/cityOntology/#Geography"
    }
  ],
  "id": "travel/country_map_service",
  "state": true,
  "url": "http://surf.scss.tcd.ie/_provider_/travel/country_map_service"
}