{
  "outputs": [
    {
      "name": "_ABSTRACT-INFORMATION",
      "type": "http://127.0.0.1/ontology/portal.owl#Abstract-Information",
      "desc": "Output of service Researcher abstract information service"
    }
  ],
  "capability": "atomic",
  "file": "researcher_abstract-information_service.owls",
  "provider": {
    "type": "asp"
  },
  "inputs": [
    {
      "name": "_RESEARCHER",
      "type": "http://127.0.0.1/ontology/portal.owl#Researcher",
      "desc": "Input of service Researcher abstract information service"
    }
  ],
  "name": "Researcher abstract information service",
  "description": "This service returns an abstract information including all publication references of a researcher.",
  "domains": [
    {
      "name": "Educational",
      "url": "http://www.surf.scss.tcd.ie/cityOntology/#Educational"
    }
  ],
  "id": "education/researcher_abstract-information_service",
  "state": true,
  "url": "http://surf.scss.tcd.ie/_provider_/education/researcher_abstract-information_service"
}