{
  "outputs": [
    {
      "name": "_RECOMMENDEDPRICE",
      "type": "http://127.0.0.1/ontology/concept.owl#RecommendedPrice",
      "desc": "Output of service AuthorisedPersonBookRecommendedPrice"
    }
  ],
  "capability": "atomic",
  "file": "bookpersoncreditcardaccount_recommendedprice_service.owls",
  "provider": {
    "type": "asp"
  },
  "inputs": [
    {
      "name": "_PERSON",
      "type": "http://127.0.0.1/ontology/books.owl#Person",
      "desc": "Input of service AuthorisedPersonBookRecommendedPrice"
    },
    {
      "name": "_BOOK",
      "type": "http://127.0.0.1/ontology/books.owl#Book",
      "desc": "Input of service AuthorisedPersonBookRecommendedPrice"
    },
    {
      "name": "_CREDITCARDACCOUNT",
      "type": "http://127.0.0.1/ontology/Mid-level-ontology.owl#CreditCardAccount",
      "desc": "Input of service AuthorisedPersonBookRecommendedPrice"
    }
  ],
  "name": "AuthorisedPersonBookRecommendedPrice",
  "description": "This service varifies credit-card account of an authorised person andreturns recommended purchase price of the given book title.",
  "domains": [
    {
      "name": "Entertainment_Products",
      "url": "http://www.surf.scss.tcd.ie/cityOntology/#Entertainment_Products"
    },
    {
      "name": "Educational",
      "url": "http://www.surf.scss.tcd.ie/cityOntology/#Educational"
    }
  ],
  "id": "books/bookpersoncreditcardaccount_recommendedprice_service",
  "state": true,
  "url": "http://surf.scss.tcd.ie/_provider_/books/bookpersoncreditcardaccount_recommendedprice_service"
}