{
  "outputs": [
    {
      "name": "_PRICE",
      "type": "http://127.0.0.1/ontology/concept.owl#Price",
      "desc": "Output of service Auto Price Color service"
    },
    {
      "name": "_COLOR",
      "type": "http://127.0.0.1/ontology/my_ontology.owl#Color",
      "desc": "Output of service Auto Price Color service"
    }
  ],
  "capability": "atomic",
  "file": "auto_pricecolor_service.owls",
  "provider": {
    "type": "wsdn"
  },
  "inputs": [
    {
      "name": "_AUTO",
      "type": "http://127.0.0.1/ontology/my_ontology.owl#Auto",
      "desc": "Input of service Auto Price Color service"
    }
  ],
  "name": "Auto Price Color service",
  "description": "This service provides a list of daily renting prices for given auto(car) model. The output also includes the colour of the available cars.",
  "id": "economy/auto_pricecolor_service",
  "state": true,
  "url": "http://surf.scss.tcd.ie/_provider_/economy/auto_pricecolor_service"
}