{
  "outputs": [
    {
      "name": "_RECOMMENDEDPRICEINEURO",
      "type": "http://127.0.0.1/ontology/concept.owl#RecommendedPriceInEuro",
      "desc": "Output of service Recommended price of Renault car"
    }
  ],
  "capability": "atomic",
  "file": "Renaultyear_recommendedpriceineuro_service.owls",
  "provider": {
    "type": "wsdn"
  },
  "inputs": [
    {
      "name": "_YEAR",
      "type": "http://127.0.0.1/ontology/SUMO.owl#Year",
      "desc": "Input of service Recommended price of Renault car"
    }
  ],
  "name": "Recommended price of Renault car",
  "description": "This service provides information of recommended price in Eurofor a Renault car whose model year is given.",
  "domains": [
    {
      "name": "Vehicle_Sale_and_Rent",
      "url": "http://www.surf.scss.tcd.ie/cityOntology/#Vehicle_Sale_and_Rent"
    }
  ],
  "id": "vehicle/Renaultyear_recommendedpriceineuro_service",
  "state": true,
  "url": "http://surf.scss.tcd.ie/_provider_/vehicle/Renaultyear_recommendedpriceineuro_service"
}