{
  "outputs": [
    {
      "name": "_warmfront",
      "type": "string",
      "desc": "Output of service Geopolitica-Entity WarmFront Service"
    }
  ],
  "provider": {
    "type": "wsdn"
  },
  "inputs": [
    {
      "name": "_geopolitical-entity",
      "type": "string",
      "desc": "Input of service Geopolitica-Entity WarmFront Service"
    }
  ],
  "name": "Geopolitica-Entity WarmFront Service",
  "description": "This service informs about warmfronts of a given geopolitical entity.",
  "domains": [
    {
      "name": "Food_and_Drinks",
      "url": "http://www.surf.scss.tcd.ie/cityOntology/#Food_and_Drinks"
    }
  ],
  "id": "environmental/geopolitical-entity_warmfront_service",
  "state": true,
  "url": "http://surf.scss.tcd.ie/_provider_/environmental/geopolitical-entity_warmfront_service"
}