{
  "outputs": [
    {
      "name": "_PRISIONERSLIST",
      "type": "http://www.surf.scss.tcd.ie/IoTservices.owl#prisionersList",
      "desc": "Output of service prision_surveillance_configurator"
    },
    {
      "name": "_PRISIONZONE",
      "type": "http://www.surf.scss.tcd.ie/IoTservices.owl#prisionZone",
      "desc": "Output of service prision_surveillance_configurator"
    }
  ],
  "provider": {
    "type": "ws"
  },
  "inputs": [
    {
      "name": "_PRISIONSURVEILLANCEPARAMETERS",
      "type": "http://www.surf.scss.tcd.ie/IoTservices.owl#prisionSurveillanceParameters",
      "desc": "Input of service prision_surveillance_configurator"
    }
  ],
  "name": "prision_surveillance_configurator",
  "description": "This is the service prision_surveillance_configurator",
  "domains": [
    {
      "name": "Safety_and_Emergencies",
      "url": "http://www.surf.scss.tcd.ie/cityOntology/#Safety_and_Emergencies"
    }
  ],
  "id": "safetyandemergencies/17_prision_surveillance_configurator",
  "state": true,
  "url": "http://surf.scss.tcd.ie/_provider_/safetyandemergencies/17_prision_surveillance_configurator"
}