{
  "outputs": [
    {
      "name": "_SIMILARBOOKS",
      "type": "http://www.surf.scss.tcd.ie/IoTservices.owl#similarBooks",
      "desc": "Output of service similar_books"
    }
  ],
  "provider": {
    "type": "ws"
  },
  "inputs": [
    {
      "name": "_BOOKSINFORMATION",
      "type": "http://www.surf.scss.tcd.ie/IoTservices.owl#booksInformation",
      "desc": "Input of service similar_books"
    }
  ],
  "name": "similar_books",
  "description": "This is the service similar_books",
  "domains": [
    {
      "name": "Educational",
      "url": "http://www.surf.scss.tcd.ie/cityOntology/#Educational"
    },
    {
      "name": "Research_and_Science",
      "url": "http://www.surf.scss.tcd.ie/cityOntology/#Research_and_Science"
    }
  ],
  "id": "researchandscience/57_similar_books",
  "state": true,
  "url": "http://surf.scss.tcd.ie/_provider_/researchandscience/57_similar_books"
}