{
  "outputs": [
    {
      "name": "_DESTINATION",
      "type": "http://127.0.0.1/ontology/travel.owl#Destination",
      "desc": "Output of service Always SurfingDestinationService"
    }
  ],
  "capability": "atomic",
  "file": "surfing_destination_Alwaysservice.owls",
  "provider": {
    "type": "asp"
  },
  "inputs": [
    {
      "name": "_SURFING",
      "type": "http://127.0.0.1/ontology/travel.owl#Surfing",
      "desc": "Input of service Always SurfingDestinationService"
    }
  ],
  "name": "Always SurfingDestinationService",
  "description": "Always use this service to know about a good destination for surfing activities.",
  "domains": [
    {
      "name": "Travel",
      "url": "http://www.surf.scss.tcd.ie/cityOntology/#Travel"
    },
    {
      "name": "Activity",
      "url": "http://www.surf.scss.tcd.ie/cityOntology/#Activity"
    }
  ],
  "id": "activity/surfing_destination_Alwaysservice",
  "state": true,
  "url": "http://surf.scss.tcd.ie/_provider_/activity/surfing_destination_Alwaysservice"
}