{
  "outputs": [
    {
      "name": "_RECOMMENDEDPRICE",
      "type": "http://127.0.0.1/ontology/concept.owl#RecommendedPrice",
      "desc": "Output of service Cheap Car Recommended Price service"
    }
  ],
  "capability": "atomic",
  "file": "amount-of-moneycheapcar_recommendedprice_service.owls",
  "provider": {
    "type": "asp"
  },
  "inputs": [
    {
      "name": "_CHEAPCAR",
      "type": "http://127.0.0.1/ontology/my_ontology.owl#CheapCar",
      "desc": "Input of service Cheap Car Recommended Price service"
    },
    {
      "name": "_AMOUNT-OF-MONEY",
      "type": "http://127.0.0.1/ontology/portal.owl#Amount-Of-Money",
      "desc": "Input of service Cheap Car Recommended Price service"
    }
  ],
  "name": "Cheap Car Recommended Price service",
  "description": "This service tries to find the recommended price of a given cheap car model within given amount of money.",
  "domains": [
    {
      "name": "Vehicle_Sale_and_Rent",
      "url": "http://www.surf.scss.tcd.ie/cityOntology/#Vehicle_Sale_and_Rent"
    }
  ],
  "id": "vehicle/amount-of-moneycheapcar_recommendedprice_service",
  "state": true,
  "url": "http://surf.scss.tcd.ie/_provider_/vehicle/amount-of-moneycheapcar_recommendedprice_service"
}