{
  "outputs": [
    {
      "name": "_PRICE",
      "type": "http://127.0.0.1/ontology/concept.owl#Price",
      "desc": "Output of service MarkoPSservice"
    },
    {
      "name": "_TAXEDPRICE",
      "type": "http://127.0.0.1/ontology/concept.owl#TaxedPrice",
      "desc": "Output of service MarkoPSservice"
    },
    {
      "name": "_STOCKMARKET",
      "type": "http://127.0.0.1/ontology/Mid-level-ontology.owl#StockMarket",
      "desc": "Output of service MarkoPSservice"
    }
  ],
  "capability": "atomic",
  "file": "MarkoPS_service.owls",
  "provider": {
    "type": "webservice"
  },
  "inputs": [
    {
      "name": "_PREPAREDFOOD",
      "type": "http://127.0.0.1/ontology/Mid-level-ontology.owl#PreparedFood",
      "desc": "Input of service MarkoPSservice"
    }
  ],
  "name": "MarkoPSservice",
  "description": "MarkoPS service informs you about price of a given prepared food item, andalso its tax price according to a certain stock market.",
  "domains": [
    {
      "name": "Food_and_Drinks",
      "url": "http://www.surf.scss.tcd.ie/cityOntology/#Food_and_Drinks"
    }
  ],
  "id": "food/MarkoPS_service",
  "state": true,
  "url": "http://surf.scss.tcd.ie/_provider_/food/MarkoPS_service"
}