{
  "outputs": [
    {
      "name": "_LECTURER-IN-ACADEMIA",
      "type": "http://127.0.0.1/ontology/portal.owl#Lecturer-In-Academia",
      "desc": "Output of service LearnedCenteredOrganizationLecturer Service"
    }
  ],
  "capability": "atomic",
  "file": "learning-centred-organization_lecturer-in-academia_service.owls",
  "provider": {
    "type": "webservice"
  },
  "inputs": [
    {
      "name": "_LEARNING-CENTRED-ORGANIZATION",
      "type": "http://127.0.0.1/ontology/portal.owl#Learning-Centred-Organization",
      "desc": "Input of service LearnedCenteredOrganizationLecturer Service"
    }
  ],
  "name": "LearnedCenteredOrganizationLecturer Service",
  "description": "This service returns lecturer who works in a given learning center organization.",
  "domains": [
    {
      "name": "Educational",
      "url": "http://www.surf.scss.tcd.ie/cityOntology/#Educational"
    }
  ],
  "id": "education/learning-centred-organization_lecturer-in-academia_service",
  "state": true,
  "url": "http://surf.scss.tcd.ie/_provider_/education/learning-centred-organization_lecturer-in-academia_service"
}