{
  "outputs": [
    {
      "name": "_recommendedpriceindollar",
      "type": "string",
      "desc": "Output of service CarRecommendedPrice service"
    }
  ],
  "provider": {
    "type": "asp"
  },
  "inputs": [
    {
      "name": "_car",
      "type": "string",
      "desc": "Input of service CarRecommendedPrice service"
    }
  ],
  "name": "CarRecommendedPrice service",
  "description": "This service returns recommended price of the car in Dollars.",
  "domains": [
    {
      "name": "Construction",
      "url": "http://www.surf.scss.tcd.ie/cityOntology/#Construction"
    }
  ],
  "id": "retail/car_recommendedpriceindollar_service",
  "state": true,
  "url": "http://surf.scss.tcd.ie/_provider_/retail/car_recommendedpriceindollar_service"
}