{
    "capability": "atomic",
    "description": "This service finds skilled occupation in a given geographical regions, like Europe, andalso returns organization who offers that job.",
    "domains": [
        {
            "name": "Industry",
            "url": "http://www.surf.scss.tcd.ie/cityOntology/#Industry"
        }
    ],
    "file": "geographical-region_organizationskilledoccupation_JobService.owls",
    "id": "education/geographical-region_organizationskilledoccupation_service",
    "inputs": [
        {
            "desc": "Input of service OccupationFinder",
            "name": "_GEOGRAPHICAL-REGION",
            "type": "http://127.0.0.1/ontology/portal.owl#Geographical-Region"
        }
    ],
    "name": "OccupationFinder",
    "outputs": [
        {
            "desc": "Output of service OccupationFinder",
            "name": "_ORGANIZATION",
            "type": "http://127.0.0.1/ontology/finance_th_web.owl#organization"
        },
        {
            "desc": "Output of service OccupationFinder",
            "name": "_SKILLEDOCCUPATION",
            "type": "http://127.0.0.1/ontology/Mid-level-ontology.owl#SkilledOccupation"
        }
    ],
    "provider": {
        "type": "wsdn"
    },
    "state": true,
    "url": "http://surf.scss.tcd.ie/_provider_/education/geographical-region_organizationskilledoccupation_service"
}