{
  "outputs": [
    {
      "name": "_PRICE",
      "type": "http://127.0.0.1/ontology/concept.owl#Price",
      "desc": "Output of service EncyclopediaPriceService"
    }
  ],
  "capability": "atomic",
  "file": "encyclopedia_price_service.owls",
  "provider": {
    "type": "wsdn"
  },
  "inputs": [
    {
      "name": "_ENCYCLOPEDIA",
      "type": "http://127.0.0.1/ontology/books.owl#Encyclopedia",
      "desc": "Input of service EncyclopediaPriceService"
    }
  ],
  "name": "EncyclopediaPriceService",
  "description": "This service informs you an affordable purchase price of the given encyclopedia.",
  "domains": [
    {
      "name": "Entertainment_Products",
      "url": "http://www.surf.scss.tcd.ie/cityOntology/#Entertainment_Products"
    }
  ],
  "id": "books/encyclopedia_price_service",
  "state": true,
  "url": "http://surf.scss.tcd.ie/_provider_/books/encyclopedia_price_service"
}