{
  "outputs": [
    {
      "name": "_MAP",
      "type": "http://127.0.0.1/ontology/Mid-level-ontology.owl#Map",
      "desc": "Output of service Route to Berlin Service"
    }
  ],
  "capability": "atomic",
  "file": "geographical-region_mapToBerlin_service.owls",
  "provider": {
    "type": "wsdn"
  },
  "inputs": [
    {
      "name": "_GEOGRAPHICAL-REGION",
      "type": "http://127.0.0.1/ontology/portal.owl#Geographical-Region",
      "desc": "Input of service Route to Berlin Service"
    }
  ],
  "name": "Route to Berlin Service",
  "description": "If you want to travel to Berlin, then we provide a service to return a mapindicating all paths from your location to Berlin.",
  "domains": [
    {
      "name": "Travel",
      "url": "http://www.surf.scss.tcd.ie/cityOntology/#Travel"
    }
  ],
  "id": "travel/geographical-region_map_service",
  "state": true,
  "url": "http://surf.scss.tcd.ie/_provider_/travel/geographical-region_map_service"
}