{
  "outputs": [
    {
      "name": "_SENSEDDATA",
      "type": "http://www.surf.scss.tcd.ie/IoTservices.owl#sensedData",
      "desc": "Output of service campus_crowdsensing"
    }
  ],
  "provider": {
    "type": "asp"
  },
  "inputs": [
    {
      "name": "_CAMPUSZONE",
      "type": "http://www.surf.scss.tcd.ie/IoTservices.owl#campusZone",
      "desc": "Input of service campus_crowdsensing"
    }
  ],
  "name": "campus_crowdsensing",
  "description": "This is the service campus_crowdsensing",
  "domains": [
    {
      "name": "Educational",
      "url": "http://www.surf.scss.tcd.ie/cityOntology/#Educational"
    }
  ],
  "id": "education/112_campus_crowdsensing",
  "state": true,
  "url": "http://surf.scss.tcd.ie/_provider_/education/112_campus_crowdsensing"
}