{
    "capability": "atomic",
    "description": "The main focus of this service is to return the review on a science-fictionnovel for an authorized user, also the recommended price (it may be not represent the current price of the novel.)",
    "domains": [
        {
            "name": "Research_and_Science",
            "url": "http://www.surf.scss.tcd.ie/cityOntology/#Research_and_Science"
        }
    ],
    "file": "ScienceFNovelReview_service.owls",
    "id": "books/userscience-fiction-novel_recommendedpricereview_service",
    "inputs": [
        {
            "desc": "Input of service SFNovelReview Service",
            "name": "_SCIENCE-FICTION-NOVEL",
            "type": "http://127.0.0.1/ontology/books.owl#Science-Fiction-Novel"
        },
        {
            "desc": "Input of service SFNovelReview Service",
            "name": "_USER",
            "type": "http://127.0.0.1/ontology/books.owl#User"
        }
    ],
    "name": "SFNovelReview Service",
    "outputs": [
        {
            "desc": "Output of service SFNovelReview Service",
            "name": "_RECOMMENDEDPRICE",
            "type": "http://127.0.0.1/ontology/concept.owl#RecommendedPrice"
        },
        {
            "desc": "Output of service SFNovelReview Service",
            "name": "_REVIEW",
            "type": "http://127.0.0.1/ontology/books.owl#Review"
        }
    ],
    "provider": {
        "type": "asp"
    },
    "state": true,
    "url": "http://surf.scss.tcd.ie/_provider_/books/userscience-fiction-novel_recommendedpricereview_service"
}