{
  "outputs": [
    {
      "name": "_LUXURYHOTEL",
      "type": "http://127.0.0.1/ontology/travel.owl#LuxuryHotel",
      "desc": "Output of service GelLuxuryHotelInfoService"
    }
  ],
  "capability": "atomic",
  "file": "countrycity_luxuryhotel_Gelservice.owls",
  "provider": {
    "type": "asp"
  },
  "inputs": [
    {
      "name": "_CITY",
      "type": "http://127.0.0.1/ontology/travel.owl#City",
      "desc": "Input of service GelLuxuryHotelInfoService"
    },
    {
      "name": "_COUNTRY",
      "type": "http://127.0.0.1/ontology/portal.owl#Country",
      "desc": "Input of service GelLuxuryHotelInfoService"
    }
  ],
  "name": "GelLuxuryHotelInfoService",
  "description": "Gel is a wellknown name in hotels, and provide a service to know about the available luxury hotelsin the city of the country.",
  "domains": [
    {
      "name": "Travel",
      "url": "http://www.surf.scss.tcd.ie/cityOntology/#Travel"
    },
    {
      "name": "Accommodation",
      "url": "http://www.surf.scss.tcd.ie/cityOntology/#Accommodation"
    }
  ],
  "id": "accommodation/countrycity_luxuryhotel_Gelservice",
  "state": true,
  "url": "http://surf.scss.tcd.ie/_provider_/accommodation/countrycity_luxuryhotel_Gelservice"
}