{
  "outputs": [
    {
      "name": "_YEAR",
      "type": "http://127.0.0.1/ontology/SUMO.owl#Year",
      "desc": "Output of service CheapCar Year Price Service"
    },
    {
      "name": "_PRICE",
      "type": "http://127.0.0.1/ontology/concept.owl#Price",
      "desc": "Output of service CheapCar Year Price Service"
    }
  ],
  "capability": "atomic",
  "file": "cheapcar_yearprice_service.owls",
  "provider": {
    "type": "wsdn"
  },
  "inputs": [
    {
      "name": "_CHEAPCAR",
      "type": "http://127.0.0.1/ontology/my_ontology.owl#CheapCar",
      "desc": "Input of service CheapCar Year Price Service"
    }
  ],
  "name": "CheapCar Year Price Service",
  "description": "This service provides the best purchase price and year of production of a given cheap car model.",
  "domains": [
    {
      "name": "Vehicle_Sale_and_Rent",
      "url": "http://www.surf.scss.tcd.ie/cityOntology/#Vehicle_Sale_and_Rent"
    }
  ],
  "id": "vehicle/cheapcar_yearprice_service",
  "state": true,
  "url": "http://surf.scss.tcd.ie/_provider_/vehicle/cheapcar_yearprice_service"
}