{
  "outputs": [
    {
      "name": "_LIQUID",
      "type": "http://127.0.0.1/ontology/my_ontology.owl#Liquid",
      "desc": "Output of service LiquidService"
    }
  ],
  "capability": "atomic",
  "file": "maxprice_liquid_service.owls",
  "provider": {
    "type": "webservice"
  },
  "inputs": [
    {
      "name": "_MAXPRICE",
      "type": "http://127.0.0.1/ontology/concept.owl#MaxPrice",
      "desc": "Input of service LiquidService"
    }
  ],
  "name": "LiquidService",
  "description": "This service offer a liquid like water for a maximum price.",
  "domains": [
    {
      "name": "Food_and_Drinks",
      "url": "http://www.surf.scss.tcd.ie/cityOntology/#Food_and_Drinks"
    }
  ],
  "id": "food/maxprice_liquid_service",
  "state": true,
  "url": "http://surf.scss.tcd.ie/_provider_/food/maxprice_liquid_service"
}