{
  "outputs": [
    {
      "name": "_MONOGRAPH",
      "type": "http://127.0.0.1/ontology/books.owl#Monograph",
      "desc": "Output of service Author Monograph RecommendedPrice Service"
    },
    {
      "name": "_RECOMMENDEDPRICE",
      "type": "http://127.0.0.1/ontology/concept.owl#RecommendedPrice",
      "desc": "Output of service Author Monograph RecommendedPrice Service"
    }
  ],
  "capability": "atomic",
  "file": "author_monographrecommendedprice_service.owls",
  "provider": {
    "type": "asp"
  },
  "inputs": [
    {
      "name": "_AUTHOR",
      "type": "http://127.0.0.1/ontology/books.owl#Author",
      "desc": "Input of service Author Monograph RecommendedPrice Service"
    }
  ],
  "name": "Author Monograph RecommendedPrice Service",
  "description": "This service returns monographs written by the given author. The recommended price is also informed.",
  "domains": [
    {
      "name": "Entertainment_Products",
      "url": "http://www.surf.scss.tcd.ie/cityOntology/#Entertainment_Products"
    }
  ],
  "id": "books/author_monographrecommendedprice_service",
  "state": true,
  "url": "http://surf.scss.tcd.ie/_provider_/books/author_monographrecommendedprice_service"
}