{
  "outputs": [
    {
      "name": "_price",
      "type": "string",
      "desc": "Output of service MarkoPSservice"
    },
    {
      "name": "_taxedprice",
      "type": "string",
      "desc": "Output of service MarkoPSservice"
    },
    {
      "name": "_stockmarket",
      "type": "string",
      "desc": "Output of service MarkoPSservice"
    }
  ],
  "provider": {
    "type": "wsdn"
  },
  "inputs": [
    {
      "name": "_preparedfood",
      "type": "string",
      "desc": "Input of service MarkoPSservice"
    }
  ],
  "name": "MarkoPSservice",
  "description": "MarkoPS service informs you about price of a prepared food, andalso its tax price according to a certain stock market.",
  "domains": [
    {
      "name": "House_Sale_and_Rent",
      "url": "http://www.surf.scss.tcd.ie/cityOntology/#House_Sale_and_Rent"
    }
  ],
  "id": "retail/preparedfood_pricetaxedpricestockmarket_service",
  "state": true,
  "url": "http://surf.scss.tcd.ie/_provider_/retail/preparedfood_pricetaxedpricestockmarket_service"
}