{
  "outputs": [
    {
      "name": "_NATIONALPARK",
      "type": "http://127.0.0.1/ontology/travel.owl#NationalPark",
      "desc": "Output of service Hiking NationalPark Service"
    }
  ],
  "capability": "atomic",
  "file": "hiking_nationalpark_service.owls",
  "provider": {
    "type": "webservice"
  },
  "inputs": [
    {
      "name": "_HIKING",
      "type": "http://127.0.0.1/ontology/travel.owl#Hiking",
      "desc": "Input of service Hiking NationalPark Service"
    }
  ],
  "name": "Hiking NationalPark Service",
  "description": "This service returns national parks that are used by hikers.",
  "domains": [
    {
      "name": "Travel",
      "url": "http://www.surf.scss.tcd.ie/cityOntology/#Travel"
    },
    {
      "name": "Activity",
      "url": "http://www.surf.scss.tcd.ie/cityOntology/#Activity"
    }
  ],
  "id": "activity/hiking_nationalpark_service",
  "state": true,
  "url": "http://surf.scss.tcd.ie/_provider_/activity/hiking_nationalpark_service"
}