{
  "outputs": [
    {
      "name": "_PACKAGEMONITORINGDISPLAY",
      "type": "http://www.surf.scss.tcd.ie/IoTservices.owl#packageMonitoringDisplay",
      "desc": "Output of service package_monitoring_dashboard"
    }
  ],
  "provider": {
    "type": "asp"
  },
  "inputs": [
    {
      "name": "_GPSPACKAGEINFO",
      "type": "http://www.surf.scss.tcd.ie/IoTservices.owl#gpsPackageInfo",
      "desc": "Input of service package_monitoring_dashboard"
    },
    {
      "name": "_PACKAGESTATUS",
      "type": "http://www.surf.scss.tcd.ie/IoTservices.owl#packageStatus",
      "desc": "Input of service package_monitoring_dashboard"
    }
  ],
  "name": "package_monitoring_dashboard",
  "description": "This is the service package_monitoring_dashboard",
  "domains": [
    {
      "name": "Logistic",
      "url": "http://www.surf.scss.tcd.ie/cityOntology/#Logistic"
    },
    {
      "name": "Communications",
      "url": "http://www.surf.scss.tcd.ie/cityOntology/#Communications"
    }
  ],
  "id": "logistic/100_package_monitoring_dashboard",
  "state": true,
  "url": "http://surf.scss.tcd.ie/_provider_/logistic/100_package_monitoring_dashboard"
}