{
  "outputs": [
    {
      "name": "_MEDIA",
      "type": "http://127.0.0.1/ontology/my_ontology.owl#Media",
      "desc": "Output of service Title Media TaxFreePrice Quality service"
    },
    {
      "name": "_TAXFREEPRICE",
      "type": "http://127.0.0.1/ontology/concept.owl#TaxFreePrice",
      "desc": "Output of service Title Media TaxFreePrice Quality service"
    },
    {
      "name": "_QUALITY",
      "type": "http://127.0.0.1/ontology/finance_th_web.owl#quality",
      "desc": "Output of service Title Media TaxFreePrice Quality service"
    }
  ],
  "capability": "atomic",
  "file": "title_mediataxfreepricequality_service.owls",
  "provider": {
    "type": "wsdn"
  },
  "inputs": [
    {
      "name": "_TITLE",
      "type": "http://127.0.0.1/ontology/books.owl#Title",
      "desc": "Input of service Title Media TaxFreePrice Quality service"
    }
  ],
  "name": "Title Media TaxFreePrice Quality service",
  "description": "This service searches media for the given title, and also returnsits taxfree price and quality.",
  "domains": [
    {
      "name": "Communications",
      "url": "http://www.surf.scss.tcd.ie/cityOntology/#Communications"
    },
    {
      "name": "Entertainment_Products",
      "url": "http://www.surf.scss.tcd.ie/cityOntology/#Entertainment_Products"
    }
  ],
  "id": "entertainment/title_mediataxfreepricequality_service",
  "state": true,
  "url": "http://surf.scss.tcd.ie/_provider_/entertainment/title_mediataxfreepricequality_service"
}