{
  "outputs": [
    {
      "name": "_RURALAREA",
      "type": "http://127.0.0.1/ontology/travel.owl#RuralArea",
      "desc": "Output of service Adventure RuralArea Service"
    }
  ],
  "capability": "atomic",
  "file": "adventure_ruralarea_service.owls",
  "provider": {
    "type": "asp"
  },
  "inputs": [
    {
      "name": "_ADVENTURE",
      "type": "http://127.0.0.1/ontology/travel.owl#Adventure",
      "desc": "Input of service Adventure RuralArea Service"
    }
  ],
  "name": "Adventure RuralArea Service",
  "description": "This service returns rural areas which provide given adventure activities.",
  "domains": [
    {
      "name": "Travel",
      "url": "http://www.surf.scss.tcd.ie/cityOntology/#Travel"
    },
    {
      "name": "Activity",
      "url": "http://www.surf.scss.tcd.ie/cityOntology/#Activity"
    }
  ],
  "id": "activity/adventure_ruralarea_service",
  "state": true,
  "url": "http://surf.scss.tcd.ie/_provider_/activity/adventure_ruralarea_service"
}