{
    "capability": "atomic",
    "description": "A pioneer service to know about the cities which provide both sports hiking and surfing activities.",
    "domains": [
        {
            "name": "Activity",
            "url": "http://www.surf.scss.tcd.ie/cityOntology/#Activity"
        }
    ],
    "file": "surfinghiking_city_SFservice.owls",
    "id": "travel/surfinghiking_city_service",
    "inputs": [
        {
            "desc": "Input of service SFCityService",
            "name": "_SURFING",
            "type": "http://127.0.0.1/ontology/travel.owl#Surfing"
        },
        {
            "desc": "Input of service SFCityService",
            "name": "_HIKING",
            "type": "http://127.0.0.1/ontology/travel.owl#Hiking"
        }
    ],
    "name": "SFCityService",
    "outputs": [
        {
            "desc": "Output of service SFCityService",
            "name": "_CITY",
            "type": "http://127.0.0.1/ontology/travel.owl#City"
        }
    ],
    "provider": {
        "type": "webservice"
    },
    "state": true,
    "url": "http://surf.scss.tcd.ie/_provider_/travel/surfinghiking_city_service"
}