{
  "outputs": [
    {
      "name": "_PRISIONNOTIFICATION",
      "type": "http://www.surf.scss.tcd.ie/IoTservices.owl#prisionNotification",
      "desc": "Output of service prision_anomaly_detection"
    }
  ],
  "provider": {
    "type": "ws"
  },
  "inputs": [
    {
      "name": "_PRISIONERINFO",
      "type": "http://www.surf.scss.tcd.ie/IoTservices.owl#prisionerInfo",
      "desc": "Input of service prision_anomaly_detection"
    },
    {
      "name": "_PRISIONVIDEO",
      "type": "http://www.surf.scss.tcd.ie/IoTservices.owl#prisionVideo",
      "desc": "Input of service prision_anomaly_detection"
    }
  ],
  "name": "prision_anomaly_detection",
  "description": "This is the service prision_anomaly_detection",
  "domains": [
    {
      "name": "Safety_and_Emergencies",
      "url": "http://www.surf.scss.tcd.ie/cityOntology/#Safety_and_Emergencies"
    }
  ],
  "id": "safetyandemergencies/20_prision_anomaly_detection",
  "state": true,
  "url": "http://surf.scss.tcd.ie/_provider_/safetyandemergencies/20_prision_anomaly_detection"
}