{
  "outputs": [
    {
      "name": "_NATIONALPARK",
      "type": "http://127.0.0.1/ontology/travel.owl#NationalPark",
      "desc": "Output of service SportsNationalParkService"
    }
  ],
  "capability": "atomic",
  "file": "sports_nationalpark_service.owls",
  "provider": {
    "type": "wsdn"
  },
  "inputs": [
    {
      "name": "_SPORTS",
      "type": "http://127.0.0.1/ontology/travel.owl#Sports",
      "desc": "Input of service SportsNationalParkService"
    }
  ],
  "name": "SportsNationalParkService",
  "description": "This is a recommended service to know aboutthe national parks which provide given sports activities.",
  "domains": [
    {
      "name": "Travel",
      "url": "http://www.surf.scss.tcd.ie/cityOntology/#Travel"
    },
    {
      "name": "Activity",
      "url": "http://www.surf.scss.tcd.ie/cityOntology/#Activity"
    },
    {
      "name": "Sport",
      "url": "http://www.surf.scss.tcd.ie/cityOntology/#Sport"
    },
    {
      "name": "Leisure",
      "url": "http://www.surf.scss.tcd.ie/cityOntology/#Leisure"
    }
  ],
  "id": "activity/sports_nationalpark_service",
  "state": true,
  "url": "http://surf.scss.tcd.ie/_provider_/activity/sports_nationalpark_service"
}