{
  "outputs": [
    {
      "name": "_SKILLEDOCCUPATION",
      "type": "http://127.0.0.1/ontology/Mid-level-ontology.owl#SkilledOccupation",
      "desc": "Output of service OccupationFinder"
    },
    {
      "name": "_COMPANY",
      "type": "http://127.0.0.1/ontology/finance_th_web.owl#company",
      "desc": "Output of service OccupationFinder"
    }
  ],
  "capability": "atomic",
  "file": "geopolitical-entity_skilledoccupationcompany_service.owls",
  "provider": {
    "type": "webservice"
  },
  "inputs": [
    {
      "name": "_GEOPOLITICAL-ENTITY",
      "type": "http://127.0.0.1/ontology/portal.owl#Geopolitical-Entity",
      "desc": "Input of service OccupationFinder"
    }
  ],
  "name": "OccupationFinder",
  "description": "This service finds skilled occupation in a given geopolitical entity, like Germany, andalso returns company who offers that job.",
  "domains": [
    {
      "name": "Educational",
      "url": "http://www.surf.scss.tcd.ie/cityOntology/#Educational"
    }
  ],
  "id": "education/geopolitical-entity_skilledoccupationcompany_service",
  "state": true,
  "url": "http://surf.scss.tcd.ie/_provider_/education/geopolitical-entity_skilledoccupationcompany_service"
}