{
  "outputs": [
    {
      "name": "_VHS",
      "type": "http://127.0.0.1/ontology/my_ontology.owl#VHS",
      "desc": "Output of service DVD and VHS service"
    },
    {
      "name": "_DVD",
      "type": "http://127.0.0.1/ontology/my_ontology.owl#DVD",
      "desc": "Output of service DVD and VHS service"
    }
  ],
  "capability": "atomic",
  "file": "title_vhsdvd_service.owls",
  "provider": {
    "type": "webservice"
  },
  "inputs": [
    {
      "name": "_TITLE",
      "type": "http://127.0.0.1/ontology/books.owl#Title",
      "desc": "Input of service DVD and VHS service"
    }
  ],
  "name": "DVD and VHS service",
  "description": "This service searches DVD and VHS movie titles for a given title.",
  "domains": [
    {
      "name": "Communications",
      "url": "http://www.surf.scss.tcd.ie/cityOntology/#Communications"
    }
  ],
  "id": "communication/title_vhsdvd_service",
  "state": true,
  "url": "http://surf.scss.tcd.ie/_provider_/communication/title_vhsdvd_service"
}