{
  "outputs": [
    {
      "name": "_TAXEDPRICE",
      "type": "http://127.0.0.1/ontology/concept.owl#TaxedPrice",
      "desc": "Output of service DVDPlayer TaxedPrice service"
    }
  ],
  "capability": "atomic",
  "file": "dvdplayer_taxedprice_service.owls",
  "provider": {
    "type": "wsdn"
  },
  "inputs": [
    {
      "name": "_DVDPLAYER",
      "type": "http://127.0.0.1/ontology/my_ontology.owl#DVDPlayer",
      "desc": "Input of service DVDPlayer TaxedPrice service"
    }
  ],
  "name": "DVDPlayer TaxedPrice service",
  "description": "This service returns the latest taxed purchase price of a given dvd player model on the market.",
  "domains": [
    {
      "name": "Technology",
      "url": "http://www.surf.scss.tcd.ie/cityOntology/#Technology"
    }
  ],
  "id": "technology/dvdplayer_taxedprice_service",
  "state": true,
  "url": "http://surf.scss.tcd.ie/_provider_/technology/dvdplayer_taxedprice_service"
}