{
  "outputs": [
    {
      "name": "_ALTITUDE",
      "type": "http://127.0.0.1/ontology/geographydataset.owl#AltitudeAboveSeaLevel",
      "desc": "Output of service Altitude Calculator Service."
    },
    {
      "name": "_LOCATION",
      "type": "http://127.0.0.1/ontology/protont.owl#Location",
      "desc": "Output of service Altitude Calculator Service."
    }
  ],
  "capability": "atomic",
  "file": "getAltitudeOfLocation.owls",
  "provider": {
    "type": "wsdn"
  },
  "inputs": [
    {
      "name": "_USERID",
      "type": "http://127.0.0.1/ontology/geographydataset.owl#UniqueIdentifier",
      "desc": "Input of service Altitude Calculator Service."
    },
    {
      "name": "_LATITUDE",
      "type": "http://127.0.0.1/ontology/protont.owl#latitude",
      "desc": "Input of service Altitude Calculator Service."
    },
    {
      "name": "_LONGITUDE",
      "type": "http://127.0.0.1/ontology/protont.owl#longitude",
      "desc": "Input of service Altitude Calculator Service."
    }
  ],
  "name": "Altitude Calculator Service.",
  "description": "This service responds with the height above sea level at the given location (latitude and longitude pair). The returned height is in feet and meters. The parsed location is returned also, i.e. name of a city, place etc.Data is available covering all of mainland Europe and the United States of AmericaFor using this service valid UserID should be provided.",
  "domains": [
    {
      "name": "Geography",
      "url": "http://www.surf.scss.tcd.ie/cityOntology/#Geography"
    },
    {
      "name": "Travel",
      "url": "http://www.surf.scss.tcd.ie/cityOntology/#Travel"
    }
  ],
  "id": "travel/getAltitudeOfLocation",
  "state": true,
  "url": "http://surf.scss.tcd.ie/_provider_/travel/getAltitudeOfLocation"
}