{
  "outputs": [
    {
      "name": "EBook",
      "type": "http://127.0.0.1/ontology/books.owl#Book",
      "desc": "Output of service EBookOrder"
    }
  ],
  "capability": "atomic",
  "file": "EBookOrder1.owls",
  "provider": {
    "type": "webservice"
  },
  "inputs": [
    {
      "name": "EBookRequest",
      "type": "http://127.0.0.1/ontology/books.owl#Title",
      "desc": "Input of service EBookOrder"
    },
    {
      "name": "UserAccount",
      "type": "http://127.0.0.1/ontology/books.owl#User",
      "desc": "Input of service EBookOrder"
    }
  ],
  "name": "EBookOrder",
  "description": "An e-book order web service, where an ebook request is given by title and the required book is placed into the users shopping cart. The service also checks availability of the book in the stock and verifies user\u0027s account.",
  "domains": [
    {
      "name": "Entertainment_Products",
      "url": "http://www.surf.scss.tcd.ie/cityOntology/#Entertainment_Products"
    },
    {
      "name": "Educational",
      "url": "http://www.surf.scss.tcd.ie/cityOntology/#Educational"
    }
  ],
  "id": "books/EBookOrder1",
  "state": true,
  "url": "http://surf.scss.tcd.ie/_provider_/books/EBookOrder1"
}