{
  "outputs": [
    {
      "name": "_professor-in-academia",
      "type": "string",
      "desc": "Output of service HigherEducationalOrganizationProfessors"
    }
  ],
  "provider": {
    "type": "asp"
  },
  "inputs": [
    {
      "name": "_higher-educational-organization",
      "type": "string",
      "desc": "Input of service HigherEducationalOrganizationProfessors"
    }
  ],
  "name": "HigherEducationalOrganizationProfessors",
  "description": "This service returns professors of the given higher educational organization.",
  "domains": [
    {
      "name": "Touristic_Place",
      "url": "http://www.surf.scss.tcd.ie/cityOntology/#Touristic_Place"
    }
  ],
  "id": "educational/higher-educational-organization_professor-in-academia_service",
  "state": true,
  "url": "http://surf.scss.tcd.ie/_provider_/educational/higher-educational-organization_professor-in-academia_service"
}