{
  "outputs": [
    {
      "name": "_BROADCASTVIDEO",
      "type": "http://www.surf.scss.tcd.ie/IoTservices.owl#broadcastVideo",
      "desc": "Output of service broadcast_near_patrol"
    }
  ],
  "provider": {
    "type": "ws"
  },
  "inputs": [
    {
      "name": "_PLACEVIDEO",
      "type": "http://www.surf.scss.tcd.ie/IoTservices.owl#placeVideo",
      "desc": "Input of service broadcast_near_patrol"
    }
  ],
  "name": "broadcast_near_patrol",
  "description": "This is the service broadcast_near_patrol",
  "domains": [
    {
      "name": "Safety_and_Emergencies",
      "url": "http://www.surf.scss.tcd.ie/cityOntology/#Safety_and_Emergencies"
    }
  ],
  "id": "safetyandemergencies/27_broadcast_near_patrol",
  "state": true,
  "url": "http://surf.scss.tcd.ie/_provider_/safetyandemergencies/27_broadcast_near_patrol"
}