{
  "outputs": [
    {
      "name": "prisionersList",
      "type": "json"
    },
    {
      "name": "prisionZone",
      "type": "json"
    }
  ],
  "provider": {
    "type": "ws"
  },
  "inputs": [
    {
      "name": "prisionSurveillanceParameters",
      "type": "json"
    }
  ],
  "name": "prision_surveillance_configurator",
  "description": "This is the service prision_surveillance_configurator",
  "domains": [
    {
      "name": "Safety_and_Emergencies",
      "url": "http://www.surf.scss.tcd.ie/cityOntology/#Safety_and_Emergencies"
    }
  ],
  "id": "17/prision_surveillance_configurator",
  "state": true,
  "url": "http://surf.scss.tcd.ie/_provider_/prision_surveillance_configurator"
}