{
  "outputs": [
    {
      "name": "_PATIENTVIDEO",
      "type": "http://www.surf.scss.tcd.ie/IoTservices.owl#patientVideo",
      "desc": "Output of service patient_camera"
    }
  ],
  "provider": {
    "type": "wsdn"
  },
  "inputs": [
    {
      "name": "_PATIENTPROFILE",
      "type": "http://www.surf.scss.tcd.ie/IoTservices.owl#patientProfile",
      "desc": "Input of service patient_camera"
    }
  ],
  "name": "patient_camera",
  "description": "This is the service patient_camera",
  "domains": [
    {
      "name": "Health",
      "url": "http://www.surf.scss.tcd.ie/cityOntology/#Health"
    },
    {
      "name": "Safety_and_Emergencies",
      "url": "http://www.surf.scss.tcd.ie/cityOntology/#Safety_and_Emergencies"
    }
  ],
  "id": "health/90_patient_camera",
  "state": true,
  "url": "http://surf.scss.tcd.ie/_provider_/health/90_patient_camera"
}