{
  "outputs": [
    {
      "name": "_RECOMMENDEDPRICE",
      "type": "http://127.0.0.1/ontology/concept.owl#RecommendedPrice",
      "desc": "Output of service Auto 2PersonBicycle RecommendedPrice service"
    }
  ],
  "capability": "atomic",
  "file": "auto2personbicycle_recommendedprice_service.owls",
  "provider": {
    "type": "webservice"
  },
  "inputs": [
    {
      "name": "_2PERSONBICYCLE",
      "type": "http://127.0.0.1/ontology/my_ontology.owl#TwoPersonBicycle",
      "desc": "Input of service Auto 2PersonBicycle RecommendedPrice service"
    },
    {
      "name": "_AUTO",
      "type": "http://127.0.0.1/ontology/my_ontology.owl#Auto",
      "desc": "Input of service Auto 2PersonBicycle RecommendedPrice service"
    }
  ],
  "name": "Auto 2PersonBicycle RecommendedPrice service",
  "description": "This service returns recommended purchase price of the pair of a brand new auto modeland 2(two) person bicycle.",
  "domains": [
    {
      "name": "Vehicle_Sale_and_Rent",
      "url": "http://www.surf.scss.tcd.ie/cityOntology/#Vehicle_Sale_and_Rent"
    }
  ],
  "id": "vehicle/auto2personbicycle_recommendedprice_service",
  "state": true,
  "url": "http://surf.scss.tcd.ie/_provider_/vehicle/auto2personbicycle_recommendedprice_service"
}