{
  "outputs": [
    {
      "name": "_nationalpark",
      "type": "string",
      "desc": "Output of service SportsNationalParkService"
    }
  ],
  "provider": {
    "type": "wsdn"
  },
  "inputs": [
    {
      "name": "_sports",
      "type": "string",
      "desc": "Input of service SportsNationalParkService"
    }
  ],
  "name": "SportsNationalParkService",
  "description": "This is a recommended service to know aboutthe national park for the sports.",
  "domains": [
    {
      "name": "Technology",
      "url": "http://www.surf.scss.tcd.ie/cityOntology/#Technology"
    }
  ],
  "id": "tourism/sports_nationalpark_service",
  "state": true,
  "url": "http://surf.scss.tcd.ie/_provider_/tourism/sports_nationalpark_service"
}