{
  "outputs": [
    {
      "name": "_COLA",
      "type": "http://127.0.0.1/ontology/my_ontology.owl#Cola",
      "desc": "Output of service TaxFreeColaService"
    }
  ],
  "capability": "atomic",
  "file": "taxfreeprice_cola_service.owls",
  "provider": {
    "type": "asp"
  },
  "inputs": [
    {
      "name": "_TAXFREEPRICE",
      "type": "http://127.0.0.1/ontology/concept.owl#TaxFreePrice",
      "desc": "Input of service TaxFreeColaService"
    }
  ],
  "name": "TaxFreeColaService",
  "description": "It is an attracted service to return cola for a tax free price.",
  "domains": [
    {
      "name": "Food_and_Drinks",
      "url": "http://www.surf.scss.tcd.ie/cityOntology/#Food_and_Drinks"
    }
  ],
  "id": "food/taxfreeprice_cola_service",
  "state": true,
  "url": "http://surf.scss.tcd.ie/_provider_/food/taxfreeprice_cola_service"
}