{
  "outputs": [
    {
      "name": "_TAXEDPRICE",
      "type": "http://127.0.0.1/ontology/concept.owl#TaxedPrice",
      "desc": "Output of service EntranceFee Service"
    }
  ],
  "capability": "atomic",
  "file": "EntranceFee_service.owls",
  "provider": {
    "type": "webservice"
  },
  "inputs": [
    {
      "name": "_PERSON",
      "type": "http://127.0.0.1/ontology/books.owl#Person",
      "desc": "Input of service EntranceFee Service"
    }
  ],
  "name": "EntranceFee Service",
  "description": "This service return entrance fee inlcuding tax for a certain person. The price depends for each user.",
  "domains": [
    {
      "name": "Payment_and_Delivery",
      "url": "http://www.surf.scss.tcd.ie/cityOntology/#Payment_and_Delivery"
    }
  ],
  "id": "payment/person_taxedprice_service",
  "state": true,
  "url": "http://surf.scss.tcd.ie/_provider_/payment/person_taxedprice_service"
}