{
  "outputs": [
    {
      "name": "paymentInfo",
      "type": "xml"
    }
  ],
  "provider": {
    "type": "ws"
  },
  "inputs": [
    {
      "name": "purchaseOrder",
      "type": "json"
    }
  ],
  "name": "pay_order",
  "description": "This is the service pay_order",
  "domains": [
    {
      "name": "Payment_and_Delivery",
      "url": "http://www.surf.scss.tcd.ie/cityOntology/#Payment_and_Delivery"
    }
  ],
  "id": "135/pay_order",
  "state": true,
  "url": "http://surf.scss.tcd.ie/_provider_/pay_order"
}