{
  "outputs": [
    {
      "name": "_OCCUPATIONALTRADE",
      "type": "http://127.0.0.1/ontology/Mid-level-ontology.owl#OccupationalTrade",
      "desc": "Output of service Country OccupationalTrade service"
    }
  ],
  "capability": "atomic",
  "file": "country_occupationaltrade_service.owls",
  "provider": {
    "type": "asp"
  },
  "inputs": [
    {
      "name": "_COUNTRY",
      "type": "http://127.0.0.1/ontology/portal.owl#Country",
      "desc": "Input of service Country OccupationalTrade service"
    }
  ],
  "name": "Country OccupationalTrade service",
  "description": "This service returns available jobs in some occupationaltrade in a given country.",
  "domains": [
    {
      "name": "Educational",
      "url": "http://www.surf.scss.tcd.ie/cityOntology/#Educational"
    }
  ],
  "id": "education/country_occupationaltrade_service",
  "state": true,
  "url": "http://surf.scss.tcd.ie/_provider_/education/country_occupationaltrade_service"
}