{
  "outputs": [
    {
      "name": "_DESTINATION",
      "type": "http://127.0.0.1/ontology/travel.owl#Destination",
      "desc": "Output of service HikingOrganizationDestinationService"
    }
  ],
  "capability": "atomic",
  "file": "organizationhiking_destination_service.owls",
  "provider": {
    "type": "wsdn"
  },
  "inputs": [
    {
      "name": "_HIKING",
      "type": "http://127.0.0.1/ontology/travel.owl#Hiking",
      "desc": "Input of service HikingOrganizationDestinationService"
    },
    {
      "name": "_ORGANIZATION",
      "type": "http://127.0.0.1/ontology/portal.owl#Organization",
      "desc": "Input of service HikingOrganizationDestinationService"
    }
  ],
  "name": "HikingOrganizationDestinationService",
  "description": "This service returns destination of the organization responsible for hiking.",
  "domains": [
    {
      "name": "Travel",
      "url": "http://www.surf.scss.tcd.ie/cityOntology/#Travel"
    }
  ],
  "id": "travel/organizationhiking_destination_service",
  "state": true,
  "url": "http://surf.scss.tcd.ie/_provider_/travel/organizationhiking_destination_service"
}