{
  "outputs": [
    {
      "name": "_PRICE",
      "type": "http://127.0.0.1/ontology/concept.owl#Price",
      "desc": "Output of service SFNovelPrice Service"
    }
  ],
  "capability": "atomic",
  "file": "userscience-fiction-novel_price_service.owls",
  "provider": {
    "type": "webservice"
  },
  "inputs": [
    {
      "name": "_SCIENCE-FICTION-NOVEL",
      "type": "http://127.0.0.1/ontology/books.owl#Science-Fiction-Novel",
      "desc": "Input of service SFNovelPrice Service"
    },
    {
      "name": "_USER",
      "type": "http://127.0.0.1/ontology/books.owl#User",
      "desc": "Input of service SFNovelPrice Service"
    }
  ],
  "name": "SFNovelPrice Service",
  "description": "This service informs a certain premium user, who is authorized and logged-in for the monthly landing price of a given science-fiction novel.",
  "domains": [
    {
      "name": "Entertainment_Products",
      "url": "http://www.surf.scss.tcd.ie/cityOntology/#Entertainment_Products"
    },
    {
      "name": "Educational",
      "url": "http://www.surf.scss.tcd.ie/cityOntology/#Educational"
    }
  ],
  "id": "books/userscience-fiction-novel_price_service",
  "state": true,
  "url": "http://surf.scss.tcd.ie/_provider_/books/userscience-fiction-novel_price_service"
}