{
  "outputs": [
    {
      "name": "_price",
      "type": "string",
      "desc": "Output of service 1personbicyclecar_price_service"
    }
  ],
  "provider": {
    "type": "wsdn"
  },
  "inputs": [
    {
      "name": "_car",
      "type": "string",
      "desc": "Input of service 1personbicyclecar_price_service"
    },
    {
      "name": "_1personbicycle",
      "type": "string",
      "desc": "Input of service 1personbicyclecar_price_service"
    }
  ],
  "name": "1personbicyclecar_price_service",
  "description": "This service is about retail",
  "domains": [
    {
      "name": "Beauty_Products",
      "url": "http://www.surf.scss.tcd.ie/cityOntology/#Beauty_Products"
    }
  ],
  "id": "retail/1personbicyclecar_price_service",
  "state": true,
  "url": "http://surf.scss.tcd.ie/_provider_/retail/1personbicyclecar_price_service"
}