{
  "outputs": [
    {
      "name": "_publication-reference",
      "type": "string",
      "desc": "Output of service Researcher postal address and publication references service"
    },
    {
      "name": "_postal-address",
      "type": "string",
      "desc": "Output of service Researcher postal address and publication references service"
    }
  ],
  "provider": {
    "type": "asp"
  },
  "inputs": [
    {
      "name": "_researcher-in-academia",
      "type": "string",
      "desc": "Input of service Researcher postal address and publication references service"
    }
  ],
  "name": "Researcher postal address and publication references service",
  "description": "This service returns not only publication references of a researcher, but also its  postal address.",
  "domains": [
    {
      "name": "Logistic",
      "url": "http://www.surf.scss.tcd.ie/cityOntology/#Logistic"
    }
  ],
  "id": "educational/researcher-in-academia_publication-referencepostal-address_service",
  "state": true,
  "url": "http://surf.scss.tcd.ie/_provider_/educational/researcher-in-academia_publication-referencepostal-address_service"
}