{
  "outputs": [
    {
      "name": "_taxedprice",
      "type": "string",
      "desc": "Output of service BookPriceTaxedPriceService"
    },
    {
      "name": "_price",
      "type": "string",
      "desc": "Output of service BookPriceTaxedPriceService"
    }
  ],
  "provider": {
    "type": "webservice"
  },
  "inputs": [
    {
      "name": "_book",
      "type": "string",
      "desc": "Input of service BookPriceTaxedPriceService"
    }
  ],
  "name": "BookPriceTaxedPriceService",
  "description": "This service returns both price and taxed price of a book.",
  "domains": [
    {
      "name": "Health",
      "url": "http://www.surf.scss.tcd.ie/cityOntology/#Health"
    }
  ],
  "id": "retail/book_taxedpriceprice_service",
  "state": true,
  "url": "http://surf.scss.tcd.ie/_provider_/retail/book_taxedpriceprice_service"
}