{
  "outputs": [
    {
      "name": "_TAXFREEPRICE",
      "type": "http://127.0.0.1/ontology/concept.owl#TaxFreePrice",
      "desc": "Output of service Meat TaxFreePrice Quantity Service"
    },
    {
      "name": "_QUANTITY",
      "type": "http://127.0.0.1/ontology/support.owl#Quantity",
      "desc": "Output of service Meat TaxFreePrice Quantity Service"
    }
  ],
  "capability": "atomic",
  "file": "meat_taxfreepricequantity_service.owls",
  "provider": {
    "type": "asp"
  },
  "inputs": [
    {
      "name": "_MEAT",
      "type": "http://127.0.0.1/ontology/SUMO.owl#Meat",
      "desc": "Input of service Meat TaxFreePrice Quantity Service"
    }
  ],
  "name": "Meat TaxFreePrice Quantity Service",
  "description": "This services informs the tax free price and the quantity of a given meat item.",
  "domains": [
    {
      "name": "Food_and_Drinks",
      "url": "http://www.surf.scss.tcd.ie/cityOntology/#Food_and_Drinks"
    }
  ],
  "id": "food/meat_taxfreepricequantity_service",
  "state": true,
  "url": "http://surf.scss.tcd.ie/_provider_/food/meat_taxfreepricequantity_service"
}