{
    "capability": "atomic",
    "description": "This service returns skilled occupation job in a given country and its time measure (duration).",
    "domains": [
        {
            "name": "Industry",
            "url": "http://www.surf.scss.tcd.ie/cityOntology/#Industry"
        }
    ],
    "file": "country_skilledoccupationtimemeasure_service.owls",
    "id": "education/country_skilledoccupationtimemeasure_service",
    "inputs": [
        {
            "desc": "Input of service Country SkilledOccupation TimeMeasure service",
            "name": "_COUNTRY",
            "type": "http://127.0.0.1/ontology/portal.owl#Country"
        }
    ],
    "name": "Country SkilledOccupation TimeMeasure service",
    "outputs": [
        {
            "desc": "Output of service Country SkilledOccupation TimeMeasure service",
            "name": "_SKILLEDOCCUPATION",
            "type": "http://127.0.0.1/ontology/Mid-level-ontology.owl#SkilledOccupation"
        },
        {
            "desc": "Output of service Country SkilledOccupation TimeMeasure service",
            "name": "_TIMEMEASURE",
            "type": "http://127.0.0.1/ontology/SUMO.owl#TimeMeasure"
        }
    ],
    "provider": {
        "type": "webservice"
    },
    "state": true,
    "url": "http://surf.scss.tcd.ie/_provider_/education/country_skilledoccupationtimemeasure_service"
}