{
  "outputs": [
    {
      "name": "_LOCATION",
      "type": "http://127.0.0.1/ontology/protont.owl#Location",
      "desc": "Output of service Search Formatted Address service"
    },
    {
      "name": "_LATITUDE",
      "type": "http://127.0.0.1/ontology/protont.owl#latitude",
      "desc": "Output of service Search Formatted Address service"
    },
    {
      "name": "_LONGITUDE",
      "type": "http://127.0.0.1/ontology/protont.owl#longitude",
      "desc": "Output of service Search Formatted Address service"
    }
  ],
  "capability": "atomic",
  "file": "searchFormattedAddress.owls",
  "provider": {
    "type": "webservice"
  },
  "inputs": [
    {
      "name": "_LICENSEKEY",
      "type": "http://127.0.0.1/ontology/geographydataset.owl#Code",
      "desc": "Input of service Search Formatted Address service"
    },
    {
      "name": "_ADDRESS",
      "type": "http://127.0.0.1/ontology/protonu.owl#Address",
      "desc": "Input of service Search Formatted Address service"
    }
  ],
  "name": "Search Formatted Address service",
  "description": "Geocode a single formatted address record. In the input structure the user can designate the raw formatted address, with its city, country and postal code. It returns list of matching places (city, rural area, etc.) and their coordinates (latitude/longitude pair).This service works worldwide but results will be more accurate for the UK.For using this service valid License Key should be provided.",
  "domains": [
    {
      "name": "Geography",
      "url": "http://www.surf.scss.tcd.ie/cityOntology/#Geography"
    }
  ],
  "id": "geography/formatted_address_place_service",
  "state": true,
  "url": "http://surf.scss.tcd.ie/_provider_/geography/formatted_address_place_service"
}