{
  "outputs": [
    {
      "name": "_FUNDING",
      "type": "http://127.0.0.1/ontology/SUMO.owl#Funding",
      "desc": "Output of service NationalGovWeaponFundingService"
    }
  ],
  "capability": "atomic",
  "file": "nationalgovernmentweapon_funding_service.owls",
  "provider": {
    "type": "asp"
  },
  "inputs": [
    {
      "name": "_WEAPON",
      "type": "http://127.0.0.1/ontology/SUMO.owl#Weapon",
      "desc": "Input of service NationalGovWeaponFundingService"
    },
    {
      "name": "_NATIONALGOVERNMENT",
      "type": "http://127.0.0.1/ontology/Mid-level-ontology.owl#NationalGovernment",
      "desc": "Input of service NationalGovWeaponFundingService"
    }
  ],
  "name": "NationalGovWeaponFundingService",
  "description": "This service informs you funding for the weapons such like Missiles provided by the national government",
  "domains": [
    {
      "name": "Government_and_Planning",
      "url": "http://www.surf.scss.tcd.ie/cityOntology/#Government_and_Planning"
    }
  ],
  "id": "governmentandplanning/nationalgovernmentweapon_funding_service",
  "state": true,
  "url": "http://surf.scss.tcd.ie/_provider_/governmentandplanning/nationalgovernmentweapon_funding_service"
}