{
  "outputs": [
    {
      "name": "_ARROWFIGURE",
      "type": "http://127.0.0.1/ontology/Mid-level-ontology.owl#ArrowFigure",
      "desc": "Output of service RouteFinderService"
    }
  ],
  "capability": "atomic",
  "file": "locationlocation_arrowfigure_service.owls",
  "provider": {
    "type": "wsdn"
  },
  "inputs": [
    {
      "name": "_LOCATION1",
      "type": "http://127.0.0.1/ontology/portal.owl#Location",
      "desc": "Input of service RouteFinderService"
    },
    {
      "name": "_LOCATION2",
      "type": "http://127.0.0.1/ontology/portal.owl#Location",
      "desc": "Input of service RouteFinderService"
    }
  ],
  "name": "RouteFinderService",
  "description": "This service provides facility to find route from a location to the other location.",
  "domains": [
    {
      "name": "Travel",
      "url": "http://www.surf.scss.tcd.ie/cityOntology/#Travel"
    }
  ],
  "id": "travel/locationlocation_arrowfigure_service",
  "state": true,
  "url": "http://surf.scss.tcd.ie/_provider_/travel/locationlocation_arrowfigure_service"
}