{
  "outputs": [
    {
      "name": "_MAXPRICE",
      "type": "http://127.0.0.1/ontology/concept.owl#MaxPrice",
      "desc": "Output of service Auto Bicycle MaxPrice service"
    }
  ],
  "capability": "atomic",
  "file": "autocycle_maxprice_service.owls",
  "provider": {
    "type": "asp"
  },
  "inputs": [
    {
      "name": "_CYCLE",
      "type": "http://127.0.0.1/ontology/my_ontology.owl#Cycle",
      "desc": "Input of service Auto Bicycle MaxPrice service"
    },
    {
      "name": "_AUTO",
      "type": "http://127.0.0.1/ontology/my_ontology.owl#Auto",
      "desc": "Input of service Auto Bicycle MaxPrice service"
    }
  ],
  "name": "Auto Bicycle MaxPrice service",
  "description": "This service returns purchase maxprice of the given pair of an auto modeland a cycle model.",
  "domains": [
    {
      "name": "Vehicle_Sale_and_Rent",
      "url": "http://www.surf.scss.tcd.ie/cityOntology/#Vehicle_Sale_and_Rent"
    }
  ],
  "id": "vehicle/autocycle_maxprice_service",
  "state": true,
  "url": "http://surf.scss.tcd.ie/_provider_/vehicle/autocycle_maxprice_service"
}