{
    "description": "This is the service prisioner_monitoring",
    "domains": [
        {
            "name": "Safety_and_Emergencies",
            "url": "http://www.surf.scss.tcd.ie/cityOntology/#Safety_and_Emergencies"
        }
    ],
    "id": "safetyandemergencies/18_prisioner_monitoring",
    "inputs": [
        {
            "desc": "Input of service prisioner_monitoring",
            "name": "_PRISIONERSLIST",
            "type": "http://www.surf.scss.tcd.ie/IoTservices.owl#prisionersList"
        }
    ],
    "name": "prisioner_monitoring",
    "outputs": [
        {
            "desc": "Output of service prisioner_monitoring",
            "name": "_PRISIONERINFO",
            "type": "http://www.surf.scss.tcd.ie/IoTservices.owl#prisionerInfo"
        }
    ],
    "provider": {
        "type": "wsdn"
    },
    "state": true,
    "url": "http://surf.scss.tcd.ie/_provider_/safetyandemergencies/18_prisioner_monitoring"
}