{
  "outputs": [
    {
      "name": "_PREPAREDFOOD",
      "type": "http://127.0.0.1/ontology/Mid-level-ontology.owl#PreparedFood",
      "desc": "Output of service StorePFoodService"
    }
  ],
  "capability": "atomic",
  "file": "store_preparedfood_service.owls",
  "provider": {
    "type": "asp"
  },
  "inputs": [
    {
      "name": "_STORE",
      "type": "http://127.0.0.1/ontology/Mid-level-ontology.owl#Store",
      "desc": "Input of service StorePFoodService"
    }
  ],
  "name": "StorePFoodService",
  "description": "This service returns prepared food available in the certain store.",
  "domains": [
    {
      "name": "Food_and_Drinks",
      "url": "http://www.surf.scss.tcd.ie/cityOntology/#Food_and_Drinks"
    }
  ],
  "id": "food/store_preparedfood_service",
  "state": true,
  "url": "http://surf.scss.tcd.ie/_provider_/food/store_preparedfood_service"
}