{
  "outputs": [
    {
      "name": "_FUNDING",
      "type": "http://127.0.0.1/ontology/SUMO.owl#Funding",
      "desc": "Output of service GovernmentOrganization Missile Funding Range Service"
    },
    {
      "name": "_RANGE",
      "type": "http://127.0.0.1/ontology/extendedCamera.owl#Range",
      "desc": "Output of service GovernmentOrganization Missile Funding Range Service"
    }
  ],
  "capability": "atomic",
  "file": "missilegovernmentorganization_fundingrange_service.owls",
  "provider": {
    "type": "wsdn"
  },
  "inputs": [
    {
      "name": "_GOVERNMENTORGANIZATION",
      "type": "http://127.0.0.1/ontology/SUMO.owl#GovernmentOrganization",
      "desc": "Input of service GovernmentOrganization Missile Funding Range Service"
    },
    {
      "name": "_MISSILE",
      "type": "http://127.0.0.1/ontology/Mid-level-ontology.owl#Missile",
      "desc": "Input of service GovernmentOrganization Missile Funding Range Service"
    }
  ],
  "name": "GovernmentOrganization Missile Funding Range Service",
  "description": "This service informs you funding for the Missile provided by the government organization, and target range of the missile.",
  "domains": [
    {
      "name": "Government_and_Planning",
      "url": "http://www.surf.scss.tcd.ie/cityOntology/#Government_and_Planning"
    }
  ],
  "id": "weapon/missilegovernmentorganization_fundingrange_service",
  "state": true,
  "url": "http://surf.scss.tcd.ie/_provider_/weapon/missilegovernmentorganization_fundingrange_service"
}