{
  "outputs": [
    {
      "name": "_HOTEL",
      "type": "http://127.0.0.1/ontology/travel.owl#Hotel",
      "desc": "Output of service CityHotelInfoService"
    }
  ],
  "capability": "atomic",
  "file": "city_hotel_service.owls",
  "provider": {
    "type": "wsdn"
  },
  "inputs": [
    {
      "name": "_CITY",
      "type": "http://127.0.0.1/ontology/portal.owl#City",
      "desc": "Input of service CityHotelInfoService"
    }
  ],
  "name": "CityHotelInfoService",
  "description": "This service returns information of available hotels of a given city.",
  "domains": [
    {
      "name": "Travel",
      "url": "http://www.surf.scss.tcd.ie/cityOntology/#Travel"
    },
    {
      "name": "Accommodation",
      "url": "http://www.surf.scss.tcd.ie/cityOntology/#Accommodation"
    }
  ],
  "id": "accommodation/city_hotel_service",
  "state": true,
  "url": "http://surf.scss.tcd.ie/_provider_/accommodation/city_hotel_service"
}