{
  "outputs": [
    {
      "name": "_destination",
      "type": "string",
      "desc": "Output of service Always SurfingDestinationService"
    }
  ],
  "provider": {
    "type": "webservice"
  },
  "inputs": [
    {
      "name": "_surfing",
      "type": "string",
      "desc": "Input of service Always SurfingDestinationService"
    }
  ],
  "name": "Always SurfingDestinationService",
  "description": "Always use this service to know about the destination for surfing.",
  "domains": [
    {
      "name": "Government_and_Planning",
      "url": "http://www.surf.scss.tcd.ie/cityOntology/#Government_and_Planning"
    }
  ],
  "id": "tourism/surfing_destination_service",
  "state": true,
  "url": "http://surf.scss.tcd.ie/_provider_/tourism/surfing_destination_service"
}