{
  "outputs": [
    {
      "name": "_RECOMMENDEDPRICEINEURO",
      "type": "http://127.0.0.1/ontology/concept.owl#RecommendedPriceInEuro",
      "desc": "Output of service RecommendedPriceService"
    }
  ],
  "capability": "atomic",
  "file": "monograph_recommendedpriceineuro_service.owls",
  "provider": {
    "type": "asp"
  },
  "inputs": [
    {
      "name": "_MONOGRAPH",
      "type": "http://127.0.0.1/ontology/books.owl#Monograph",
      "desc": "Input of service RecommendedPriceService"
    }
  ],
  "name": "RecommendedPriceService",
  "description": "This is a competitor web service to return recommended price of a monograph in Euro.",
  "domains": [
    {
      "name": "Entertainment_Products",
      "url": "http://www.surf.scss.tcd.ie/cityOntology/#Entertainment_Products"
    },
    {
      "name": "Educational",
      "url": "http://www.surf.scss.tcd.ie/cityOntology/#Educational"
    }
  ],
  "id": "books/monograph_recommendedpriceineuro_service",
  "state": true,
  "url": "http://surf.scss.tcd.ie/_provider_/books/monograph_recommendedpriceineuro_service"
}