{
  "outputs": [
    {
      "name": "_HOTEL",
      "type": "http://127.0.0.1/ontology/travel.owl#Hotel",
      "desc": "Output of service GeographicalRegionHotelService"
    }
  ],
  "capability": "atomic",
  "file": "geographical-region_hotel_service.owls",
  "provider": {
    "type": "asp"
  },
  "inputs": [
    {
      "name": "_GEOGRAPHICAL-REGION",
      "type": "http://127.0.0.1/ontology/portal.owl#Geographical-Region",
      "desc": "Input of service GeographicalRegionHotelService"
    }
  ],
  "name": "GeographicalRegionHotelService",
  "description": "This service is the recommended service to know about the available hotelsin a geographical region.",
  "domains": [
    {
      "name": "Travel",
      "url": "http://www.surf.scss.tcd.ie/cityOntology/#Travel"
    },
    {
      "name": "Accommodation",
      "url": "http://www.surf.scss.tcd.ie/cityOntology/#Accommodation"
    }
  ],
  "id": "accommodation/geographical-region_hotel_service",
  "state": true,
  "url": "http://surf.scss.tcd.ie/_provider_/accommodation/geographical-region_hotel_service"
}