{
    "capability": "atomic",
    "description": "This service returns author and recommended price of a given science fiction book title.",
    "domains": [
        {
            "name": "Research_and_Science",
            "url": "http://www.surf.scss.tcd.ie/cityOntology/#Research_and_Science"
        }
    ],
    "file": "sciencefictionbook_authorrecommendedprice_service.owls",
    "id": "books/sciencefictionbook_authorrecommendedprice_service",
    "inputs": [
        {
            "desc": "Input of service ScienceFictionBook Author RecommendedPrice Service",
            "name": "_SCIENCEFICTIONBOOK",
            "type": "http://127.0.0.1/ontology/books.owl#ScienceFictionBook"
        }
    ],
    "name": "ScienceFictionBook Author RecommendedPrice Service",
    "outputs": [
        {
            "desc": "Output of service ScienceFictionBook Author RecommendedPrice Service",
            "name": "_AUTHOR",
            "type": "http://127.0.0.1/ontology/books.owl#Author"
        },
        {
            "desc": "Output of service ScienceFictionBook Author RecommendedPrice Service",
            "name": "_RECOMMENDEDPRICE",
            "type": "http://127.0.0.1/ontology/concept.owl#RecommendedPrice"
        }
    ],
    "provider": {
        "type": "wsdn"
    },
    "state": true,
    "url": "http://surf.scss.tcd.ie/_provider_/books/sciencefictionbook_authorrecommendedprice_service"
}