{
  "outputs": [
    {
      "name": "_LIGHTNING",
      "type": "http://127.0.0.1/ontology/Mid-level-ontology.owl#Lightning",
      "desc": "Output of service Municipal-Unity Lightning Service"
    }
  ],
  "capability": "atomic",
  "file": "municipal-unit_lightning_service.owls",
  "provider": {
    "type": "webservice"
  },
  "inputs": [
    {
      "name": "_MUNICIPAL-UNIT",
      "type": "http://127.0.0.1/ontology/portal.owl#Municipal-Unit",
      "desc": "Input of service Municipal-Unity Lightning Service"
    }
  ],
  "name": "Municipal-Unity Lightning Service",
  "description": "This service informs about lightning in a given municipal-unit.",
  "domains": [
    {
      "name": "Travel",
      "url": "http://www.surf.scss.tcd.ie/cityOntology/#Travel"
    }
  ],
  "id": "travel/municipal-unit_lightning_service",
  "state": true,
  "url": "http://surf.scss.tcd.ie/_provider_/travel/municipal-unit_lightning_service"
}