{
  "outputs": [
    {
      "name": "_PACKAGESTATUS",
      "type": "http://www.surf.scss.tcd.ie/IoTservices.owl#packageStatus",
      "desc": "Output of service package_monitoring"
    }
  ],
  "provider": {
    "type": "asp"
  },
  "inputs": [
    {
      "name": "_ACTIVATETRACKING",
      "type": "http://www.surf.scss.tcd.ie/IoTservices.owl#activateTracking",
      "desc": "Input of service package_monitoring"
    }
  ],
  "name": "package_monitoring",
  "description": "This is the service package_monitoring",
  "domains": [
    {
      "name": "Logistic",
      "url": "http://www.surf.scss.tcd.ie/cityOntology/#Logistic"
    },
    {
      "name": "Communications",
      "url": "http://www.surf.scss.tcd.ie/cityOntology/#Communications"
    }
  ],
  "id": "logistic/99_package_monitoring",
  "state": true,
  "url": "http://surf.scss.tcd.ie/_provider_/logistic/99_package_monitoring"
}