{
    "capability": "atomic",
    "description": "This service returns list of towns which have awesome places for given sightseeing type.",
    "domains": [
        {
            "name": "Activity",
            "url": "http://www.surf.scss.tcd.ie/cityOntology/#Activity"
        }
    ],
    "file": "sightseeing_town_service.owls",
    "id": "travel/sightseeing_town_service",
    "inputs": [
        {
            "desc": "Input of service Sightseeing Town Service",
            "name": "_SIGHTSEEING",
            "type": "http://127.0.0.1/ontology/travel.owl#Sightseeing"
        }
    ],
    "name": "Sightseeing Town Service",
    "outputs": [
        {
            "desc": "Output of service Sightseeing Town Service",
            "name": "_TOWN",
            "type": "http://127.0.0.1/ontology/travel.owl#Town"
        }
    ],
    "provider": {
        "type": "asp"
    },
    "state": true,
    "url": "http://surf.scss.tcd.ie/_provider_/travel/sightseeing_town_service"
}