{
  "outputs": [
    {
      "name": "_DIAGNOSTICPROCESS",
      "type": "http://127.0.0.1/ontology/SUMO.owl#DiagnosticProcess",
      "desc": "Output of service DiagnosticProcessAvailability"
    }
  ],
  "capability": "atomic",
  "file": "questionhospital_diagnosticprocess_service.owls",
  "provider": {
    "type": "wsdn"
  },
  "inputs": [
    {
      "name": "_HOSPITAL",
      "type": "http://127.0.0.1/ontology/Mid-level-ontology.owl#Hospital",
      "desc": "Input of service DiagnosticProcessAvailability"
    },
    {
      "name": "_QUESTION",
      "type": "http://127.0.0.1/ontology/Mid-level-ontology.owl#Question",
      "desc": "Input of service DiagnosticProcessAvailability"
    }
  ],
  "name": "DiagnosticProcessAvailability",
  "description": "This service returns certain type diagnostic process available in the certain hospital,if the other input is given then then the output should fulfills requirements of the user question.",
  "domains": [
    {
      "name": "Health",
      "url": "http://www.surf.scss.tcd.ie/cityOntology/#Health"
    }
  ],
  "id": "medical/questionhospital_diagnosticprocess_service",
  "state": true,
  "url": "http://surf.scss.tcd.ie/_provider_/medical/questionhospital_diagnosticprocess_service"
}