{
  "outputs": [
    {
      "name": "_RECOMMENDEDPRICE",
      "type": "http://127.0.0.1/ontology/concept.owl#RecommendedPrice",
      "desc": "Output of service BookRecommendedPriceService"
    }
  ],
  "capability": "atomic",
  "file": "book_recommendedprice_RegisteredUserservice.owls",
  "provider": {
    "type": "webservice"
  },
  "inputs": [
    {
      "name": "_BOOK",
      "type": "http://127.0.0.1/ontology/books.owl#Book",
      "desc": "Input of service BookRecommendedPriceService"
    }
  ],
  "name": "BookRecommendedPriceService",
  "description": "This service can be used by only an authorized user, it returns the bestrecommended price of a book.",
  "domains": [
    {
      "name": "Entertainment_Products",
      "url": "http://www.surf.scss.tcd.ie/cityOntology/#Entertainment_Products"
    },
    {
      "name": "Educational",
      "url": "http://www.surf.scss.tcd.ie/cityOntology/#Educational"
    }
  ],
  "id": "books/book_recommendedprice_RegisteredUserservice",
  "state": true,
  "url": "http://surf.scss.tcd.ie/_provider_/books/book_recommendedprice_RegisteredUserservice"
}