{
  "outputs": [
    {
      "name": "_COMPANY",
      "type": "http://127.0.0.1/ontology/finance_th_web.owl#company",
      "desc": "Output of service Country Company OccupationalTrade Service"
    },
    {
      "name": "_OCCUPATIONALTRADE",
      "type": "http://127.0.0.1/ontology/Mid-level-ontology.owl#OccupationalTrade",
      "desc": "Output of service Country Company OccupationalTrade Service"
    }
  ],
  "capability": "atomic",
  "file": "country_companyoccupationaltrade_service.owls",
  "provider": {
    "type": "webservice"
  },
  "inputs": [
    {
      "name": "_COUNTRY",
      "type": "http://127.0.0.1/ontology/portal.owl#Country",
      "desc": "Input of service Country Company OccupationalTrade Service"
    }
  ],
  "name": "Country Company OccupationalTrade Service",
  "description": "This service finds occupational trade positions in a given country and also returns company who offers that job.",
  "domains": [
    {
      "name": "Industry",
      "url": "http://www.surf.scss.tcd.ie/cityOntology/#Industry"
    }
  ],
  "id": "industry/country_companyoccupationaltrade_service",
  "state": true,
  "url": "http://surf.scss.tcd.ie/_provider_/industry/country_companyoccupationaltrade_service"
}