{
  "outputs": [
    {
      "name": "_DROUGHT",
      "type": "http://127.0.0.1/ontology/Mid-level-ontology.owl#Drought",
      "desc": "Output of service Geopolitica-Entity Drought Service"
    }
  ],
  "capability": "atomic",
  "file": "geopolitical-entity_drought_service.owls",
  "provider": {
    "type": "asp"
  },
  "inputs": [
    {
      "name": "_GEOPOLITICAL-ENTITY",
      "type": "http://127.0.0.1/ontology/portal.owl#Geopolitical-Entity",
      "desc": "Input of service Geopolitica-Entity Drought Service"
    }
  ],
  "name": "Geopolitica-Entity Drought Service",
  "description": "This service informs about droughts of a given geopolitical entity.",
  "domains": [
    {
      "name": "Travel",
      "url": "http://www.surf.scss.tcd.ie/cityOntology/#Travel"
    },
    {
      "name": "Geography",
      "url": "http://www.surf.scss.tcd.ie/cityOntology/#Geography"
    }
  ],
  "id": "travel/geopolitical-entity_drought_service",
  "state": true,
  "url": "http://surf.scss.tcd.ie/_provider_/travel/geopolitical-entity_drought_service"
}