{
  "outputs": [
    {
      "name": "_BREADORBISCUIT",
      "type": "http://127.0.0.1/ontology/Mid-level-ontology.owl#BreadOrBiscuit",
      "desc": "Output of service GroceryStore BreadOrBiscuit Quantity Service"
    },
    {
      "name": "_QUANTITY",
      "type": "http://127.0.0.1/ontology/support.owl#Quantity",
      "desc": "Output of service GroceryStore BreadOrBiscuit Quantity Service"
    }
  ],
  "capability": "atomic",
  "file": "grocerystore_breadorbiscuitquantity_service.owls",
  "provider": {
    "type": "asp"
  },
  "inputs": [
    {
      "name": "_GROCERYSTORE",
      "type": "http://127.0.0.1/ontology/Mid-level-ontology.owl#GroceryStore",
      "desc": "Input of service GroceryStore BreadOrBiscuit Quantity Service"
    }
  ],
  "name": "GroceryStore BreadOrBiscuit Quantity Service",
  "description": "This service informs about bread or biscuit items that are available in a given grocery store and their available quantity.",
  "domains": [
    {
      "name": "Food_and_Drinks",
      "url": "http://www.surf.scss.tcd.ie/cityOntology/#Food_and_Drinks"
    }
  ],
  "id": "food/grocerystore_breadorbiscuitquantity_service",
  "state": true,
  "url": "http://surf.scss.tcd.ie/_provider_/food/grocerystore_breadorbiscuitquantity_service"
}