{
  "outputs": [
    {
      "name": "_LATITUDE",
      "type": "http://127.0.0.1/ontology/protont.owl#latitude",
      "desc": "Output of service Nearby Wikipedia Articles Finder Service."
    },
    {
      "name": "_LONGITUDE",
      "type": "http://127.0.0.1/ontology/protont.owl#longitude",
      "desc": "Output of service Nearby Wikipedia Articles Finder Service."
    },
    {
      "name": "_DISTANCE",
      "type": "http://127.0.0.1/ontology/geographydataset.owl#GeographicDistance",
      "desc": "Output of service Nearby Wikipedia Articles Finder Service."
    },
    {
      "name": "_WIKIPEDIA-ARTICLE",
      "type": "http://127.0.0.1/ontology/books.owl#Article",
      "desc": "Output of service Nearby Wikipedia Articles Finder Service."
    }
  ],
  "capability": "atomic",
  "file": "findNearbyWikipediaArticles.owls",
  "provider": {
    "type": "webservice"
  },
  "inputs": [
    {
      "name": "_LICENSEKEY",
      "type": "http://127.0.0.1/ontology/geographydataset.owl#Code",
      "desc": "Input of service Nearby Wikipedia Articles Finder Service."
    },
    {
      "name": "_RADIUS",
      "type": "http://127.0.0.1/ontology/geographydataset.owl#GeographicDistanceKilometerLengthUnit",
      "desc": "Input of service Nearby Wikipedia Articles Finder Service."
    },
    {
      "name": "_MAX-RESULTS",
      "type": "http://127.0.0.1/ontology/protont.owl#Number",
      "desc": "Input of service Nearby Wikipedia Articles Finder Service."
    },
    {
      "name": "_LANGUAGE",
      "type": "http://127.0.0.1/ontology/protont.owl#Language",
      "desc": "Input of service Nearby Wikipedia Articles Finder Service."
    },
    {
      "name": "_POSTALCODE",
      "type": "http://127.0.0.1/ontology/geographydataset.owl#PostalCode",
      "desc": "Input of service Nearby Wikipedia Articles Finder Service."
    },
    {
      "name": "_COUNTRYCODE",
      "type": "http://127.0.0.1/ontology/geographydataset.owl#ISOCountryCode",
      "desc": "Input of service Nearby Wikipedia Articles Finder Service."
    }
  ],
  "name": "Nearby Wikipedia Articles Finder Service.",
  "description": "This service returns Wikipedia articles and their locations localized close to the given location (identified by a country and a postal code) in a distance of a given radius.The maximum number of returned results is also specified by the user.For using this service valid License Key should be provided.",
  "domains": [
    {
      "name": "Geography",
      "url": "http://www.surf.scss.tcd.ie/cityOntology/#Geography"
    },
    {
      "name": "Travel",
      "url": "http://www.surf.scss.tcd.ie/cityOntology/#Travel"
    }
  ],
  "id": "travel/findNearbyWikipediaArticles",
  "state": true,
  "url": "http://surf.scss.tcd.ie/_provider_/travel/findNearbyWikipediaArticles"
}