{
  "outputs": [
    {
      "name": "_WEATHERPROCESS",
      "type": "http://127.0.0.1/ontology/SUMO.owl#WeatherProcess",
      "desc": "Output of service Municipal-Unit WeatherProcess Service"
    }
  ],
  "capability": "atomic",
  "file": "municipal-unit_weatherprocess_service.owls",
  "provider": {
    "type": "wsdn"
  },
  "inputs": [
    {
      "name": "_MUNICIPAL-UNIT",
      "type": "http://127.0.0.1/ontology/portal.owl#Municipal-Unit",
      "desc": "Input of service Municipal-Unit WeatherProcess Service"
    }
  ],
  "name": "Municipal-Unit WeatherProcess Service",
  "description": "This service informs about weatherprocess in a given municipal-unit.",
  "domains": [
    {
      "name": "Travel",
      "url": "http://www.surf.scss.tcd.ie/cityOntology/#Travel"
    },
    {
      "name": "Weather",
      "url": "http://www.surf.scss.tcd.ie/cityOntology/#Weather"
    }
  ],
  "id": "weather/municipal-unit_weatherprocess_service",
  "state": true,
  "url": "http://surf.scss.tcd.ie/_provider_/weather/municipal-unit_weatherprocess_service"
}