{
  "outputs": [
    {
      "name": "_FILM",
      "type": "http://127.0.0.1/ontology/my_ontology.owl#Film",
      "desc": "Output of service Film finder service"
    }
  ],
  "capability": "atomic",
  "file": "title_film_service.owls",
  "provider": {
    "type": "webservice"
  },
  "inputs": [
    {
      "name": "_TITLE",
      "type": "http://127.0.0.1/ontology/books.owl#Title",
      "desc": "Input of service Film finder service"
    }
  ],
  "name": "Film finder service",
  "description": "One can discover a film title that is matching given title by using this service.",
  "domains": [
    {
      "name": "Communications",
      "url": "http://www.surf.scss.tcd.ie/cityOntology/#Communications"
    }
  ],
  "id": "communication/title_film_service",
  "state": true,
  "url": "http://surf.scss.tcd.ie/_provider_/communication/title_film_service"
}