{
  "outputs": [
    {
      "name": "_PRICE",
      "type": "http://127.0.0.1/ontology/concept.owl#Price",
      "desc": "Output of service Beverage Price Quantity Service"
    },
    {
      "name": "_QUANTITY",
      "type": "http://127.0.0.1/ontology/support.owl#Quantity",
      "desc": "Output of service Beverage Price Quantity Service"
    }
  ],
  "capability": "atomic",
  "file": "beverage_pricequantity_Aldiservice.owls",
  "provider": {
    "type": "webservice"
  },
  "inputs": [
    {
      "name": "_BEVERAGE",
      "type": "http://127.0.0.1/ontology/SUMO.owl#Beverage",
      "desc": "Input of service Beverage Price Quantity Service"
    }
  ],
  "name": "Beverage Price Quantity Service",
  "description": "This services informs the latest purchase market price and the quantity of a given beverage item.",
  "domains": [
    {
      "name": "Educational",
      "url": "http://www.surf.scss.tcd.ie/cityOntology/#Educational"
    }
  ],
  "id": "education/beverage_pricequantity_service",
  "state": true,
  "url": "http://surf.scss.tcd.ie/_provider_/education/beverage_pricequantity_service"
}