{
  "outputs": [
    {
      "name": "careersInfo",
      "type": "xml"
    }
  ],
  "provider": {
    "type": "ws"
  },
  "inputs": [
    {
      "name": "studentReport",
      "type": "json"
    }
  ],
  "name": "career_pathway_discovery",
  "description": "This is the service career_pathway_discovery",
  "domains": [
    {
      "name": "Educational",
      "url": "http://www.surf.scss.tcd.ie/cityOntology/#Educational"
    }
  ],
  "id": "111/career_pathway_discovery",
  "state": true,
  "url": "http://surf.scss.tcd.ie/_provider_/career_pathway_discovery"
}