{
  "outputs": [
    {
      "name": "_LENDING",
      "type": "http://127.0.0.1/ontology/SUMO.owl#Lending",
      "desc": "Output of service GermanGovernment Degree Lending Duration Service"
    },
    {
      "name": "_DURATION",
      "type": "http://127.0.0.1/ontology/support.owl#Duration",
      "desc": "Output of service GermanGovernment Degree Lending Duration Service"
    }
  ],
  "capability": "atomic",
  "file": "degree_lendingduration_GermanGovservice.owls",
  "provider": {
    "type": "webservice"
  },
  "inputs": [
    {
      "name": "_DEGREE",
      "type": "http://127.0.0.1/ontology/portal.owl#Degree",
      "desc": "Input of service GermanGovernment Degree Lending Duration Service"
    }
  ],
  "name": "GermanGovernment Degree Lending Duration Service",
  "description": "This service informs about lending offered for the degree by the german government. The lending\u0027s duration is informed as well.",
  "domains": [
    {
      "name": "Educational",
      "url": "http://www.surf.scss.tcd.ie/cityOntology/#Educational"
    },
    {
      "name": "Government_and_Planning",
      "url": "http://www.surf.scss.tcd.ie/cityOntology/#Government_and_Planning"
    }
  ],
  "id": "education/degree_lendingduration_GermanGovservice",
  "state": true,
  "url": "http://surf.scss.tcd.ie/_provider_/education/degree_lendingduration_GermanGovservice"
}