{
  "outputs": [
    {
      "name": "_HOTEL",
      "type": "http://127.0.0.1/ontology/travel.owl#Hotel",
      "desc": "Output of service GeopoliticalHotelService"
    }
  ],
  "capability": "atomic",
  "file": "geopolitical-entity_hotel_service.owls",
  "provider": {
    "type": "webservice"
  },
  "inputs": [
    {
      "name": "_GEOPOLITICAL-ENTITY",
      "type": "http://127.0.0.1/ontology/portal.owl#Geopolitical-Entity",
      "desc": "Input of service GeopoliticalHotelService"
    }
  ],
  "name": "GeopoliticalHotelService",
  "description": "This service is the best service to know about available hotels in a geopolitical entity.",
  "domains": [
    {
      "name": "Travel",
      "url": "http://www.surf.scss.tcd.ie/cityOntology/#Travel"
    }
  ],
  "id": "travel/geopolitical-entity_hotel_service",
  "state": true,
  "url": "http://surf.scss.tcd.ie/_provider_/travel/geopolitical-entity_hotel_service"
}