{
  "outputs": [
    {
      "name": "_weathersystem",
      "type": "string",
      "desc": "Output of service Country WeatherSystem Service"
    }
  ],
  "provider": {
    "type": "webservice"
  },
  "inputs": [
    {
      "name": "_country",
      "type": "string",
      "desc": "Input of service Country WeatherSystem Service"
    }
  ],
  "name": "Country WeatherSystem Service",
  "description": "This service informs about weathersystem in a given country.",
  "domains": [
    {
      "name": "Buildings",
      "url": "http://www.surf.scss.tcd.ie/cityOntology/#Buildings"
    }
  ],
  "id": "environmental/country_weathersystem_service",
  "state": true,
  "url": "http://surf.scss.tcd.ie/_provider_/environmental/country_weathersystem_service"
}