{
  "outputs": [
    {
      "name": "_DIAGNOSTICPROCESS",
      "type": "http://127.0.0.1/ontology/SUMO.owl#DiagnosticProcess",
      "desc": "Output of service DPA service"
    },
    {
      "name": "_COST",
      "type": "http://127.0.0.1/ontology/finance_th_web.owl#cost",
      "desc": "Output of service DPA service"
    }
  ],
  "capability": "atomic",
  "file": "hospital_diagnosticprocesscost_service.owls",
  "provider": {
    "type": "wsdn"
  },
  "inputs": [
    {
      "name": "_HOSPITAL",
      "type": "http://127.0.0.1/ontology/Mid-level-ontology.owl#Hospital",
      "desc": "Input of service DPA service"
    }
  ],
  "name": "DPA service",
  "description": "DPA service returns certain type diagnostic process availablein the certain given hospital, and its cost also.",
  "domains": [
    {
      "name": "Health",
      "url": "http://www.surf.scss.tcd.ie/cityOntology/#Health"
    }
  ],
  "id": "medical/hospital_diagnosticprocesscost_service",
  "state": true,
  "url": "http://surf.scss.tcd.ie/_provider_/medical/hospital_diagnosticprocesscost_service"
}