{
  "outputs": [
    {
      "name": "_COMPANY",
      "type": "http://127.0.0.1/ontology/finance_th_web.owl#company",
      "desc": "Output of service Country Company Profession Service"
    },
    {
      "name": "_PROFESSION",
      "type": "http://127.0.0.1/ontology/Mid-level-ontology.owl#Profession",
      "desc": "Output of service Country Company Profession Service"
    }
  ],
  "capability": "atomic",
  "file": "country_companyprofession_service.owls",
  "provider": {
    "type": "asp"
  },
  "inputs": [
    {
      "name": "_COUNTRY",
      "type": "http://127.0.0.1/ontology/portal.owl#Country",
      "desc": "Input of service Country Company Profession Service"
    }
  ],
  "name": "Country Company Profession Service",
  "description": "This service finds profession positions in a given country and also returns company who offers that job.",
  "domains": [
    {
      "name": "Industry",
      "url": "http://www.surf.scss.tcd.ie/cityOntology/#Industry"
    }
  ],
  "id": "industry/country_companyprofession_service",
  "state": true,
  "url": "http://surf.scss.tcd.ie/_provider_/industry/country_companyprofession_service"
}