{
  "outputs": [
    {
      "name": "_SUNSET",
      "type": "http://127.0.0.1/ontology/geographydataset.owl#Sunset",
      "desc": "Output of service Sunrise and Sunset Time Calcutator Service."
    },
    {
      "name": "_SUNRISE",
      "type": "http://127.0.0.1/ontology/geographydataset.owl#Sunrise",
      "desc": "Output of service Sunrise and Sunset Time Calcutator Service."
    }
  ],
  "capability": "atomic",
  "file": "getSunsetSunriseTimeOfLocation.owls",
  "provider": {
    "type": "asp"
  },
  "inputs": [
    {
      "name": "_LICENSEKEY",
      "type": "http://127.0.0.1/ontology/geographydataset.owl#Code",
      "desc": "Input of service Sunrise and Sunset Time Calcutator Service."
    },
    {
      "name": "_DATE",
      "type": "http://127.0.0.1/ontology/protonu.owl#Date",
      "desc": "Input of service Sunrise and Sunset Time Calcutator Service."
    },
    {
      "name": "_LATITUDE",
      "type": "http://127.0.0.1/ontology/protont.owl#latitude",
      "desc": "Input of service Sunrise and Sunset Time Calcutator Service."
    },
    {
      "name": "_LONGITUDE",
      "type": "http://127.0.0.1/ontology/protont.owl#longitude",
      "desc": "Input of service Sunrise and Sunset Time Calcutator Service."
    }
  ],
  "name": "Sunrise and Sunset Time Calcutator Service.",
  "description": "This is a service able to provide the time of sunrise and sunset for a given location (latitude/longitude pair) and a given date.For using this service valid License Key should be provided.",
  "domains": [
    {
      "name": "Geography",
      "url": "http://www.surf.scss.tcd.ie/cityOntology/#Geography"
    },
    {
      "name": "Travel",
      "url": "http://www.surf.scss.tcd.ie/cityOntology/#Travel"
    }
  ],
  "id": "travel/getSunsetSunriseTimeOfLocation",
  "state": true,
  "url": "http://surf.scss.tcd.ie/_provider_/travel/getSunsetSunriseTimeOfLocation"
}