{
  "outputs": [
    {
      "name": "_BIOPSY",
      "type": "http://127.0.0.1/ontology/Mid-level-ontology.owl#Biopsy",
      "desc": "Output of service MedicalClinic Biopsy Availability"
    }
  ],
  "capability": "atomic",
  "file": "medicalclinic_biopsy_service.owls",
  "provider": {
    "type": "webservice"
  },
  "inputs": [
    {
      "name": "_MEDICALCLINIC",
      "type": "http://127.0.0.1/ontology/Mid-level-ontology.owl#MedicalClinic",
      "desc": "Input of service MedicalClinic Biopsy Availability"
    }
  ],
  "name": "MedicalClinic Biopsy Availability",
  "description": "This service returns certain type biopsy available in the certain given medical clinic.",
  "domains": [
    {
      "name": "Health",
      "url": "http://www.surf.scss.tcd.ie/cityOntology/#Health"
    }
  ],
  "id": "medical/medicalclinic_biopsy_service",
  "state": true,
  "url": "http://surf.scss.tcd.ie/_provider_/medical/medicalclinic_biopsy_service"
}