{
  "outputs": [
    {
      "name": "_BOOKACCOMMODATION",
      "type": "http://www.surf.scss.tcd.ie/IoTservices.owl#bookAccommodation",
      "desc": "Output of service book_accommodation"
    }
  ],
  "provider": {
    "type": "asp"
  },
  "inputs": [
    {
      "name": "_ACCOMMODATIONCONFIRMATION",
      "type": "http://www.surf.scss.tcd.ie/IoTservices.owl#accommodationConfirmation",
      "desc": "Input of service book_accommodation"
    }
  ],
  "name": "book_accommodation",
  "description": "This is the service book_accommodation",
  "domains": [
    {
      "name": "Accommodation",
      "url": "http://www.surf.scss.tcd.ie/cityOntology/#Accommodation"
    }
  ],
  "id": "accommodation/86_book_accommodation",
  "state": true,
  "url": "http://surf.scss.tcd.ie/_provider_/accommodation/86_book_accommodation"
}