{
  "outputs": [
    {
      "name": "_BUILDINGSTATUS",
      "type": "http://www.surf.scss.tcd.ie/IoTservices.owl#buildingStatus",
      "desc": "Output of service building_status"
    }
  ],
  "provider": {
    "type": "wsdn"
  },
  "inputs": [
    {
      "name": "_BUILDINGINFO",
      "type": "http://www.surf.scss.tcd.ie/IoTservices.owl#buildingInfo",
      "desc": "Input of service building_status"
    }
  ],
  "name": "building_status",
  "description": "This is the service building_status",
  "domains": [
    {
      "name": "Safety_and_Emergencies",
      "url": "http://www.surf.scss.tcd.ie/cityOntology/#Safety_and_Emergencies"
    },
    {
      "name": "Buildings",
      "url": "http://www.surf.scss.tcd.ie/cityOntology/#Buildings"
    }
  ],
  "id": "buildings/37_building_status",
  "state": true,
  "url": "http://surf.scss.tcd.ie/_provider_/buildings/37_building_status"
}