{
    "description": "This is the service atm_camera_service",
    "domains": [
        {
            "name": "Finance",
            "url": "http://www.surf.scss.tcd.ie/cityOntology/#Finance"
        }
    ],
    "id": "finance/115_atm_camera_service",
    "inputs": [
        {
            "desc": "Input of service atm_camera_service",
            "name": "_ATMID",
            "type": "http://www.surf.scss.tcd.ie/IoTservices.owl#atmId"
        }
    ],
    "name": "atm_camera_service",
    "outputs": [
        {
            "desc": "Output of service atm_camera_service",
            "name": "_ATMVIDEO",
            "type": "http://www.surf.scss.tcd.ie/IoTservices.owl#atmVideo"
        }
    ],
    "provider": {
        "type": "wsdn"
    },
    "state": true,
    "url": "http://surf.scss.tcd.ie/_provider_/finance/115_atm_camera_service"
}