{
  "outputs": [
    {
      "name": "_price",
      "type": "string",
      "desc": "Output of service Expensive car price service"
    }
  ],
  "provider": {
    "type": "webservice"
  },
  "inputs": [
    {
      "name": "_expensivecar",
      "type": "string",
      "desc": "Input of service Expensive car price service"
    }
  ],
  "name": "Expensive car price service",
  "description": "An interested service to provide charm price of an expensive car.",
  "domains": [
    {
      "name": "Transport_and_Mobility",
      "url": "http://www.surf.scss.tcd.ie/cityOntology/#Transport_and_Mobility"
    }
  ],
  "id": "retail/expensivecar_price_service",
  "state": true,
  "url": "http://surf.scss.tcd.ie/_provider_/retail/expensivecar_price_service"
}