{
  "outputs": [
    {
      "name": "_HOTEL",
      "type": "http://127.0.0.1/ontology/travel.owl#Hotel",
      "desc": "Output of service HotelInfoService"
    }
  ],
  "capability": "atomic",
  "file": "citycountry_hotel_service.owls",
  "provider": {
    "type": "wsdn"
  },
  "inputs": [
    {
      "name": "_COUNTRY",
      "type": "http://127.0.0.1/ontology/portal.owl#Country",
      "desc": "Input of service HotelInfoService"
    },
    {
      "name": "_CITY",
      "type": "http://127.0.0.1/ontology/portal.owl#City",
      "desc": "Input of service HotelInfoService"
    }
  ],
  "name": "HotelInfoService",
  "description": "This service returns names of available hotels in a city, where city and country are given by the user.The city must be located in the given country.",
  "domains": [
    {
      "name": "Travel",
      "url": "http://www.surf.scss.tcd.ie/cityOntology/#Travel"
    },
    {
      "name": "Accommodation",
      "url": "http://www.surf.scss.tcd.ie/cityOntology/#Accommodation"
    }
  ],
  "id": "accommodation/citycountry_hotel_service",
  "state": true,
  "url": "http://surf.scss.tcd.ie/_provider_/accommodation/citycountry_hotel_service"
}