{
  "outputs": [
    {
      "name": "_MAXPRICE",
      "type": "http://127.0.0.1/ontology/concept.owl#MaxPrice",
      "desc": "Output of service Meat MaxPrice Physical-Quantity Service"
    },
    {
      "name": "_PHYSICAL-QUANTITY",
      "type": "http://127.0.0.1/ontology/support.owl#Physical-Quantity",
      "desc": "Output of service Meat MaxPrice Physical-Quantity Service"
    }
  ],
  "capability": "atomic",
  "file": "meat_maxpricephysical-quantity_service.owls",
  "provider": {
    "type": "wsdn"
  },
  "inputs": [
    {
      "name": "_MEAT",
      "type": "http://127.0.0.1/ontology/SUMO.owl#Meat",
      "desc": "Input of service Meat MaxPrice Physical-Quantity Service"
    }
  ],
  "name": "Meat MaxPrice Physical-Quantity Service",
  "description": "This service informs the physical-quantity and maximum price of a given meat item.",
  "domains": [
    {
      "name": "Educational",
      "url": "http://www.surf.scss.tcd.ie/cityOntology/#Educational"
    },
    {
      "name": "Food_and_Drinks",
      "url": "http://www.surf.scss.tcd.ie/cityOntology/#Food_and_Drinks"
    }
  ],
  "id": "food/meat_maxpricephysical-quantity_service",
  "state": true,
  "url": "http://surf.scss.tcd.ie/_provider_/food/meat_maxpricephysical-quantity_service"
}