{
  "outputs": [
    {
      "name": "_AUTHOR",
      "type": "http://127.0.0.1/ontology/books.owl#Author",
      "desc": "Output of service Science-Fiction-Novel Author TaxedPrice Service"
    },
    {
      "name": "_TAXEDPRICE",
      "type": "http://127.0.0.1/ontology/concept.owl#TaxedPrice",
      "desc": "Output of service Science-Fiction-Novel Author TaxedPrice Service"
    }
  ],
  "capability": "atomic",
  "file": "science-fiction-novel_authortaxedprice_service.owls",
  "provider": {
    "type": "webservice"
  },
  "inputs": [
    {
      "name": "_SCIENCE-FICTION-NOVEL",
      "type": "http://127.0.0.1/ontology/books.owl#Science-Fiction-Novel",
      "desc": "Input of service Science-Fiction-Novel Author TaxedPrice Service"
    }
  ],
  "name": "Science-Fiction-Novel Author TaxedPrice Service",
  "description": "This service returns author and taxed price of a given science fiction novel.",
  "domains": [
    {
      "name": "Entertainment_Products",
      "url": "http://www.surf.scss.tcd.ie/cityOntology/#Entertainment_Products"
    }
  ],
  "id": "books/science-fiction-novel_authortaxedprice_service",
  "state": true,
  "url": "http://surf.scss.tcd.ie/_provider_/books/science-fiction-novel_authortaxedprice_service"
}