{
  "outputs": [
    {
      "name": "_senior-lecturer-in-academia",
      "type": "string",
      "desc": "Output of service UniversityLecturerService"
    }
  ],
  "provider": {
    "type": "wsdn"
  },
  "inputs": [
    {
      "name": "_university",
      "type": "string",
      "desc": "Input of service UniversityLecturerService"
    }
  ],
  "name": "UniversityLecturerService",
  "description": "This service returns senior lecturer of a university.",
  "domains": [
    {
      "name": "Sports_Equipment",
      "url": "http://www.surf.scss.tcd.ie/cityOntology/#Sports_Equipment"
    }
  ],
  "id": "educational/university_senior-lecturer-in-academia_service",
  "state": true,
  "url": "http://surf.scss.tcd.ie/_provider_/educational/university_senior-lecturer-in-academia_service"
}