{
    "capability": "atomic",
    "description": "This service returns the best destinations for given hiking type.",
    "domains": [
        {
            "name": "Activity",
            "url": "http://www.surf.scss.tcd.ie/cityOntology/#Activity"
        }
    ],
    "file": "hiking_destination_service.owls",
    "id": "travel/hiking_destination_service",
    "inputs": [
        {
            "desc": "Input of service HikingDestinationService",
            "name": "_HIKING",
            "type": "http://127.0.0.1/ontology/travel.owl#Hiking"
        }
    ],
    "name": "HikingDestinationService",
    "outputs": [
        {
            "desc": "Output of service HikingDestinationService",
            "name": "_DESTINATION",
            "type": "http://127.0.0.1/ontology/travel.owl#Destination"
        }
    ],
    "provider": {
        "type": "webservice"
    },
    "state": true,
    "url": "http://surf.scss.tcd.ie/_provider_/travel/hiking_destination_service"
}