{
  "outputs": [
    {
      "name": "_BIKEAVAILABILITY",
      "type": "http://www.surf.scss.tcd.ie/IoTservices.owl#bikeAvailability",
      "desc": "Output of service bike_availability"
    }
  ],
  "provider": {
    "type": "wsdn"
  },
  "inputs": [
    {
      "name": "_ROUTEPARAMETERS",
      "type": "http://www.surf.scss.tcd.ie/IoTservices.owl#routeParameters",
      "desc": "Input of service bike_availability"
    }
  ],
  "name": "bike_availability",
  "description": "This is the service bike_availability",
  "domains": [
    {
      "name": "Transport_and_Mobility",
      "url": "http://www.surf.scss.tcd.ie/cityOntology/#Transport_and_Mobility"
    }
  ],
  "id": "transportandmobility/7_bike_availability",
  "state": true,
  "url": "http://surf.scss.tcd.ie/_provider_/transportandmobility/7_bike_availability"
}