{
    "capability": "atomic",
    "description": "This service returns the funding for the given missile type and other weapons possessed by the given government.",
    "domains": [
        {
            "name": "Government_and_Planning",
            "url": "http://www.surf.scss.tcd.ie/cityOntology/#Government_and_Planning"
        }
    ],
    "file": "governmentmissileweapon_funding_service.owls",
    "id": "weapon/governmentmissileweapon_funding_service",
    "inputs": [
        {
            "desc": "Input of service GovMissilesAndWeaponsFundingService",
            "name": "_WEAPON",
            "type": "http://127.0.0.1/ontology/SUMO.owl#Weapon"
        },
        {
            "desc": "Input of service GovMissilesAndWeaponsFundingService",
            "name": "_MISSILE",
            "type": "http://127.0.0.1/ontology/Mid-level-ontology.owl#Missile"
        },
        {
            "desc": "Input of service GovMissilesAndWeaponsFundingService",
            "name": "_GOVERNMENT",
            "type": "http://127.0.0.1/ontology/SUMO.owl#Government"
        }
    ],
    "name": "GovMissilesAndWeaponsFundingService",
    "outputs": [
        {
            "desc": "Output of service GovMissilesAndWeaponsFundingService",
            "name": "_FUNDING",
            "type": "http://127.0.0.1/ontology/SUMO.owl#Funding"
        }
    ],
    "provider": {
        "type": "wsdn"
    },
    "state": true,
    "url": "http://surf.scss.tcd.ie/_provider_/weapon/governmentmissileweapon_funding_service"
}