{
  "outputs": [
    {
      "name": "_COMPACT",
      "type": "http://127.0.0.1/ontology/extendedCamera.owl#Compact",
      "desc": "Output of service ShoppingMall Compact Price service"
    },
    {
      "name": "_PRICE",
      "type": "http://127.0.0.1/ontology/concept.owl#Price",
      "desc": "Output of service ShoppingMall Compact Price service"
    }
  ],
  "capability": "atomic",
  "file": "shoppingmall_compactprice_service.owls",
  "provider": {
    "type": "asp"
  },
  "inputs": [
    {
      "name": "_SHOPPINGMALL",
      "type": "http://127.0.0.1/ontology/Mid-level-ontology.owl#ShoppingMall",
      "desc": "Input of service ShoppingMall Compact Price service"
    }
  ],
  "name": "ShoppingMall Compact Price service",
  "description": "This service informs you the price for a compact camera available in a given shoppingmall.",
  "domains": [
    {
      "name": "Technology",
      "url": "http://www.surf.scss.tcd.ie/cityOntology/#Technology"
    }
  ],
  "id": "technology/shoppingmall_compactprice_service",
  "state": true,
  "url": "http://surf.scss.tcd.ie/_provider_/technology/shoppingmall_compactprice_service"
}