{
  "outputs": [
    {
      "name": "_WEATHERSEASON",
      "type": "http://127.0.0.1/ontology/Mid-level-ontology.owl#WeatherSeason",
      "desc": "Output of service Country WeatherSeason Service"
    }
  ],
  "capability": "atomic",
  "file": "country_weatherseason_service.owls",
  "provider": {
    "type": "asp"
  },
  "inputs": [
    {
      "name": "_COUNTRY",
      "type": "http://127.0.0.1/ontology/portal.owl#Country",
      "desc": "Input of service Country WeatherSeason Service"
    }
  ],
  "name": "Country WeatherSeason Service",
  "description": "This service informs about current weatherseason in a given country.",
  "domains": [
    {
      "name": "Travel",
      "url": "http://www.surf.scss.tcd.ie/cityOntology/#Travel"
    },
    {
      "name": "Weather",
      "url": "http://www.surf.scss.tcd.ie/cityOntology/#Weather"
    }
  ],
  "id": "weather/country_weatherseason_service",
  "state": true,
  "url": "http://surf.scss.tcd.ie/_provider_/weather/country_weatherseason_service"
}