{
  "outputs": [
    {
      "name": "_SKILLEDOCCUPATION",
      "type": "http://127.0.0.1/ontology/Mid-level-ontology.owl#SkilledOccupation",
      "desc": "Output of service SkilledPositionsService"
    }
  ],
  "capability": "atomic",
  "file": "citycountry_skilledoccupation_service.owls",
  "provider": {
    "type": "asp"
  },
  "inputs": [
    {
      "name": "_COUNTRY",
      "type": "http://127.0.0.1/ontology/portal.owl#Country",
      "desc": "Input of service SkilledPositionsService"
    },
    {
      "name": "_CITY",
      "type": "http://127.0.0.1/ontology/SUMO.owl#City",
      "desc": "Input of service SkilledPositionsService"
    }
  ],
  "name": "SkilledPositionsService",
  "description": "If you are interest to know about available skilled position in a certain country and city, then use this service.If the city input is not given then the output is a job in the whole country.",
  "domains": [
    {
      "name": "Educational",
      "url": "http://www.surf.scss.tcd.ie/cityOntology/#Educational"
    }
  ],
  "id": "education/citycountry_skilledoccupation_service",
  "state": true,
  "url": "http://surf.scss.tcd.ie/_provider_/education/citycountry_skilledoccupation_service"
}