{
  "outputs": [
    {
      "name": "_CITY",
      "type": "http://127.0.0.1/ontology/travel.owl#City",
      "desc": "Output of service Sightseeing City Service"
    }
  ],
  "capability": "atomic",
  "file": "sightseeing_city_service.owls",
  "provider": {
    "type": "asp"
  },
  "inputs": [
    {
      "name": "_SIGHTSEEING",
      "type": "http://127.0.0.1/ontology/travel.owl#Sightseeing",
      "desc": "Input of service Sightseeing City Service"
    }
  ],
  "name": "Sightseeing City Service",
  "description": "This service returns list of cities which have good places for given sightseeing type.",
  "domains": [
    {
      "name": "Travel",
      "url": "http://www.surf.scss.tcd.ie/cityOntology/#Travel"
    },
    {
      "name": "Activity",
      "url": "http://www.surf.scss.tcd.ie/cityOntology/#Activity"
    }
  ],
  "id": "activity/sightseeing_city_service",
  "state": true,
  "url": "http://surf.scss.tcd.ie/_provider_/activity/sightseeing_city_service"
}