{
  "outputs": [
    {
      "name": "_town",
      "type": "string",
      "desc": "Output of service Activity Town Service"
    }
  ],
  "provider": {
    "type": "asp"
  },
  "inputs": [
    {
      "name": "_activity",
      "type": "string",
      "desc": "Input of service Activity Town Service"
    }
  ],
  "name": "Activity Town Service",
  "description": "This service returns town for a given activity.",
  "domains": [
    {
      "name": "Finance",
      "url": "http://www.surf.scss.tcd.ie/cityOntology/#Finance"
    }
  ],
  "id": "tourism/activity_town_service",
  "state": true,
  "url": "http://surf.scss.tcd.ie/_provider_/tourism/activity_town_service"
}