{
  "outputs": [
    {
      "name": "_PATROLDASHBOARD",
      "type": "http://www.surf.scss.tcd.ie/IoTservices.owl#patrolDashboard",
      "desc": "Output of service patrol_dashboard"
    }
  ],
  "provider": {
    "type": "asp"
  },
  "inputs": [
    {
      "name": "_BROADCASTVIDEO",
      "type": "http://www.surf.scss.tcd.ie/IoTservices.owl#broadcastVideo",
      "desc": "Input of service patrol_dashboard"
    }
  ],
  "name": "patrol_dashboard",
  "description": "This is the service patrol_dashboard",
  "domains": [
    {
      "name": "Safety_and_Emergencies",
      "url": "http://www.surf.scss.tcd.ie/cityOntology/#Safety_and_Emergencies"
    }
  ],
  "id": "safetyandemergencies/28_patrol_dashboard",
  "state": true,
  "url": "http://surf.scss.tcd.ie/_provider_/safetyandemergencies/28_patrol_dashboard"
}