{
  "outputs": [
    {
      "name": "_weathersystem",
      "type": "string",
      "desc": "Output of service GEWeatherSystemService"
    }
  ],
  "provider": {
    "type": "wsdn"
  },
  "inputs": [
    {
      "name": "_geopolitical-entity",
      "type": "string",
      "desc": "Input of service GEWeatherSystemService"
    }
  ],
  "name": "GEWeatherSystemService",
  "description": "This service returns the weather condition, large-scale atmospheric processesthat influence weather in a given region for 2-5 days.",
  "domains": [
    {
      "name": "Pharmacy_Products",
      "url": "http://www.surf.scss.tcd.ie/cityOntology/#Pharmacy_Products"
    }
  ],
  "id": "environmental/geopolitical-entity_weathersystem_service",
  "state": true,
  "url": "http://surf.scss.tcd.ie/_provider_/environmental/geopolitical-entity_weathersystem_service"
}