{
  "outputs": [
    {
      "name": "_MATCHED-LOCATION",
      "type": "http://127.0.0.1/ontology/protont.owl#Location",
      "desc": "Output of service Gazetteer location finder service."
    },
    {
      "name": "_MAP",
      "type": "http://127.0.0.1/ontology/geographydataset.owl#Map",
      "desc": "Output of service Gazetteer location finder service."
    },
    {
      "name": "_LATITUDE",
      "type": "http://127.0.0.1/ontology/protont.owl#latitude",
      "desc": "Output of service Gazetteer location finder service."
    },
    {
      "name": "_LONGITUDE",
      "type": "http://127.0.0.1/ontology/protont.owl#longitude",
      "desc": "Output of service Gazetteer location finder service."
    }
  ],
  "capability": "atomic",
  "file": "gazetteerLookupLocation.owls",
  "provider": {
    "type": "wsdn"
  },
  "inputs": [
    {
      "name": "_LOCATION-QUERY",
      "type": "http://127.0.0.1/ontology/protont.owl#Location",
      "desc": "Input of service Gazetteer location finder service."
    },
    {
      "name": "_IMAGE-WIDTH",
      "type": "http://127.0.0.1/ontology/ontosem.owl#width",
      "desc": "Input of service Gazetteer location finder service."
    },
    {
      "name": "_IMAGE-HEIGHT",
      "type": "http://127.0.0.1/ontology/ontosem.owl#height",
      "desc": "Input of service Gazetteer location finder service."
    }
  ],
  "name": "Gazetteer location finder service.",
  "description": "This service is a simple gazetteer lookup. Gives a list of location names which match the query parameter including all the available information about the locations (their geographic coordinates). It returns also a map with the locations.",
  "domains": [
    {
      "name": "Geography",
      "url": "http://www.surf.scss.tcd.ie/cityOntology/#Geography"
    }
  ],
  "id": "geography/gazetteer_location_service",
  "state": true,
  "url": "http://surf.scss.tcd.ie/_provider_/geography/gazetteer_location_service"
}