{
  "outputs": [
    {
      "name": "_VIDEOMEDIA",
      "type": "http://127.0.0.1/ontology/my_ontology.owl#VideoMedia",
      "desc": "Output of service videoMedia finder service"
    },
    {
      "name": "_RECOMMENDEDPRICE",
      "type": "http://127.0.0.1/ontology/concept.owl#RecommendedPrice",
      "desc": "Output of service videoMedia finder service"
    }
  ],
  "capability": "atomic",
  "file": "title_videomediarecommendedprice_service.owls",
  "provider": {
    "type": "asp"
  },
  "inputs": [
    {
      "name": "_TITLE",
      "type": "http://127.0.0.1/ontology/books.owl#Title",
      "desc": "Input of service videoMedia finder service"
    }
  ],
  "name": "videoMedia finder service",
  "description": "This service is a helpful service to find an available video media with itsrecommended price.",
  "domains": [
    {
      "name": "Communications",
      "url": "http://www.surf.scss.tcd.ie/cityOntology/#Communications"
    }
  ],
  "id": "communication/title_videomediarecommendedprice_service",
  "state": true,
  "url": "http://surf.scss.tcd.ie/_provider_/communication/title_videomediarecommendedprice_service"
}