{
  "outputs": [
    {
      "name": "_hotel",
      "type": "string",
      "desc": "Output of service VillageHotelService"
    }
  ],
  "provider": {
    "type": "wsdn"
  },
  "inputs": [
    {
      "name": "_village",
      "type": "string",
      "desc": "Input of service VillageHotelService"
    }
  ],
  "name": "VillageHotelService",
  "description": "This service is used to know about a hotel of a given village.",
  "domains": [
    {
      "name": "Clothing",
      "url": "http://www.surf.scss.tcd.ie/cityOntology/#Clothing"
    }
  ],
  "id": "tourism/village_hotel_service",
  "state": true,
  "url": "http://surf.scss.tcd.ie/_provider_/tourism/village_hotel_service"
}