{
  "outputs": [
    {
      "name": "_DESTINATION",
      "type": "http://127.0.0.1/ontology/travel.owl#Destination",
      "desc": "Output of service Activity Destination Service"
    }
  ],
  "capability": "atomic",
  "file": "activity_destination_service.owls",
  "provider": {
    "type": "wsdn"
  },
  "inputs": [
    {
      "name": "_ACTIVITY",
      "type": "http://127.0.0.1/ontology/travel.owl#Activity",
      "desc": "Input of service Activity Destination Service"
    }
  ],
  "name": "Activity Destination Service",
  "description": "This service returns destinations which provide given activity.",
  "domains": [
    {
      "name": "Travel",
      "url": "http://www.surf.scss.tcd.ie/cityOntology/#Travel"
    }
  ],
  "id": "travel/activity_destination_service",
  "state": true,
  "url": "http://surf.scss.tcd.ie/_provider_/travel/activity_destination_service"
}