{
  "outputs": [
    {
      "name": "_SUMMARY",
      "type": "http://127.0.0.1/ontology/SUMO.owl#Summary",
      "desc": "Output of service HDP service"
    },
    {
      "name": "_DIAGNOSTICPROCESS",
      "type": "http://127.0.0.1/ontology/SUMO.owl#DiagnosticProcess",
      "desc": "Output of service HDP service"
    }
  ],
  "capability": "atomic",
  "file": "HDP_service.owls",
  "provider": {
    "type": "webservice"
  },
  "inputs": [
    {
      "name": "_HOSPITAL",
      "type": "http://127.0.0.1/ontology/Mid-level-ontology.owl#Hospital",
      "desc": "Input of service HDP service"
    }
  ],
  "name": "HDP service",
  "description": "HDP is a reknown service to get to know about a certain diagnostic system available in a certainhospital, this service returns also summary of the output system.",
  "domains": [
    {
      "name": "Health",
      "url": "http://www.surf.scss.tcd.ie/cityOntology/#Health"
    }
  ],
  "id": "medical/hospital_summarydiagnosticprocess_service",
  "state": true,
  "url": "http://surf.scss.tcd.ie/_provider_/medical/hospital_summarydiagnosticprocess_service"
}