{
  "outputs": [
    {
      "name": "_RECOMMENDEDPRICEINDOLLAR",
      "type": "http://127.0.0.1/ontology/concept.owl#RecommendedPriceInDollar",
      "desc": "Output of service MAK service"
    }
  ],
  "capability": "atomic",
  "file": "MAK_service.owls",
  "provider": {
    "type": "asp"
  },
  "inputs": [
    {
      "name": "_PREPAREDFOOD",
      "type": "http://127.0.0.1/ontology/Mid-level-ontology.owl#PreparedFood",
      "desc": "Input of service MAK service"
    }
  ],
  "name": "MAK service",
  "description": "MAK service returns recommended latest price in dollars of a given prepared food item on the food market.",
  "domains": [
    {
      "name": "Food_and_Drinks",
      "url": "http://www.surf.scss.tcd.ie/cityOntology/#Food_and_Drinks"
    }
  ],
  "id": "food/preparedfood_recommendedpriceindollar_service",
  "state": true,
  "url": "http://surf.scss.tcd.ie/_provider_/food/preparedfood_recommendedpriceindollar_service"
}