{
  "outputs": [
    {
      "name": "_book",
      "type": "string",
      "desc": "Output of service BookFinderService"
    }
  ],
  "provider": {
    "type": "wsdn"
  },
  "inputs": [
    {
      "name": "_publication-number",
      "type": "string",
      "desc": "Input of service BookFinderService"
    }
  ],
  "name": "BookFinderService",
  "description": "This service finds a book on its publication number.",
  "domains": [
    {
      "name": "Construction",
      "url": "http://www.surf.scss.tcd.ie/cityOntology/#Construction"
    }
  ],
  "id": "educational/publication-number_book_service",
  "state": true,
  "url": "http://surf.scss.tcd.ie/_provider_/educational/publication-number_book_service"
}