{
  "outputs": [
    {
      "name": "_luxuryhotel",
      "type": "string",
      "desc": "Output of service GelLuxuryHotelInfoService"
    }
  ],
  "provider": {
    "type": "webservice"
  },
  "inputs": [
    {
      "name": "_city",
      "type": "string",
      "desc": "Input of service GelLuxuryHotelInfoService"
    },
    {
      "name": "_country",
      "type": "string",
      "desc": "Input of service GelLuxuryHotelInfoService"
    }
  ],
  "name": "GelLuxuryHotelInfoService",
  "description": "Gel is a wellknown name in hotels, and provide a service to know about  the luxury hotelof the city of the country.",
  "domains": [
    {
      "name": "Energy",
      "url": "http://www.surf.scss.tcd.ie/cityOntology/#Energy"
    }
  ],
  "id": "tourism/countrycity_luxuryhotel_service",
  "state": true,
  "url": "http://surf.scss.tcd.ie/_provider_/tourism/countrycity_luxuryhotel_service"
}