{
  "outputs": [
    {
      "name": "_SCHOLARSHIP",
      "type": "http://127.0.0.1/ontology/Mid-level-ontology.owl#Scholarship",
      "desc": "Output of service GovernmentAwardScholarshipService"
    }
  ],
  "capability": "atomic",
  "file": "governmentaward_scholarship_service.owls",
  "provider": {
    "type": "asp"
  },
  "inputs": [
    {
      "name": "_AWARD",
      "type": "http://127.0.0.1/ontology/portal.owl#Award",
      "desc": "Input of service GovernmentAwardScholarshipService"
    },
    {
      "name": "_GOVERNMENT",
      "type": "http://127.0.0.1/ontology/SUMO.owl#Government",
      "desc": "Input of service GovernmentAwardScholarshipService"
    }
  ],
  "name": "GovernmentAwardScholarshipService",
  "description": "It is an attractive service to know about the scholarship offered for a given award by the given government.",
  "domains": [
    {
      "name": "Educational",
      "url": "http://www.surf.scss.tcd.ie/cityOntology/#Educational"
    },
    {
      "name": "Government_and_Planning",
      "url": "http://www.surf.scss.tcd.ie/cityOntology/#Government_and_Planning"
    }
  ],
  "id": "education/governmentaward_scholarship_service",
  "state": true,
  "url": "http://surf.scss.tcd.ie/_provider_/education/governmentaward_scholarship_service"
}