{
  "outputs": [
    {
      "name": "_PRICE",
      "type": "http://127.0.0.1/ontology/concept.owl#Price",
      "desc": "Output of service Vehicle price service"
    }
  ],
  "capability": "atomic",
  "file": "vehicle_price_service.owls",
  "provider": {
    "type": "wsdn"
  },
  "inputs": [
    {
      "name": "_VEHICLE",
      "type": "http://127.0.0.1/ontology/SUMO.owl#Vehicle",
      "desc": "Input of service Vehicle price service"
    }
  ],
  "name": "Vehicle price service",
  "description": "This service is used to get prices of a given vehicle model (the prices include both new or used vehicles).",
  "domains": [
    {
      "name": "Vehicle_Sale_and_Rent",
      "url": "http://www.surf.scss.tcd.ie/cityOntology/#Vehicle_Sale_and_Rent"
    }
  ],
  "id": "vehicle/vehicle_price_service",
  "state": true,
  "url": "http://surf.scss.tcd.ie/_provider_/vehicle/vehicle_price_service"
}