{
    "capability": "atomic",
    "description": "This service returns current purchase price of a given science fiction book for a authorized user. The price is differnet for each user.",
    "domains": [
        {
            "name": "Research_and_Science",
            "url": "http://www.surf.scss.tcd.ie/cityOntology/#Research_and_Science"
        }
    ],
    "file": "sciencefictionbookuser_price_service.owls",
    "id": "books/sciencefictionbookuser_price_service",
    "inputs": [
        {
            "desc": "Input of service ScienceFictionBook Price Service",
            "name": "_USER",
            "type": "http://127.0.0.1/ontology/books.owl#User"
        },
        {
            "desc": "Input of service ScienceFictionBook Price Service",
            "name": "_SCIENCEFICTIONBOOK",
            "type": "http://127.0.0.1/ontology/books.owl#ScienceFictionBook"
        }
    ],
    "name": "ScienceFictionBook Price Service",
    "outputs": [
        {
            "desc": "Output of service ScienceFictionBook Price Service",
            "name": "_PRICE",
            "type": "http://127.0.0.1/ontology/concept.owl#Price"
        }
    ],
    "provider": {
        "type": "webservice"
    },
    "state": true,
    "url": "http://surf.scss.tcd.ie/_provider_/books/sciencefictionbookuser_price_service"
}