{
  "outputs": [
    {
      "name": "_DROUGHT",
      "type": "http://127.0.0.1/ontology/Mid-level-ontology.owl#Drought",
      "desc": "Output of service Country Drought Service"
    }
  ],
  "capability": "atomic",
  "file": "country_drought_service.owls",
  "provider": {
    "type": "wsdn"
  },
  "inputs": [
    {
      "name": "_COUNTRY",
      "type": "http://127.0.0.1/ontology/portal.owl#Country",
      "desc": "Input of service Country Drought Service"
    }
  ],
  "name": "Country Drought Service",
  "description": "This service informs about drought in a given country.",
  "domains": [
    {
      "name": "Travel",
      "url": "http://www.surf.scss.tcd.ie/cityOntology/#Travel"
    },
    {
      "name": "Geography",
      "url": "http://www.surf.scss.tcd.ie/cityOntology/#Geography"
    }
  ],
  "id": "travel/country_drought_service",
  "state": true,
  "url": "http://surf.scss.tcd.ie/_provider_/travel/country_drought_service"
}