{
  "outputs": [
    {
      "name": "_YEAR",
      "type": "http://127.0.0.1/ontology/SUMO.owl#Year",
      "desc": "Output of service car price service"
    },
    {
      "name": "_PRICE",
      "type": "http://127.0.0.1/ontology/concept.owl#Price",
      "desc": "Output of service car price service"
    }
  ],
  "capability": "atomic",
  "file": "auto_yearprice_service.owls",
  "provider": {
    "type": "wsdn"
  },
  "inputs": [
    {
      "name": "_AUTO",
      "type": "http://127.0.0.1/ontology/my_ontology.owl#Auto",
      "desc": "Input of service car price service"
    }
  ],
  "name": "car price service",
  "description": "Some ones are interested to know price and its year of production of an given auto model,this service is a nice service to fulfill the requirements.",
  "domains": [
    {
      "name": "Vehicle_Sale_and_Rent",
      "url": "http://www.surf.scss.tcd.ie/cityOntology/#Vehicle_Sale_and_Rent"
    }
  ],
  "id": "vehicle/auto_yearprice_service",
  "state": true,
  "url": "http://surf.scss.tcd.ie/_provider_/vehicle/auto_yearprice_service"
}