{
  "outputs": [
    {
      "name": "_AUTHOR",
      "type": "http://127.0.0.1/ontology/books.owl#Author",
      "desc": "Output of service RomanticNovel Author Book-Type Service"
    },
    {
      "name": "_BOOK-TYPE",
      "type": "http://127.0.0.1/ontology/books.owl#Book-Type",
      "desc": "Output of service RomanticNovel Author Book-Type Service"
    }
  ],
  "capability": "atomic",
  "file": "romanticnovel_authorbook-type_service.owls",
  "provider": {
    "type": "wsdn"
  },
  "inputs": [
    {
      "name": "_ROMANTICNOVEL",
      "type": "http://127.0.0.1/ontology/books.owl#RomanticNovel",
      "desc": "Input of service RomanticNovel Author Book-Type Service"
    }
  ],
  "name": "RomanticNovel Author Book-Type Service",
  "description": "This service returns author and book-type of a given romantic novel.",
  "domains": [
    {
      "name": "Educational",
      "url": "http://www.surf.scss.tcd.ie/cityOntology/#Educational"
    },
    {
      "name": "Entertainment_Products",
      "url": "http://www.surf.scss.tcd.ie/cityOntology/#Entertainment_Products"
    }
  ],
  "id": "books/romanticnovel_authorbook-type_service",
  "state": true,
  "url": "http://surf.scss.tcd.ie/_provider_/books/romanticnovel_authorbook-type_service"
}