{
  "outputs": [
    {
      "name": "_postal-address",
      "type": "string",
      "desc": "Output of service HospitalInvestService"
    },
    {
      "name": "_investigating",
      "type": "string",
      "desc": "Output of service HospitalInvestService"
    }
  ],
  "provider": {
    "type": "asp"
  },
  "inputs": [
    {
      "name": "_hospital",
      "type": "string",
      "desc": "Input of service HospitalInvestService"
    }
  ],
  "name": "HospitalInvestService",
  "description": "This service returns investigating facility in the given hospital and its postal address.",
  "domains": [
    {
      "name": "Activity",
      "url": "http://www.surf.scss.tcd.ie/cityOntology/#Activity"
    }
  ],
  "id": "health/hospital_postal-addressinvestigating_service",
  "state": true,
  "url": "http://surf.scss.tcd.ie/_provider_/health/hospital_postal-addressinvestigating_service"
}