{
  "outputs": [
    {
      "name": "_INVESTIGATING",
      "type": "http://127.0.0.1/ontology/SUMO.owl#Investigating",
      "desc": "Output of service MedInvestigating service"
    }
  ],
  "capability": "atomic",
  "file": "medicalclinic_investigating_service.owls",
  "provider": {
    "type": "wsdn"
  },
  "inputs": [
    {
      "name": "_MEDICALCLINIC",
      "type": "http://127.0.0.1/ontology/Mid-level-ontology.owl#MedicalClinic",
      "desc": "Input of service MedInvestigating service"
    }
  ],
  "name": "MedInvestigating service",
  "description": "MedInvestigating provides a service to return a type of medical investigatingin a certain medical clinic.",
  "domains": [
    {
      "name": "Health",
      "url": "http://www.surf.scss.tcd.ie/cityOntology/#Health"
    }
  ],
  "id": "medical/medicalclinic_investigating_service",
  "state": true,
  "url": "http://surf.scss.tcd.ie/_provider_/medical/medicalclinic_investigating_service"
}