{
    "description": "This is the service program_car_appointment",
    "domains": [
        {
            "name": "Transport_and_Mobility",
            "url": "http://www.surf.scss.tcd.ie/cityOntology/#Transport_and_Mobility"
        }
    ],
    "id": "transportandmobility/16_program_car_appointment",
    "inputs": [
        {
            "desc": "Input of service program_car_appointment",
            "name": "_CARPROBLEMS",
            "type": "http://www.surf.scss.tcd.ie/IoTservices.owl#carProblems"
        }
    ],
    "name": "program_car_appointment",
    "outputs": [
        {
            "desc": "Output of service program_car_appointment",
            "name": "_CARAPPOINTMENT",
            "type": "http://www.surf.scss.tcd.ie/IoTservices.owl#carAppointment"
        }
    ],
    "provider": {
        "type": "ws"
    },
    "state": true,
    "url": "http://surf.scss.tcd.ie/_provider_/transportandmobility/16_program_car_appointment"
}