{
  "outputs": [
    {
      "name": "_CARAPPOINTMENT",
      "type": "http://www.surf.scss.tcd.ie/IoTservices.owl#carAppointment",
      "desc": "Output of service program_car_appointment"
    }
  ],
  "provider": {
    "type": "ws"
  },
  "inputs": [
    {
      "name": "_CARPROBLEMS",
      "type": "http://www.surf.scss.tcd.ie/IoTservices.owl#carProblems",
      "desc": "Input of service program_car_appointment"
    }
  ],
  "name": "program_car_appointment",
  "description": "This is the service program_car_appointment",
  "domains": [
    {
      "name": "Transport_and_Mobility",
      "url": "http://www.surf.scss.tcd.ie/cityOntology/#Transport_and_Mobility"
    }
  ],
  "id": "transportandmobility/16_program_car_appointment",
  "state": true,
  "url": "http://surf.scss.tcd.ie/_provider_/transportandmobility/16_program_car_appointment"
}