{
  "outputs": [
    {
      "name": "_SEARCHINFO",
      "type": "http://www.surf.scss.tcd.ie/IoTservices.owl#searchInfo",
      "desc": "Output of service book_search_presentation,Research_and_Science"
    }
  ],
  "provider": {
    "type": "asp"
  },
  "inputs": [
    {
      "name": "_BOOKSTATUS",
      "type": "http://www.surf.scss.tcd.ie/IoTservices.owl#bookStatus",
      "desc": "Input of service book_search_presentation,Research_and_Science"
    },
    {
      "name": "_SIMILARBOOKS",
      "type": "http://www.surf.scss.tcd.ie/IoTservices.owl#similarBooks",
      "desc": "Input of service book_search_presentation,Research_and_Science"
    }
  ],
  "name": "book_search_presentation,Research_and_Science",
  "description": "This is the service book_search_presentation,research_and_science",
  "domains": [
    {
      "name": "Educational",
      "url": "http://www.surf.scss.tcd.ie/cityOntology/#Educational"
    },
    {
      "name": "Research_and_Science",
      "url": "http://www.surf.scss.tcd.ie/cityOntology/#Research_and_Science"
    }
  ],
  "id": "researchandscience/58_book_search_presentation,Research_and_Science",
  "state": true,
  "url": "http://surf.scss.tcd.ie/_provider_/researchandscience/58_book_search_presentation,Research_and_Science"
}
