{
  "outputs": [
    {
      "name": "_PRICE",
      "type": "http://127.0.0.1/ontology/concept.owl#Price",
      "desc": "Output of service MianMarkt ShoppingService"
    }
  ],
  "capability": "atomic",
  "file": "agent_price_MianMarktservice.owls",
  "provider": {
    "type": "wsdn"
  },
  "inputs": [
    {
      "name": "_AGENT",
      "type": "http://127.0.0.1/ontology/SUMO.owl#Agent",
      "desc": "Input of service MianMarkt ShoppingService"
    }
  ],
  "name": "MianMarkt ShoppingService",
  "description": "MianMarkt presents a service to get price of prepared food for a certain customer (agent), which is an optional input. The price depends of customer\u0027s purchase history.",
  "domains": [
    {
      "name": "Vehicle_Sale_and_Rent",
      "url": "http://www.surf.scss.tcd.ie/cityOntology/#Vehicle_Sale_and_Rent"
    }
  ],
  "id": "vehicle/agent_price_MianMarktservice",
  "state": true,
  "url": "http://surf.scss.tcd.ie/_provider_/vehicle/agent_price_MianMarktservice"
}