{
  "outputs": [
    {
      "name": "_FOOD",
      "type": "http://127.0.0.1/ontology/SUMO.owl#Food",
      "desc": "Output of service MOFoodService"
    }
  ],
  "capability": "atomic",
  "file": "mercantileorganization_food_service.owls",
  "provider": {
    "type": "webservice"
  },
  "inputs": [
    {
      "name": "_MERCANTILEORGANIZATION",
      "type": "http://127.0.0.1/ontology/SUMO.owl#MercantileOrganization",
      "desc": "Input of service MOFoodService"
    }
  ],
  "name": "MOFoodService",
  "description": "This service returns food items presented by mercantile organization.",
  "domains": [
    {
      "name": "Food_and_Drinks",
      "url": "http://www.surf.scss.tcd.ie/cityOntology/#Food_and_Drinks"
    }
  ],
  "id": "food/mercantileorganization_food_service",
  "state": true,
  "url": "http://surf.scss.tcd.ie/_provider_/food/mercantileorganization_food_service"
}