{
  "outputs": [
    {
      "name": "_PRICE",
      "type": "http://127.0.0.1/ontology/concept.owl#Price",
      "desc": "Output of service Car1PersonBicyclePrice service"
    }
  ],
  "capability": "atomic",
  "file": "1personbicyclecar_price_service.owls",
  "provider": {
    "type": "asp"
  },
  "inputs": [
    {
      "name": "_CAR",
      "type": "http://127.0.0.1/ontology/my_ontology.owl#Car",
      "desc": "Input of service Car1PersonBicyclePrice service"
    },
    {
      "name": "_1PERSONBICYCLE",
      "type": "http://127.0.0.1/ontology/my_ontology.owl#OnePersonBicycle",
      "desc": "Input of service Car1PersonBicyclePrice service"
    }
  ],
  "name": "Car1PersonBicyclePrice service",
  "description": "This service returns renting price of the pair of a car modeland one person bicycle model. The price of car and bicycle is for one day rent.",
  "domains": [
    {
      "name": "Vehicle_Sale_and_Rent",
      "url": "http://www.surf.scss.tcd.ie/cityOntology/#Vehicle_Sale_and_Rent"
    }
  ],
  "id": "vehicle/1personbicyclecar_price_service",
  "state": true,
  "url": "http://surf.scss.tcd.ie/_provider_/vehicle/1personbicyclecar_price_service"
}