{
  "outputs": [
    {
      "name": "_AUTHOR",
      "type": "http://127.0.0.1/ontology/books.owl#Author",
      "desc": "Output of service RomanticNovel Author MaxPrice Service"
    },
    {
      "name": "_MAXPRICE",
      "type": "http://127.0.0.1/ontology/concept.owl#MaxPrice",
      "desc": "Output of service RomanticNovel Author MaxPrice Service"
    }
  ],
  "capability": "atomic",
  "file": "romanticnovel_authormaxprice_service.owls",
  "provider": {
    "type": "webservice"
  },
  "inputs": [
    {
      "name": "_ROMANTICNOVEL",
      "type": "http://127.0.0.1/ontology/books.owl#RomanticNovel",
      "desc": "Input of service RomanticNovel Author MaxPrice Service"
    }
  ],
  "name": "RomanticNovel Author MaxPrice Service",
  "description": "This service returns author and max price of a given romantic novel title.",
  "domains": [
    {
      "name": "Entertainment_Products",
      "url": "http://www.surf.scss.tcd.ie/cityOntology/#Entertainment_Products"
    },
    {
      "name": "Educational",
      "url": "http://www.surf.scss.tcd.ie/cityOntology/#Educational"
    }
  ],
  "id": "books/romanticnovel_authormaxprice_service",
  "state": true,
  "url": "http://surf.scss.tcd.ie/_provider_/books/romanticnovel_authormaxprice_service"
}