{
  "outputs": [
    {
      "name": "_DESTINATION",
      "type": "http://127.0.0.1/ontology/travel.owl#Destination",
      "desc": "Output of service HikingSurfingDestination"
    }
  ],
  "capability": "atomic",
  "file": "surfinghiking_destination_service.owls",
  "provider": {
    "type": "asp"
  },
  "inputs": [
    {
      "name": "_HIKING",
      "type": "http://127.0.0.1/ontology/travel.owl#Hiking",
      "desc": "Input of service HikingSurfingDestination"
    },
    {
      "name": "_SURFING",
      "type": "http://127.0.0.1/ontology/travel.owl#Surfing",
      "desc": "Input of service HikingSurfingDestination"
    }
  ],
  "name": "HikingSurfingDestination",
  "description": "This service returns the destination whereboth options hiking and surfing are available.",
  "domains": [
    {
      "name": "Travel",
      "url": "http://www.surf.scss.tcd.ie/cityOntology/#Travel"
    },
    {
      "name": "Activity",
      "url": "http://www.surf.scss.tcd.ie/cityOntology/#Activity"
    }
  ],
  "id": "activity/surfinghiking_destination_service",
  "state": true,
  "url": "http://surf.scss.tcd.ie/_provider_/activity/surfinghiking_destination_service"
}