{
  "outputs": [
    {
      "name": "_AUTHOR",
      "type": "http://127.0.0.1/ontology/books.owl#Author",
      "desc": "Output of service ScienceFictionBook Author Price Service"
    },
    {
      "name": "_PRICE",
      "type": "http://127.0.0.1/ontology/concept.owl#Price",
      "desc": "Output of service ScienceFictionBook Author Price Service"
    }
  ],
  "capability": "atomic",
  "file": "sciencefictionbook_authorprice_service.owls",
  "provider": {
    "type": "wsdn"
  },
  "inputs": [
    {
      "name": "_SCIENCEFICTIONBOOK",
      "type": "http://127.0.0.1/ontology/books.owl#ScienceFictionBook",
      "desc": "Input of service ScienceFictionBook Author Price Service"
    }
  ],
  "name": "ScienceFictionBook Author Price Service",
  "description": "This service returns name of the author and price of a given science fiction book title.",
  "domains": [
    {
      "name": "Entertainment_Products",
      "url": "http://www.surf.scss.tcd.ie/cityOntology/#Entertainment_Products"
    },
    {
      "name": "Educational",
      "url": "http://www.surf.scss.tcd.ie/cityOntology/#Educational"
    }
  ],
  "id": "books/sciencefictionbook_authorprice_service",
  "state": true,
  "url": "http://surf.scss.tcd.ie/_provider_/books/sciencefictionbook_authorprice_service"
}