{
  "outputs": [
    {
      "name": "_UPDATEDROOMCALENDAR",
      "type": "http://www.surf.scss.tcd.ie/IoTservices.owl#updatedRoomCalendar",
      "desc": "Output of service update_room_calendar"
    }
  ],
  "provider": {
    "type": "ws"
  },
  "inputs": [
    {
      "name": "_BOOKEDROOM",
      "type": "http://www.surf.scss.tcd.ie/IoTservices.owl#bookedRoom",
      "desc": "Input of service update_room_calendar"
    }
  ],
  "name": "update_room_calendar",
  "description": "This is the service update_room_calendar",
  "domains": [
    {
      "name": "Educational",
      "url": "http://www.surf.scss.tcd.ie/cityOntology/#Educational"
    }
  ],
  "id": "education/67_update_room_calendar",
  "state": true,
  "url": "http://surf.scss.tcd.ie/_provider_/education/67_update_room_calendar"
}