{
    "capability": "atomic",
    "description": "DFKI returns the finest coffee and whiskey for a given price.",
    "domains": [
        {
            "name": "Food_and_Drinks",
            "url": "http://www.surf.scss.tcd.ie/cityOntology/#Food_and_Drinks"
        }
    ],
    "file": "price_coffeewhiskey_service.owls",
    "id": "food/price_coffeewhiskey_service",
    "inputs": [
        {
            "desc": "Input of service DFKI service",
            "name": "_PRICE",
            "type": "http://127.0.0.1/ontology/concept.owl#Price"
        }
    ],
    "name": "DFKI service",
    "outputs": [
        {
            "desc": "Output of service DFKI service",
            "name": "_COFFEE",
            "type": "http://127.0.0.1/ontology/my_ontology.owl#Coffee"
        },
        {
            "desc": "Output of service DFKI service",
            "name": "_WHISKEY",
            "type": "http://127.0.0.1/ontology/my_ontology.owl#Whiskey"
        }
    ],
    "provider": {
        "type": "wsdn"
    },
    "state": true,
    "url": "http://surf.scss.tcd.ie/_provider_/food/price_coffeewhiskey_service"
}