{
  "outputs": [
    {
      "name": "_NATIONALPARK",
      "type": "http://127.0.0.1/ontology/travel.owl#NationalPark",
      "desc": "Output of service Activity Nationalpark Service"
    }
  ],
  "capability": "atomic",
  "file": "activity_nationalpark_service.owls",
  "provider": {
    "type": "asp"
  },
  "inputs": [
    {
      "name": "_ACTIVITY",
      "type": "http://127.0.0.1/ontology/travel.owl#Activity",
      "desc": "Input of service Activity Nationalpark Service"
    }
  ],
  "name": "Activity Nationalpark Service",
  "description": "This service returns names of national parks which provide given activity.",
  "domains": [
    {
      "name": "Travel",
      "url": "http://www.surf.scss.tcd.ie/cityOntology/#Travel"
    },
    {
      "name": "Activity",
      "url": "http://www.surf.scss.tcd.ie/cityOntology/#Activity"
    }
  ],
  "id": "activity/activity_nationalpark_service",
  "state": true,
  "url": "http://surf.scss.tcd.ie/_provider_/activity/activity_nationalpark_service"
}