{
  "outputs": [
    {
      "name": "_UNILATERALGIVING",
      "type": "http://127.0.0.1/ontology/SUMO.owl#UnilateralGiving",
      "desc": "Output of service GovernmentOrganization Academic Degree Unilateral Giving Service"
    }
  ],
  "capability": "atomic",
  "file": "academic-degreegovernmentorganization_unilateralgiving_service.owls",
  "provider": {
    "type": "webservice"
  },
  "inputs": [
    {
      "name": "_GOVERNMENTORGANIZATION",
      "type": "http://127.0.0.1/ontology/SUMO.owl#GovernmentOrganization",
      "desc": "Input of service GovernmentOrganization Academic Degree Unilateral Giving Service"
    },
    {
      "name": "_ACADEMIC-DEGREE",
      "type": "http://127.0.0.1/ontology/portal.owl#Academic-Degree",
      "desc": "Input of service GovernmentOrganization Academic Degree Unilateral Giving Service"
    }
  ],
  "name": "GovernmentOrganization Academic Degree Unilateral Giving Service",
  "description": "This service informs about unilateral givings offered by a given government organization for a given academic degree.",
  "domains": [
    {
      "name": "Educational",
      "url": "http://www.surf.scss.tcd.ie/cityOntology/#Educational"
    },
    {
      "name": "Government_and_Planning",
      "url": "http://www.surf.scss.tcd.ie/cityOntology/#Government_and_Planning"
    }
  ],
  "id": "education/academic-degreegovernmentorganization_unilateralgiving_service",
  "state": true,
  "url": "http://surf.scss.tcd.ie/_provider_/education/academic-degreegovernmentorganization_unilateralgiving_service"
}