{
  "outputs": [
    {
      "name": "_GIVING",
      "type": "http://127.0.0.1/ontology/SUMO.owl#Giving",
      "desc": "Output of service GovMissilesGivingService"
    }
  ],
  "capability": "atomic",
  "file": "missilegovernment_giving_service.owls",
  "provider": {
    "type": "asp"
  },
  "inputs": [
    {
      "name": "_GOVERNMENT",
      "type": "http://127.0.0.1/ontology/SUMO.owl#Government",
      "desc": "Input of service GovMissilesGivingService"
    },
    {
      "name": "_MISSILE",
      "type": "http://127.0.0.1/ontology/Mid-level-ontology.owl#Missile",
      "desc": "Input of service GovMissilesGivingService"
    }
  ],
  "name": "GovMissilesGivingService",
  "description": "This service returns giving aid by the government for missiles technology.",
  "domains": [
    {
      "name": "Defense",
      "url": "http://www.surf.scss.tcd.ie/cityOntology/#Defense"
    }
  ],
  "id": "defense/missilegovernment_giving_service",
  "state": true,
  "url": "http://surf.scss.tcd.ie/_provider_/defense/missilegovernment_giving_service"
}