{
  "outputs": [
    {
      "name": "_TAXEDPRICEINEURO",
      "type": "http://127.0.0.1/ontology/concept.owl#TaxedPriceInEuro",
      "desc": "Output of service SpainishTax on PrepardFood"
    }
  ],
  "capability": "atomic",
  "file": "preparedfood_SpainishTax_service.owls",
  "provider": {
    "type": "asp"
  },
  "inputs": [
    {
      "name": "_PREPAREDFOOD",
      "type": "http://127.0.0.1/ontology/Mid-level-ontology.owl#PreparedFood",
      "desc": "Input of service SpainishTax on PrepardFood"
    }
  ],
  "name": "SpainishTax on PrepardFood",
  "description": "This service returns Spainish tax in euros on the given prepared food.",
  "domains": [
    {
      "name": "Food_and_Drinks",
      "url": "http://www.surf.scss.tcd.ie/cityOntology/#Food_and_Drinks"
    }
  ],
  "id": "food/preparedfood_taxedpriceineuro_service",
  "state": true,
  "url": "http://surf.scss.tcd.ie/_provider_/food/preparedfood_taxedpriceineuro_service"
}