{
    "capability": "atomic",
    "description": "This service informs the taxed pruchase price of a givenbook title.",
    "domains": [
        {
            "name": "Research_and_Science",
            "url": "http://www.surf.scss.tcd.ie/cityOntology/#Research_and_Science"
        }
    ],
    "file": "book_taxedprice_service.owls",
    "id": "books/book_taxedprice_service",
    "inputs": [
        {
            "desc": "Input of service BookTaxedPriceService",
            "name": "_BOOK",
            "type": "http://127.0.0.1/ontology/books.owl#Book"
        }
    ],
    "name": "BookTaxedPriceService",
    "outputs": [
        {
            "desc": "Output of service BookTaxedPriceService",
            "name": "_TAXEDPRICE",
            "type": "http://127.0.0.1/ontology/concept.owl#TaxedPrice"
        }
    ],
    "provider": {
        "type": "webservice"
    },
    "state": true,
    "url": "http://surf.scss.tcd.ie/_provider_/books/book_taxedprice_service"
}