{
    "capability": "atomic",
    "description": "This service returns author who wrote the given novel, and user review on it.",
    "domains": [
        {
            "name": "Research_and_Science",
            "url": "http://www.surf.scss.tcd.ie/cityOntology/#Research_and_Science"
        }
    ],
    "file": "novel_userreviewauthor_service.owls",
    "id": "education/novel_userreviewauthor_service",
    "inputs": [
        {
            "desc": "Input of service NovelAuthorURService",
            "name": "_NOVEL",
            "type": "http://127.0.0.1/ontology/books.owl#Novel"
        }
    ],
    "name": "NovelAuthorURService",
    "outputs": [
        {
            "desc": "Output of service NovelAuthorURService",
            "name": "_USERREVIEW",
            "type": "http://127.0.0.1/ontology/books.owl#UserReview"
        },
        {
            "desc": "Output of service NovelAuthorURService",
            "name": "_AUTHOR",
            "type": "http://127.0.0.1/ontology/books.owl#Author"
        }
    ],
    "provider": {
        "type": "wsdn"
    },
    "state": true,
    "url": "http://surf.scss.tcd.ie/_provider_/education/novel_userreviewauthor_service"
}