{
  "outputs": [
    {
      "name": "_POSTALCODE",
      "type": "http://127.0.0.1/ontology/geographydataset.owl#PostalCode",
      "desc": "Output of service Check and Lookup address service"
    },
    {
      "name": "_TIMEZONE",
      "type": "http://127.0.0.1/ontology/protonu.owl#TimeZone",
      "desc": "Output of service Check and Lookup address service"
    },
    {
      "name": "_AREA-PHONECODE",
      "type": "http://127.0.0.1/ontology/geographydataset.owl#PhoneCode",
      "desc": "Output of service Check and Lookup address service"
    },
    {
      "name": "_LATITUDE",
      "type": "http://127.0.0.1/ontology/protont.owl#latitude",
      "desc": "Output of service Check and Lookup address service"
    },
    {
      "name": "_LONGITUDE",
      "type": "http://127.0.0.1/ontology/protont.owl#longitude",
      "desc": "Output of service Check and Lookup address service"
    },
    {
      "name": "_COUNTY",
      "type": "http://127.0.0.1/ontology/protonu.owl#County",
      "desc": "Output of service Check and Lookup address service"
    }
  ],
  "capability": "atomic",
  "file": "checkAndLookupAddress.owls",
  "provider": {
    "type": "asp"
  },
  "inputs": [
    {
      "name": "_LICENSEKEY",
      "type": "http://127.0.0.1/ontology/geographydataset.owl#Code",
      "desc": "Input of service Check and Lookup address service"
    },
    {
      "name": "_ADDRESS",
      "type": "http://127.0.0.1/ontology/protonu.owl#Address",
      "desc": "Input of service Check and Lookup address service"
    },
    {
      "name": "_CITY",
      "type": "http://127.0.0.1/ontology/protonu.owl#City",
      "desc": "Input of service Check and Lookup address service"
    },
    {
      "name": "_STATE",
      "type": "http://127.0.0.1/ontology/protonu.owl#State",
      "desc": "Input of service Check and Lookup address service"
    },
    {
      "name": "_COUNTRY",
      "type": "http://127.0.0.1/ontology/protonu.owl#Country",
      "desc": "Input of service Check and Lookup address service"
    }
  ],
  "name": "Check and Lookup address service",
  "description": "This service checks an address with 1 line, including the city,state and country, and only returns 1 match including all available information on the matching address (postal code, latitude and longitude, county, timezone, phone area code, etc.).For using this service valid License Key should be provided.",
  "domains": [
    {
      "name": "Geography",
      "url": "http://www.surf.scss.tcd.ie/cityOntology/#Geography"
    }
  ],
  "id": "geography/check_address_service",
  "state": true,
  "url": "http://surf.scss.tcd.ie/_provider_/geography/check_address_service"
}