{
  "outputs": [
    {
      "name": "_OCCUPATIONALTRADE",
      "type": "http://127.0.0.1/ontology/Mid-level-ontology.owl#OccupationalTrade",
      "desc": "Output of service Geopolitical-Entity OccupationalTrade PartTimePosition Service"
    },
    {
      "name": "_PARTTIMEPOSITION",
      "type": "http://127.0.0.1/ontology/Mid-level-ontology.owl#PartTimePosition",
      "desc": "Output of service Geopolitical-Entity OccupationalTrade PartTimePosition Service"
    }
  ],
  "capability": "atomic",
  "file": "geopolitical-entity_occupationaltradeparttimeposition_service.owls",
  "provider": {
    "type": "asp"
  },
  "inputs": [
    {
      "name": "_GEOPOLITICAL-ENTITY",
      "type": "http://127.0.0.1/ontology/portal.owl#Geopolitical-Entity",
      "desc": "Input of service Geopolitical-Entity OccupationalTrade PartTimePosition Service"
    }
  ],
  "name": "Geopolitical-Entity OccupationalTrade PartTimePosition Service",
  "description": "This service returns part time positions offering for occupationaltrades in a given geopolitical-entity.",
  "domains": [
    {
      "name": "Industry",
      "url": "http://www.surf.scss.tcd.ie/cityOntology/#Industry"
    }
  ],
  "id": "industry/geopolitical-entity_occupationaltradeparttimeposition_service",
  "state": true,
  "url": "http://surf.scss.tcd.ie/_provider_/industry/geopolitical-entity_occupationaltradeparttimeposition_service"
}