{
  "outputs": [
    {
      "name": "_VEHICLECONFIGURED",
      "type": "http://www.surf.scss.tcd.ie/IoTservices.owl#vehicleConfigured",
      "desc": "Output of service configure_vehicle_communication"
    }
  ],
  "provider": {
    "type": "asp"
  },
  "inputs": [
    {
      "name": "_AMBULANCEROUTE",
      "type": "http://www.surf.scss.tcd.ie/IoTservices.owl#ambulanceRoute",
      "desc": "Input of service configure_vehicle_communication"
    }
  ],
  "name": "configure_vehicle_communication",
  "description": "This is the service configure_vehicle_communication",
  "domains": [
    {
      "name": "Communications",
      "url": "http://www.surf.scss.tcd.ie/cityOntology/#Communications"
    },
    {
      "name": "Transport_and_Mobility",
      "url": "http://www.surf.scss.tcd.ie/cityOntology/#Transport_and_Mobility"
    }
  ],
  "id": "transportandmobility/95_configure_vehicle_communication",
  "state": true,
  "url": "http://surf.scss.tcd.ie/_provider_/transportandmobility/95_configure_vehicle_communication"
}