{
  "outputs": [
    {
      "name": "constructionInformation",
      "type": "xml"
    }
  ],
  "provider": {
    "type": "ws"
  },
  "inputs": [
    {
      "name": "machineStatus",
      "type": "json"
    },
    {
      "name": "gasDetection",
      "type": "json"
    }
  ],
  "name": "construction_anomaly_detection",
  "description": "This is the service construction_anomaly_detection",
  "domains": [
    {
      "name": "Safety_and_Emergencies",
      "url": "http://www.surf.scss.tcd.ie/cityOntology/#Safety_and_Emergencies"
    },
    {
      "name": "Construction",
      "url": "http://www.surf.scss.tcd.ie/cityOntology/#Construction"
    }
  ],
  "id": "44/construction_anomaly_detection",
  "state": true,
  "url": "http://surf.scss.tcd.ie/_provider_/construction_anomaly_detection"
}