{
  "outputs": [
    {
      "name": "_AUTHOR",
      "type": "http://127.0.0.1/ontology/books.owl#Author",
      "desc": "Output of service ScienceFictionBook Author RecommendedPrice Service"
    },
    {
      "name": "_RECOMMENDEDPRICE",
      "type": "http://127.0.0.1/ontology/concept.owl#RecommendedPrice",
      "desc": "Output of service ScienceFictionBook Author RecommendedPrice Service"
    }
  ],
  "capability": "atomic",
  "file": "sciencefictionbook_authorrecommendedprice_service.owls",
  "provider": {
    "type": "wsdn"
  },
  "inputs": [
    {
      "name": "_SCIENCEFICTIONBOOK",
      "type": "http://127.0.0.1/ontology/books.owl#ScienceFictionBook",
      "desc": "Input of service ScienceFictionBook Author RecommendedPrice Service"
    }
  ],
  "name": "ScienceFictionBook Author RecommendedPrice Service",
  "description": "This service returns author and recommended price of a given science fiction book title.",
  "domains": [
    {
      "name": "Entertainment_Products",
      "url": "http://www.surf.scss.tcd.ie/cityOntology/#Entertainment_Products"
    }
  ],
  "id": "books/sciencefictionbook_authorrecommendedprice_service",
  "state": true,
  "url": "http://surf.scss.tcd.ie/_provider_/books/sciencefictionbook_authorrecommendedprice_service"
}