{
  "outputs": [
    {
      "name": "_COFFEE",
      "type": "http://127.0.0.1/ontology/my_ontology.owl#Coffee",
      "desc": "Output of service DFKI service"
    },
    {
      "name": "_WHISKEY",
      "type": "http://127.0.0.1/ontology/my_ontology.owl#Whiskey",
      "desc": "Output of service DFKI service"
    }
  ],
  "capability": "atomic",
  "file": "price_coffeewhiskey_service.owls",
  "provider": {
    "type": "wsdn"
  },
  "inputs": [
    {
      "name": "_PRICE",
      "type": "http://127.0.0.1/ontology/concept.owl#Price",
      "desc": "Input of service DFKI service"
    }
  ],
  "name": "DFKI service",
  "description": "DFKI returns the finest coffee and whiskey for a given price.",
  "domains": [
    {
      "name": "Food_and_Drinks",
      "url": "http://www.surf.scss.tcd.ie/cityOntology/#Food_and_Drinks"
    }
  ],
  "id": "food/price_coffeewhiskey_service",
  "state": true,
  "url": "http://surf.scss.tcd.ie/_provider_/food/price_coffeewhiskey_service"
}