{
  "outputs": [
    {
      "name": "_book",
      "type": "string",
      "desc": "Output of service BookProviderService"
    },
    {
      "name": "_author",
      "type": "string",
      "desc": "Output of service BookProviderService"
    }
  ],
  "provider": {
    "type": "wsdn"
  },
  "inputs": [
    {
      "name": "_isbn",
      "type": "string",
      "desc": "Input of service BookProviderService"
    }
  ],
  "name": "BookProviderService",
  "description": "This service provides a book  and its author, on the given ISBN.",
  "domains": [
    {
      "name": "Religious",
      "url": "http://www.surf.scss.tcd.ie/cityOntology/#Religious"
    }
  ],
  "id": "educational/isbn_bookauthor_service",
  "state": true,
  "url": "http://surf.scss.tcd.ie/_provider_/educational/isbn_bookauthor_service"
}