{
  "outputs": [
    {
      "name": "_ARROWFIGURE",
      "type": "http://127.0.0.1/ontology/Mid-level-ontology.owl#ArrowFigure",
      "desc": "Output of service citycity route finder Service"
    }
  ],
  "capability": "atomic",
  "file": "citycity_arrowfigure_service.owls",
  "provider": {
    "type": "webservice"
  },
  "inputs": [
    {
      "name": "_CITY1",
      "type": "http://127.0.0.1/ontology/portal.owl#City",
      "desc": "Input of service citycity route finder Service"
    },
    {
      "name": "_CITY2",
      "type": "http://127.0.0.1/ontology/portal.owl#City",
      "desc": "Input of service citycity route finder Service"
    }
  ],
  "name": "citycity route finder Service",
  "description": "This service returns a nice arrow figure, a part of map, to indicate the target path between two cities",
  "domains": [
    {
      "name": "Travel",
      "url": "http://www.surf.scss.tcd.ie/cityOntology/#Travel"
    }
  ],
  "id": "travel/citycity_arrowfigure_service",
  "state": true,
  "url": "http://surf.scss.tcd.ie/_provider_/travel/citycity_arrowfigure_service"
}