{
  "outputs": [
    {
      "name": "_BOOK",
      "type": "http://127.0.0.1/ontology/books.owl#Book",
      "desc": "Output of service BookFinder"
    }
  ],
  "capability": "atomic",
  "file": "BookFinder.owls",
  "provider": {
    "type": "asp"
  },
  "inputs": [
    {
      "name": "_TITLE",
      "type": "http://127.0.0.1/ontology/books.owl#Title",
      "desc": "Input of service BookFinder"
    }
  ],
  "name": "BookFinder",
  "description": "This service returns the information of a book whose title best matches the given string.",
  "domains": [
    {
      "name": "Educational",
      "url": "http://www.surf.scss.tcd.ie/cityOntology/#Educational"
    }
  ],
  "id": "education/title_book_service",
  "state": true,
  "url": "http://surf.scss.tcd.ie/_provider_/education/title_book_service"
}