{
  "outputs": [
    {
      "name": "_LENDING",
      "type": "http://127.0.0.1/ontology/SUMO.owl#Lending",
      "desc": "Output of service Governement Lending Service"
    }
  ],
  "capability": "atomic",
  "file": "government_lending_service.owls",
  "provider": {
    "type": "webservice"
  },
  "inputs": [
    {
      "name": "_GOVERNMENT",
      "type": "http://127.0.0.1/ontology/SUMO.owl#Government",
      "desc": "Input of service Governement Lending Service"
    }
  ],
  "name": "Governement Lending Service",
  "description": "This service gives you information for the lending offered by the given government.",
  "domains": [
    {
      "name": "Educational",
      "url": "http://www.surf.scss.tcd.ie/cityOntology/#Educational"
    }
  ],
  "id": "education/government_lending_service",
  "state": true,
  "url": "http://surf.scss.tcd.ie/_provider_/education/government_lending_service"
}