{
  "outputs": [
    {
      "name": "_price",
      "type": "string",
      "desc": "Output of service 4wheeledcarbicycle_price_service"
    }
  ],
  "provider": {
    "type": "asp"
  },
  "inputs": [
    {
      "name": "_bicycle",
      "type": "string",
      "desc": "Input of service 4wheeledcarbicycle_price_service"
    },
    {
      "name": "_4wheeledcar",
      "type": "string",
      "desc": "Input of service 4wheeledcarbicycle_price_service"
    }
  ],
  "name": "4wheeledcarbicycle_price_service",
  "description": "This service is about retail",
  "domains": [
    {
      "name": "Living",
      "url": "http://www.surf.scss.tcd.ie/cityOntology/#Living"
    }
  ],
  "id": "retail/4wheeledcarbicycle_price_service",
  "state": true,
  "url": "http://surf.scss.tcd.ie/_provider_/retail/4wheeledcarbicycle_price_service"
}