{
  "outputs": [
    {
      "name": "_address",
      "type": "string",
      "desc": "Output of service Researcher address service"
    }
  ],
  "provider": {
    "type": "webservice"
  },
  "inputs": [
    {
      "name": "_researcher-in-academia",
      "type": "string",
      "desc": "Input of service Researcher address service"
    }
  ],
  "name": "Researcher address service",
  "description": "This service returns an addresses, whether email or postal, of a researcher.",
  "domains": [
    {
      "name": "Technology",
      "url": "http://www.surf.scss.tcd.ie/cityOntology/#Technology"
    }
  ],
  "id": "educational/researcher-in-academia_address_service",
  "state": true,
  "url": "http://surf.scss.tcd.ie/_provider_/educational/researcher-in-academia_address_service"
}