{
  "outputs": [
    {
      "name": "_hotel",
      "type": "string",
      "desc": "Output of service GermanCityHotelInfoService"
    }
  ],
  "provider": {
    "type": "asp"
  },
  "inputs": [
    {
      "name": "_city",
      "type": "string",
      "desc": "Input of service GermanCityHotelInfoService"
    }
  ],
  "name": "GermanCityHotelInfoService",
  "description": "This service returns information of a hotel of a given city of Germany.",
  "domains": [
    {
      "name": "Technology",
      "url": "http://www.surf.scss.tcd.ie/cityOntology/#Technology"
    }
  ],
  "id": "tourism/city_hotel_service",
  "state": true,
  "url": "http://surf.scss.tcd.ie/_provider_/tourism/city_hotel_service"
}