{
  "outputs": [
    {
      "name": "_OBTAINABLEVIDEOMEDIA",
      "type": "http://127.0.0.1/ontology/my_ontology.owl#obtainableVideoMedia",
      "desc": "Output of service Obtainalbe Video Media finder service"
    }
  ],
  "capability": "atomic",
  "file": "title_obtainablevideomedia_service.owls",
  "provider": {
    "type": "webservice"
  },
  "inputs": [
    {
      "name": "_TITLE",
      "type": "http://127.0.0.1/ontology/books.owl#Title",
      "desc": "Input of service Obtainalbe Video Media finder service"
    }
  ],
  "name": "Obtainalbe Video Media finder service",
  "description": "This service find an obtainable video media from the given title.",
  "domains": [
    {
      "name": "Communications",
      "url": "http://www.surf.scss.tcd.ie/cityOntology/#Communications"
    }
  ],
  "id": "communication/title_obtainablevideomedia_service",
  "state": true,
  "url": "http://surf.scss.tcd.ie/_provider_/communication/title_obtainablevideomedia_service"
}