{
  "outputs": [
    {
      "name": "_FUNDING",
      "type": "http://127.0.0.1/ontology/SUMO.owl#Funding",
      "desc": "Output of service Academic-Degree Funding GermangovService"
    }
  ],
  "capability": "atomic",
  "file": "academic-degree_funding_GermanGovservice.owls",
  "provider": {
    "type": "wsdn"
  },
  "inputs": [
    {
      "name": "_ACADEMIC-DEGREE",
      "type": "http://127.0.0.1/ontology/portal.owl#Academic-Degree",
      "desc": "Input of service Academic-Degree Funding GermangovService"
    }
  ],
  "name": "Academic-Degree Funding GermangovService",
  "description": "It is an attractive service to know about the funding offered for a given academic-degree by the german government.",
  "domains": [
    {
      "name": "Educational",
      "url": "http://www.surf.scss.tcd.ie/cityOntology/#Educational"
    }
  ],
  "id": "education/academic-degree_funding_service",
  "state": true,
  "url": "http://surf.scss.tcd.ie/_provider_/education/academic-degree_funding_service"
}