{
  "outputs": [
    {
      "name": "_address",
      "type": "string",
      "desc": "Output of service ZOO Researcher address service"
    }
  ],
  "provider": {
    "type": "asp"
  },
  "inputs": [
    {
      "name": "_researcher-in-academia",
      "type": "string",
      "desc": "Input of service ZOO Researcher address service"
    }
  ],
  "name": "ZOO Researcher address service",
  "description": "ZOO is a reknown service that returns an addresses, whether email or postal, of a researcher.",
  "domains": [
    {
      "name": "Clothing",
      "url": "http://www.surf.scss.tcd.ie/cityOntology/#Clothing"
    }
  ],
  "id": "educational/researcher-in-academia_address_service",
  "state": true,
  "url": "http://surf.scss.tcd.ie/_provider_/educational/researcher-in-academia_address_service"
}