{
  "outputs": [
    {
      "name": "_ADDRESS",
      "type": "http://127.0.0.1/ontology/portal.owl#Address",
      "desc": "Output of service Researcher address  service"
    }
  ],
  "capability": "atomic",
  "file": "researcher_address_service.owls",
  "provider": {
    "type": "asp"
  },
  "inputs": [
    {
      "name": "_RESEARCHER",
      "type": "http://127.0.0.1/ontology/portal.owl#Researcher",
      "desc": "Input of service Researcher address  service"
    }
  ],
  "name": "Researcher address  service",
  "description": "This service returns home or office address of a given researcher name and last name.",
  "domains": [
    {
      "name": "Educational",
      "url": "http://www.surf.scss.tcd.ie/cityOntology/#Educational"
    },
    {
      "name": "Research_and_Science",
      "url": "http://www.surf.scss.tcd.ie/cityOntology/#Research_and_Science"
    }
  ],
  "id": "education/researcher_address_service",
  "state": true,
  "url": "http://surf.scss.tcd.ie/_provider_/education/researcher_address_service"
}