{
  "outputs": [
    {
      "name": "_PRICE",
      "type": "http://127.0.0.1/ontology/concept.owl#Price",
      "desc": "Output of service ExpensiveCar Price Color service"
    },
    {
      "name": "_COLOR",
      "type": "http://127.0.0.1/ontology/my_ontology.owl#Color",
      "desc": "Output of service ExpensiveCar Price Color service"
    }
  ],
  "capability": "atomic",
  "file": "expensivecar_pricecolor_service.owls",
  "provider": {
    "type": "asp"
  },
  "inputs": [
    {
      "name": "_EXPENSIVECAR",
      "type": "http://127.0.0.1/ontology/my_ontology.owl#ExpensiveCar",
      "desc": "Input of service ExpensiveCar Price Color service"
    }
  ],
  "name": "ExpensiveCar Price Color service",
  "description": "This service provides a list of purchase prices from different car merchandiser of given expensive car model, with its available colors.",
  "domains": [
    {
      "name": "Vehicle_Sale_and_Rent",
      "url": "http://www.surf.scss.tcd.ie/cityOntology/#Vehicle_Sale_and_Rent"
    }
  ],
  "id": "vehicle/expensivecar_pricecolor_service",
  "state": true,
  "url": "http://surf.scss.tcd.ie/_provider_/vehicle/expensivecar_pricecolor_service"
}