{
  "outputs": [
    {
      "name": "_price",
      "type": "string",
      "desc": "Output of service 4wheeledcar year price service"
    }
  ],
  "provider": {
    "type": "asp"
  },
  "inputs": [
    {
      "name": "_4wheeledcar",
      "type": "string",
      "desc": "Input of service 4wheeledcar year price service"
    },
    {
      "name": "_year",
      "type": "string",
      "desc": "Input of service 4wheeledcar year price service"
    }
  ],
  "name": "4wheeledcar year price service",
  "description": "You can inquire a price of a four wheeled car given the model year.",
  "domains": [
    {
      "name": "Pharmacy_Products",
      "url": "http://www.surf.scss.tcd.ie/cityOntology/#Pharmacy_Products"
    }
  ],
  "id": "retail/4wheeledcaryear_price_service",
  "state": true,
  "url": "http://surf.scss.tcd.ie/_provider_/retail/4wheeledcaryear_price_service"
}