{
  "outputs": [
    {
      "name": "_WEATHERSYSTEM",
      "type": "http://127.0.0.1/ontology/Mid-level-ontology.owl#WeatherSystem",
      "desc": "Output of service City WeatherSystem Service"
    }
  ],
  "capability": "atomic",
  "file": "city_weathersystem_service.owls",
  "provider": {
    "type": "webservice"
  },
  "inputs": [
    {
      "name": "_CITY",
      "type": "http://127.0.0.1/ontology/SUMO.owl#City",
      "desc": "Input of service City WeatherSystem Service"
    }
  ],
  "name": "City WeatherSystem Service",
  "description": "This service returns weather system of a given city.",
  "domains": [
    {
      "name": "Travel",
      "url": "http://www.surf.scss.tcd.ie/cityOntology/#Travel"
    },
    {
      "name": "Weather",
      "url": "http://www.surf.scss.tcd.ie/cityOntology/#Weather"
    }
  ],
  "id": "weather/city_weathersystem_service",
  "state": true,
  "url": "http://surf.scss.tcd.ie/_provider_/weather/city_weathersystem_service"
}