{
  "outputs": [
    {
      "name": "_RECPRICE",
      "type": "http://127.0.0.1/ontology/concept.owl#RecommendedPriceInEuro",
      "desc": "Output of service 2For 1 Price service"
    }
  ],
  "capability": "atomic",
  "file": "dvdplayermp3player_RecpriceEuro_service.owls",
  "provider": {
    "type": "asp"
  },
  "inputs": [
    {
      "name": "_MP3PLAYER",
      "type": "http://127.0.0.1/ontology/my_ontology.owl#MP3Player",
      "desc": "Input of service 2For 1 Price service"
    },
    {
      "name": "_DVDPLAYER",
      "type": "http://127.0.0.1/ontology/my_ontology.owl#DVDPlayer",
      "desc": "Input of service 2For 1 Price service"
    }
  ],
  "name": "2For 1 Price service",
  "description": "This service returns recommended prices in Euros of a set of MP3Player brand and DVD Player brand.",
  "domains": [
    {
      "name": "Technology",
      "url": "http://www.surf.scss.tcd.ie/cityOntology/#Technology"
    }
  ],
  "id": "technology/dvdplayermp3player_RecpriceEuro_service",
  "state": true,
  "url": "http://surf.scss.tcd.ie/_provider_/technology/dvdplayermp3player_RecpriceEuro_service"
}