{
  "outputs": [
    {
      "name": "_TECHNOLOGY",
      "type": "http://127.0.0.1/ontology/portal.owl#Technology",
      "desc": "Output of service FastCarTechnology service"
    }
  ],
  "capability": "atomic",
  "file": "fastcar_technology_service.owls",
  "provider": {
    "type": "wsdn"
  },
  "inputs": [
    {
      "name": "_FASTCAR",
      "type": "http://127.0.0.1/ontology/my_ontology.owl#FastCar",
      "desc": "Input of service FastCarTechnology service"
    }
  ],
  "name": "FastCarTechnology service",
  "description": "This service returns information of the used technology in the given fast car model.",
  
  "id": "education/fastcar_technology_service",
  "state": true,
  "url": "http://surf.scss.tcd.ie/_provider_/education/fastcar_technology_service"
}