{
  "outputs": [
    {
      "name": "_TAXFREEPRICE",
      "type": "http://127.0.0.1/ontology/concept.owl#TaxFreePrice",
      "desc": "Output of service Food TaxFreePrice Quantity Service"
    },
    {
      "name": "_QUANTITY",
      "type": "http://127.0.0.1/ontology/support.owl#Quantity",
      "desc": "Output of service Food TaxFreePrice Quantity Service"
    }
  ],
  "capability": "atomic",
  "file": "food_taxfreepricequantity_Aldiservice.owls",
  "provider": {
    "type": "wsdn"
  },
  "inputs": [
    {
      "name": "_FOOD",
      "type": "http://127.0.0.1/ontology/SUMO.owl#Food",
      "desc": "Input of service Food TaxFreePrice Quantity Service"
    }
  ],
  "name": "Food TaxFreePrice Quantity Service",
  "description": "This services informs about the tax free price and the available quantity of a given food item.",
  "domains": [
    {
      "name": "Food_and_Drinks",
      "url": "http://www.surf.scss.tcd.ie/cityOntology/#Food_and_Drinks"
    }
  ],
  "id": "food/food_taxfreepricequantity_Aldiservice",
  "state": true,
  "url": "http://surf.scss.tcd.ie/_provider_/food/food_taxfreepricequantity_Aldiservice"
}