{
  "outputs": [
    {
      "name": "_PRICE",
      "type": "http://127.0.0.1/ontology/concept.owl#Price",
      "desc": "Output of service BicycleCar_Price_service"
    }
  ],
  "capability": "atomic",
  "file": "bicyclecar_price_service.owls",
  "provider": {
    "type": "webservice"
  },
  "inputs": [
    {
      "name": "_CAR",
      "type": "http://127.0.0.1/ontology/my_ontology.owl#Car",
      "desc": "Input of service BicycleCar_Price_service"
    },
    {
      "name": "_BICYCLE",
      "type": "http://127.0.0.1/ontology/my_ontology.owl#Bicycle",
      "desc": "Input of service BicycleCar_Price_service"
    }
  ],
  "name": "BicycleCar_Price_service",
  "description": "This service returns daily renting price of the requested pair of a car modeland a bicycle model.",
  "domains": [
    {
      "name": "Vehicle_Sale_and_Rent",
      "url": "http://www.surf.scss.tcd.ie/cityOntology/#Vehicle_Sale_and_Rent"
    }
  ],
  "id": "vehicle/bicyclecar_price_service",
  "state": true,
  "url": "http://surf.scss.tcd.ie/_provider_/vehicle/bicyclecar_price_service"
}