{
  "outputs": [
    {
      "name": "_PRICE",
      "type": "http://127.0.0.1/ontology/concept.owl#Price",
      "desc": "Output of service Expensive car price service"
    }
  ],
  "capability": "atomic",
  "file": "expensivecar_price_service.owls",
  "provider": {
    "type": "wsdn"
  },
  "inputs": [
    {
      "name": "_EXPENSIVECAR",
      "type": "http://127.0.0.1/ontology/my_ontology.owl#ExpensiveCar",
      "desc": "Input of service Expensive car price service"
    }
  ],
  "name": "Expensive car price service",
  "description": "An interested service to provide charm purchase price of a given expensive car model.",
  "domains": [
    {
      "name": "Vehicle_Sale_and_Rent",
      "url": "http://www.surf.scss.tcd.ie/cityOntology/#Vehicle_Sale_and_Rent"
    }
  ],
  "id": "vehicle/expensivecar_price_service",
  "state": true,
  "url": "http://surf.scss.tcd.ie/_provider_/vehicle/expensivecar_price_service"
}