{
  "outputs": [
    {
      "name": "_FUNDING",
      "type": "http://127.0.0.1/ontology/SUMO.owl#Funding",
      "desc": "Output of service GovernmentMissileFundingService"
    }
  ],
  "capability": "atomic",
  "file": "governmentmissile_funding_Reliableservice.owls",
  "provider": {
    "type": "wsdn"
  },
  "inputs": [
    {
      "name": "_MISSILE",
      "type": "http://127.0.0.1/ontology/Mid-level-ontology.owl#Missile",
      "desc": "Input of service GovernmentMissileFundingService"
    },
    {
      "name": "_GOVERNMENT",
      "type": "http://127.0.0.1/ontology/SUMO.owl#Government",
      "desc": "Input of service GovernmentMissileFundingService"
    }
  ],
  "name": "GovernmentMissileFundingService",
  "description": "It is a reliable service to know about the funding provided for the given missile type possessed by the given government.",
  "domains": [
    {
      "name": "Government_and_Planning",
      "url": "http://www.surf.scss.tcd.ie/cityOntology/#Government_and_Planning"
    }
  ],
  "id": "weapon/governmentmissile_funding_service",
  "state": true,
  "url": "http://surf.scss.tcd.ie/_provider_/weapon/governmentmissile_funding_service"
}