{
  "outputs": [
    {
      "name": "_AUTHOR",
      "type": "http://127.0.0.1/ontology/books.owl#Author",
      "desc": "Output of service BookAuthorService"
    },
    {
      "name": "_TEXT",
      "type": "http://127.0.0.1/ontology/SUMO.owl#Text",
      "desc": "Output of service BookAuthorService"
    }
  ],
  "capability": "atomic",
  "file": "book_authortext_service.owls",
  "provider": {
    "type": "webservice"
  },
  "inputs": [
    {
      "name": "_BOOK",
      "type": "http://127.0.0.1/ontology/books.owl#Book",
      "desc": "Input of service BookAuthorService"
    }
  ],
  "name": "BookAuthorService",
  "description": "This service returns author of the book, novel or short story, andits personal notes as a text for the book.",
  "domains": [
    {
      "name": "Educational",
      "url": "http://www.surf.scss.tcd.ie/cityOntology/#Educational"
    },
    {
      "name": "Entertainment_Products",
      "url": "http://www.surf.scss.tcd.ie/cityOntology/#Entertainment_Products"
    }
  ],
  "id": "books/book_authortext_service",
  "state": true,
  "url": "http://surf.scss.tcd.ie/_provider_/books/book_authortext_service"
}