{
  "outputs": [
    {
      "name": "_MAP",
      "type": "http://127.0.0.1/ontology/Mid-level-ontology.owl#Map",
      "desc": "Output of service Gorge RouteFinder Service"
    }
  ],
  "capability": "atomic",
  "file": "geographical-regiongeographical-region_map_Gorgservice.owls",
  "provider": {
    "type": "asp"
  },
  "inputs": [
    {
      "name": "_GEOGRAPHICAL-REGION1",
      "type": "http://127.0.0.1/ontology/portal.owl#Geographical-Region",
      "desc": "Input of service Gorge RouteFinder Service"
    },
    {
      "name": "_GEOGRAPHICAL-REGION2",
      "type": "http://127.0.0.1/ontology/portal.owl#Geographical-Region",
      "desc": "Input of service Gorge RouteFinder Service"
    }
  ],
  "name": "Gorge RouteFinder Service",
  "description": "Gorge is a new service and provides map with all relative paths between two given geographical regions.",
  "domains": [
    {
      "name": "Travel",
      "url": "http://www.surf.scss.tcd.ie/cityOntology/#Travel"
    }
  ],
  "id": "travel/geographical-regiongeographical-region_map_service",
  "state": true,
  "url": "http://surf.scss.tcd.ie/_provider_/travel/geographical-regiongeographical-region_map_service"
}