{
  "outputs": [
    {
      "name": "_PROFESSION",
      "type": "http://127.0.0.1/ontology/Mid-level-ontology.owl#Profession",
      "desc": "Output of service Country Profession TimeDuration service"
    },
    {
      "name": "_TIMEDURATION",
      "type": "http://127.0.0.1/ontology/SUMO.owl#TimeDuration",
      "desc": "Output of service Country Profession TimeDuration service"
    }
  ],
  "capability": "atomic",
  "file": "country_professiontimeduration_Service.owls",
  "provider": {
    "type": "wsdn"
  },
  "inputs": [
    {
      "name": "_COUNTRY",
      "type": "http://127.0.0.1/ontology/portal.owl#Country",
      "desc": "Input of service Country Profession TimeDuration service"
    }
  ],
  "name": "Country Profession TimeDuration service",
  "description": "This service returns profession jobs in a given company and its time duration.",
  "domains": [
    {
      "name": "Industry",
      "url": "http://www.surf.scss.tcd.ie/cityOntology/#Industry"
    }
  ],
  "id": "industry/country_professiontimeduration_Service",
  "state": true,
  "url": "http://surf.scss.tcd.ie/_provider_/industry/country_professiontimeduration_Service"
}