{
  "outputs": [
    {
      "name": "_WARMFRONT",
      "type": "http://127.0.0.1/ontology/Mid-level-ontology.owl#WarmFront",
      "desc": "Output of service Country WarmFront Service"
    }
  ],
  "capability": "atomic",
  "file": "country_warmfront_service.owls",
  "provider": {
    "type": "wsdn"
  },
  "inputs": [
    {
      "name": "_COUNTRY",
      "type": "http://127.0.0.1/ontology/portal.owl#Country",
      "desc": "Input of service Country WarmFront Service"
    }
  ],
  "name": "Country WarmFront Service",
  "description": "This service informs about warmfront in a given country.",
  "domains": [
    {
      "name": "Travel",
      "url": "http://www.surf.scss.tcd.ie/cityOntology/#Travel"
    }
  ],
  "id": "travel/country_warmfront_service",
  "state": true,
  "url": "http://surf.scss.tcd.ie/_provider_/travel/country_warmfront_service"
}