{
  "outputs": [
    {
      "name": "_PUBLICATION",
      "type": "http://127.0.0.1/ontology/books.owl#Publication",
      "desc": "Output of service Author Publication Price Service"
    },
    {
      "name": "_PRICE",
      "type": "http://127.0.0.1/ontology/concept.owl#Price",
      "desc": "Output of service Author Publication Price Service"
    }
  ],
  "capability": "atomic",
  "file": "author_publicationprice_service.owls",
  "provider": {
    "type": "wsdn"
  },
  "inputs": [
    {
      "name": "_AUTHOR",
      "type": "http://127.0.0.1/ontology/books.owl#Author",
      "desc": "Input of service Author Publication Price Service"
    }
  ],
  "name": "Author Publication Price Service",
  "description": "This service returns publications written by the given authorand their price as well.",
  "domains": [
    {
      "name": "Entertainment_Products",
      "url": "http://www.surf.scss.tcd.ie/cityOntology/#Entertainment_Products"
    },
    {
      "name": "Educational",
      "url": "http://www.surf.scss.tcd.ie/cityOntology/#Educational"
    }
  ],
  "id": "books/author_publicationprice_service",
  "state": true,
  "url": "http://surf.scss.tcd.ie/_provider_/books/author_publicationprice_service"
}