{
  "outputs": [
    {
      "name": "_ATMSTATUS",
      "type": "http://www.surf.scss.tcd.ie/IoTservices.owl#atmStatus",
      "desc": "Output of service atm_intruder_service"
    }
  ],
  "provider": {
    "type": "wsdn"
  },
  "inputs": [
    {
      "name": "_ATMID",
      "type": "http://www.surf.scss.tcd.ie/IoTservices.owl#atmId",
      "desc": "Input of service atm_intruder_service"
    }
  ],
  "name": "atm_intruder_service",
  "description": "This is the service atm_intruder_service",
  "domains": [
    {
      "name": "Safety_and_Emergencies",
      "url": "http://www.surf.scss.tcd.ie/cityOntology/#Safety_and_Emergencies"
    },
    {
      "name": "Finance",
      "url": "http://www.surf.scss.tcd.ie/cityOntology/#Finance"
    }
  ],
  "id": "finance/116_atm_intruder_service",
  "state": true,
  "url": "http://surf.scss.tcd.ie/_provider_/finance/116_atm_intruder_service"
}