{
  "outputs": [
    {
      "name": "_PRICE",
      "type": "http://127.0.0.1/ontology/concept.owl#Price",
      "desc": "Output of service ScienceFictionBook Price Service"
    }
  ],
  "capability": "atomic",
  "file": "sciencefictionbookuser_price_service.owls",
  "provider": {
    "type": "webservice"
  },
  "inputs": [
    {
      "name": "_USER",
      "type": "http://127.0.0.1/ontology/books.owl#User",
      "desc": "Input of service ScienceFictionBook Price Service"
    },
    {
      "name": "_SCIENCEFICTIONBOOK",
      "type": "http://127.0.0.1/ontology/books.owl#ScienceFictionBook",
      "desc": "Input of service ScienceFictionBook Price Service"
    }
  ],
  "name": "ScienceFictionBook Price Service",
  "description": "This service returns current purchase price of a given science fiction book for a authorized user. The price is differnet for each user.",
  "domains": [
    {
      "name": "Entertainment_Products",
      "url": "http://www.surf.scss.tcd.ie/cityOntology/#Entertainment_Products"
    },
    {
      "name": "Educational",
      "url": "http://www.surf.scss.tcd.ie/cityOntology/#Educational"
    }
  ],
  "id": "books/sciencefictionbookuser_price_service",
  "state": true,
  "url": "http://surf.scss.tcd.ie/_provider_/books/sciencefictionbookuser_price_service"
}