{
  "outputs": [
    {
      "name": "_BUSAVAILABILITY",
      "type": "http://www.surf.scss.tcd.ie/IoTservices.owl#busAvailability",
      "desc": "Output of service bus_availability"
    }
  ],
  "provider": {
    "type": "asp"
  },
  "inputs": [
    {
      "name": "_ROUTEPARAMETERS",
      "type": "http://www.surf.scss.tcd.ie/IoTservices.owl#routeParameters",
      "desc": "Input of service bus_availability"
    }
  ],
  "name": "bus_availability",
  "description": "This is the service bus_availability",
  "domains": [
    {
      "name": "Transport_and_Mobility",
      "url": "http://www.surf.scss.tcd.ie/cityOntology/#Transport_and_Mobility"
    }
  ],
  "id": "transportandmobility/8_bus_availability",
  "state": true,
  "url": "http://surf.scss.tcd.ie/_provider_/transportandmobility/8_bus_availability"
}