{
  "outputs": [
    {
      "name": "_LATITUDE",
      "type": "http://127.0.0.1/ontology/protont.owl#latitude",
      "desc": "Output of service Zip code location finder service."
    },
    {
      "name": "_LONGITUDE",
      "type": "http://127.0.0.1/ontology/protont.owl#longitude",
      "desc": "Output of service Zip code location finder service."
    }
  ],
  "capability": "atomic",
  "file": "getLocationOfUSZipcode.owls",
  "provider": {
    "type": "asp"
  },
  "inputs": [
    {
      "name": "_ZIPCODE",
      "type": "http://127.0.0.1/ontology/geographydataset.owl#US5DigitZipCode",
      "desc": "Input of service Zip code location finder service."
    }
  ],
  "name": "Zip code location finder service.",
  "description": "This is a service that provides the geographic coordinates (or the geographic area), defined with latitude/longitude pair, corresponding to a five digit US zip code.",
  "domains": [
    {
      "name": "Geography",
      "url": "http://www.surf.scss.tcd.ie/cityOntology/#Geography"
    }
  ],
  "id": "geography/zipcode_location_service",
  "state": true,
  "url": "http://surf.scss.tcd.ie/_provider_/geography/zipcode_location_service"
}