{
  "outputs": [
    {
      "name": "_TEA",
      "type": "http://127.0.0.1/ontology/Mid-level-ontology.owl#Tea",
      "desc": "Output of service AvailableTeaService"
    },
    {
      "name": "_PRICE",
      "type": "http://127.0.0.1/ontology/concept.owl#Price",
      "desc": "Output of service AvailableTeaService"
    }
  ],
  "capability": "atomic",
  "file": "grocerystore_teaprice_service.owls",
  "provider": {
    "type": "webservice"
  },
  "inputs": [
    {
      "name": "_GROCERYSTORE",
      "type": "http://127.0.0.1/ontology/Mid-level-ontology.owl#GroceryStore",
      "desc": "Input of service AvailableTeaService"
    }
  ],
  "name": "AvailableTeaService",
  "description": "This service informs about certain type of tea which isavailable in a given certain grocerystore and its price.",
  "domains": [
    {
      "name": "Food_and_Drinks",
      "url": "http://www.surf.scss.tcd.ie/cityOntology/#Food_and_Drinks"
    }
  ],
  "id": "food/grocerystore_teaprice_service",
  "state": true,
  "url": "http://surf.scss.tcd.ie/_provider_/food/grocerystore_teaprice_service"
}