{
  "outputs": [
    {
      "name": "_MATCHED-LOCATION",
      "type": "http://127.0.0.1/ontology/protont.owl#Location",
      "desc": "Output of service Query Parser location finder service."
    },
    {
      "name": "_MAP",
      "type": "http://127.0.0.1/ontology/geographydataset.owl#Map",
      "desc": "Output of service Query Parser location finder service."
    },
    {
      "name": "_LATITUDE",
      "type": "http://127.0.0.1/ontology/protont.owl#latitude",
      "desc": "Output of service Query Parser location finder service."
    },
    {
      "name": "_LONGITUDE",
      "type": "http://127.0.0.1/ontology/protont.owl#longitude",
      "desc": "Output of service Query Parser location finder service."
    }
  ],
  "capability": "atomic",
  "file": "queryParserLocation.owls",
  "provider": {
    "type": "asp"
  },
  "inputs": [
    {
      "name": "_LOCATION-QUERY",
      "type": "http://127.0.0.1/ontology/protont.owl#Location",
      "desc": "Input of service Query Parser location finder service."
    },
    {
      "name": "_IMAGE-WIDTH",
      "type": "http://127.0.0.1/ontology/ontosem.owl#width",
      "desc": "Input of service Query Parser location finder service."
    },
    {
      "name": "_IMAGE-HEIGHT",
      "type": "http://127.0.0.1/ontology/ontosem.owl#height",
      "desc": "Input of service Query Parser location finder service."
    },
    {
      "name": "_BOUNDING-BOX",
      "type": "http://127.0.0.1/ontology/geographydataset.owl#GeographicArea",
      "desc": "Input of service Query Parser location finder service."
    }
  ],
  "name": "Query Parser location finder service.",
  "description": "This service allows the ability to enter a string like \u0027Food in Cambridge\u0027 and get a result that splits the location query apart from the textual query, allowing you to create a location search interface using a single query field. The user enters also the query\u0027s geographic extent defined as radius in kilometers.It returns list of matched location names and their coordinates (latitude/longitude pairs), also a map with the matched locations. ",
  "domains": [
    {
      "name": "Geography",
      "url": "http://www.surf.scss.tcd.ie/cityOntology/#Geography"
    }
  ],
  "id": "geography/query_parser_location_service",
  "state": true,
  "url": "http://surf.scss.tcd.ie/_provider_/geography/query_parser_location_service"
}