{
  "outputs": [
    {
      "name": "_MAXPRICE",
      "type": "http://127.0.0.1/ontology/concept.owl#MaxPrice",
      "desc": "Output of service AldiFoodQuantityService"
    },
    {
      "name": "_QUANTITY",
      "type": "http://127.0.0.1/ontology/support.owl#Quantity",
      "desc": "Output of service AldiFoodQuantityService"
    }
  ],
  "capability": "atomic",
  "file": "food_maxpricequantity_service.owls",
  "provider": {
    "type": "wsdn"
  },
  "inputs": [
    {
      "name": "_FOOD",
      "type": "http://127.0.0.1/ontology/SUMO.owl#Food",
      "desc": "Input of service AldiFoodQuantityService"
    }
  ],
  "name": "AldiFoodQuantityService",
  "description": "The emphasis of this service to provide information of the quantity of a given food item available in Aldi, and also approximately the maximum price (not actual) of the food item.",
  "domains": [
    {
      "name": "Food_and_Drinks",
      "url": "http://www.surf.scss.tcd.ie/cityOntology/#Food_and_Drinks"
    }
  ],
  "id": "food/food_maxpricequantity_service",
  "state": true,
  "url": "http://surf.scss.tcd.ie/_provider_/food/food_maxpricequantity_service"
}