{
  "outputs": [
    {
      "name": "_TOTAL-DISTANCE",
      "type": "http://127.0.0.1/ontology/geographydataset.owl#GeographicDistance",
      "desc": "Output of service Driving directions service"
    },
    {
      "name": "_TOTAL-DRIVING-TIME",
      "type": "http://127.0.0.1/ontology/geographydataset.owl#TimeUnit",
      "desc": "Output of service Driving directions service"
    },
    {
      "name": "_DIRECTIONS",
      "type": "http://127.0.0.1/ontology/geographydataset.owl#DrivingDirections",
      "desc": "Output of service Driving directions service"
    },
    {
      "name": "_MAP",
      "type": "http://127.0.0.1/ontology/geographydataset.owl#Map",
      "desc": "Output of service Driving directions service"
    }
  ],
  "capability": "atomic",
  "file": "getDrivingDirections.owls",
  "provider": {
    "type": "webservice"
  },
  "inputs": [
    {
      "name": "_USERID",
      "type": "http://127.0.0.1/ontology/geographydataset.owl#UniqueIdentifier",
      "desc": "Input of service Driving directions service"
    },
    {
      "name": "_START-LATITUDE",
      "type": "http://127.0.0.1/ontology/protont.owl#latitude",
      "desc": "Input of service Driving directions service"
    },
    {
      "name": "_START-LONGITUDE",
      "type": "http://127.0.0.1/ontology/protont.owl#longitude",
      "desc": "Input of service Driving directions service"
    },
    {
      "name": "_END-LATITUDE",
      "type": "http://127.0.0.1/ontology/protont.owl#latitude",
      "desc": "Input of service Driving directions service"
    },
    {
      "name": "_END-LONGITUDE",
      "type": "http://127.0.0.1/ontology/protont.owl#longitude",
      "desc": "Input of service Driving directions service"
    },
    {
      "name": "_IMAGE-WIDTH",
      "type": "http://127.0.0.1/ontology/Units.owl#Pixel",
      "desc": "Input of service Driving directions service"
    },
    {
      "name": "_IMAGE-HEIGHT",
      "type": "http://127.0.0.1/ontology/Units.owl#Pixel",
      "desc": "Input of service Driving directions service"
    },
    {
      "name": "_LANGUAGE",
      "type": "http://127.0.0.1/ontology/protont.owl#Language",
      "desc": "Input of service Driving directions service"
    }
  ],
  "name": "Driving directions service",
  "description": "This service is based on http get request/XML response model to provide driving directions and route maps for 34 countries and areas. The returned driving distance is in kilometers,the route map and directions contain the shortest path of all.For using this service valid UserID should be provided.",
  "domains": [
    {
      "name": "Geography",
      "url": "http://www.surf.scss.tcd.ie/cityOntology/#Geography"
    },
    {
      "name": "Travel",
      "url": "http://www.surf.scss.tcd.ie/cityOntology/#Travel"
    }
  ],
  "id": "travel/getDrivingDirections",
  "state": true,
  "url": "http://surf.scss.tcd.ie/_provider_/travel/getDrivingDirections"
}