{
  "outputs": [
    {
      "name": "_HOTEL",
      "type": "http://127.0.0.1/ontology/travel.owl#Hotel",
      "desc": "Output of service VillageHotelService"
    }
  ],
  "capability": "atomic",
  "file": "village_hotel_service.owls",
  "provider": {
    "type": "webservice"
  },
  "inputs": [
    {
      "name": "_VILLAGE",
      "type": "http://127.0.0.1/ontology/portal.owl#Village",
      "desc": "Input of service VillageHotelService"
    }
  ],
  "name": "VillageHotelService",
  "description": "This service is used to know about list of hotels situated in a given village.",
  "domains": [
    {
      "name": "Travel",
      "url": "http://www.surf.scss.tcd.ie/cityOntology/#Travel"
    }
  ],
  "id": "travel/village_hotel_service",
  "state": true,
  "url": "http://surf.scss.tcd.ie/_provider_/travel/village_hotel_service"
}