{
  "outputs": [
    {
      "name": "_MAXPRICE",
      "type": "http://127.0.0.1/ontology/concept.owl#MaxPrice",
      "desc": "Output of service 4WheeledCar 2PersonBicycle MaxPrice service"
    }
  ],
  "capability": "atomic",
  "file": "4wheeledcar2personbicycle_maxprice_service.owls",
  "provider": {
    "type": "webservice"
  },
  "inputs": [
    {
      "name": "_2PERSONBICYCLE",
      "type": "http://127.0.0.1/ontology/my_ontology.owl#TwoPersonBicycle",
      "desc": "Input of service 4WheeledCar 2PersonBicycle MaxPrice service"
    },
    {
      "name": "_4WHEELEDCAR",
      "type": "http://127.0.0.1/ontology/my_ontology.owl#FourWheeledCar",
      "desc": "Input of service 4WheeledCar 2PersonBicycle MaxPrice service"
    }
  ],
  "name": "4WheeledCar 2PersonBicycle MaxPrice service",
  "description": "This service returns maxprice of the given pair of a 4(four) wheeled car and 2(two) person bicycle.",
  "domains": [
    {
      "name": "Vehicle_Sale_and_Rent",
      "url": "http://www.surf.scss.tcd.ie/cityOntology/#Vehicle_Sale_and_Rent"
    }
  ],
  "id": "vehicle/4wheeledcar2personbicycle_maxprice_service",
  "state": true,
  "url": "http://surf.scss.tcd.ie/_provider_/vehicle/4wheeledcar2personbicycle_maxprice_service"
}