{
  "outputs": [
    {
      "name": "_ruralarea",
      "type": "string",
      "desc": "Output of service SurfingRuralAreaService"
    }
  ],
  "provider": {
    "type": "asp"
  },
  "inputs": [
    {
      "name": "_surfing",
      "type": "string",
      "desc": "Input of service SurfingRuralAreaService"
    }
  ],
  "name": "SurfingRuralAreaService",
  "description": "This is the recommended service to know aboutthe rural area for surfing.",
  "domains": [
    {
      "name": "Vehicle_Sale_and_Rent",
      "url": "http://www.surf.scss.tcd.ie/cityOntology/#Vehicle_Sale_and_Rent"
    }
  ],
  "id": "tourism/surfing_ruralarea_service",
  "state": true,
  "url": "http://surf.scss.tcd.ie/_provider_/tourism/surfing_ruralarea_service"
}