{
  "outputs": [
    {
      "name": "_COMEDYFILM",
      "type": "http://127.0.0.1/ontology/my_ontology.owl#ComedyFilm",
      "desc": "Output of service Title Comedy MaxPrice Quality service"
    },
    {
      "name": "_MAXPRICE",
      "type": "http://127.0.0.1/ontology/concept.owl#MaxPrice",
      "desc": "Output of service Title Comedy MaxPrice Quality service"
    },
    {
      "name": "_QUALITY",
      "type": "http://127.0.0.1/ontology/finance_th_web.owl#quality",
      "desc": "Output of service Title Comedy MaxPrice Quality service"
    }
  ],
  "capability": "atomic",
  "file": "title_comedyfilmmaxpricequality_service.owls",
  "provider": {
    "type": "webservice"
  },
  "inputs": [
    {
      "name": "_TITLE",
      "type": "http://127.0.0.1/ontology/books.owl#Title",
      "desc": "Input of service Title Comedy MaxPrice Quality service"
    }
  ],
  "name": "Title Comedy MaxPrice Quality service",
  "description": "This service searches comedy films for the given title, and also returnsits max price and quality.",
  "domains": [
    {
      "name": "Communications",
      "url": "http://www.surf.scss.tcd.ie/cityOntology/#Communications"
    },
    {
      "name": "Entertainment_Products",
      "url": "http://www.surf.scss.tcd.ie/cityOntology/#Entertainment_Products"
    }
  ],
  "id": "entertainment/title_comedyfilmmaxpricequality_service",
  "state": true,
  "url": "http://surf.scss.tcd.ie/_provider_/entertainment/title_comedyfilmmaxpricequality_service"
}