{
    "capability": "atomic",
    "description": "This service returns accomodation information, hotel, resturant etcin the city of the given country.",
    "domains": [
        {
            "name": "Accommodation",
            "url": "http://www.surf.scss.tcd.ie/cityOntology/#Accommodation"
        }
    ],
    "file": "citycountry_accommodation_service.owls",
    "id": "travel/citycountry_accommodation_service",
    "inputs": [
        {
            "desc": "Input of service AccomodationInfoService",
            "name": "_COUNTRY",
            "type": "http://127.0.0.1/ontology/portal.owl#Country"
        },
        {
            "desc": "Input of service AccomodationInfoService",
            "name": "_CITY",
            "type": "http://127.0.0.1/ontology/travel.owl#City"
        }
    ],
    "name": "AccomodationInfoService",
    "outputs": [
        {
            "desc": "Output of service AccomodationInfoService",
            "name": "_ACCOMMODATION",
            "type": "http://127.0.0.1/ontology/travel.owl#Accommodation"
        }
    ],
    "provider": {
        "type": "webservice"
    },
    "state": true,
    "url": "http://surf.scss.tcd.ie/_provider_/travel/citycountry_accommodation_service"
}