{
  "outputs": [
    {
      "name": "_RECOMMENDEDPRICEINEURO",
      "type": "http://127.0.0.1/ontology/concept.owl#RecommendedPriceInEuro",
      "desc": "Output of service Recommended price of car model service"
    }
  ],
  "capability": "atomic",
  "file": "caryear_recommendedpriceineuro_service.owls",
  "provider": {
    "type": "webservice"
  },
  "inputs": [
    {
      "name": "_YEAR",
      "type": "http://127.0.0.1/ontology/SUMO.owl#Year",
      "desc": "Input of service Recommended price of car model service"
    },
    {
      "name": "_CAR",
      "type": "http://127.0.0.1/ontology/my_ontology.owl#Car",
      "desc": "Input of service Recommended price of car model service"
    }
  ],
  "name": "Recommended price of car model service",
  "description": "A client can acquire information of recommended car-renting price in Eurofor a car model whose year of production is given also.",
  "domains": [
    {
      "name": "Vehicle_Sale_and_Rent",
      "url": "http://www.surf.scss.tcd.ie/cityOntology/#Vehicle_Sale_and_Rent"
    }
  ],
  "id": "vehicle/caryear_recommendedpriceineuro_service",
  "state": true,
  "url": "http://surf.scss.tcd.ie/_provider_/vehicle/caryear_recommendedpriceineuro_service"
}