{
  "outputs": [
    {
      "name": "_IRISHCOFFEE",
      "type": "http://127.0.0.1/ontology/my_ontology.owl#IrishCoffee",
      "desc": "Output of service MIR service"
    },
    {
      "name": "_MIXERYCOLA",
      "type": "http://127.0.0.1/ontology/my_ontology.owl#MixeryCola",
      "desc": "Output of service MIR service"
    }
  ],
  "capability": "atomic",
  "file": "price_irishcoffeemixerycola_service.owls",
  "provider": {
    "type": "asp"
  },
  "inputs": [
    {
      "name": "_PRICE",
      "type": "http://127.0.0.1/ontology/concept.owl#Price",
      "desc": "Input of service MIR service"
    }
  ],
  "name": "MIR service",
  "description": "This service returns mixerycola and irishcoffee for a given price.",
  "domains": [
    {
      "name": "Food_and_Drinks",
      "url": "http://www.surf.scss.tcd.ie/cityOntology/#Food_and_Drinks"
    }
  ],
  "id": "food/price_irishcoffeemixerycola_service",
  "state": true,
  "url": "http://surf.scss.tcd.ie/_provider_/food/price_irishcoffeemixerycola_service"
}