{
  "outputs": [
    {
      "name": "_MAXPRICE",
      "type": "http://127.0.0.1/ontology/concept.owl#MaxPrice",
      "desc": "Output of service Beverage MaxPrice Physical-Quantity Service"
    },
    {
      "name": "_PHYSICAL-QUANTITY",
      "type": "http://127.0.0.1/ontology/support.owl#Physical-Quantity",
      "desc": "Output of service Beverage MaxPrice Physical-Quantity Service"
    }
  ],
  "capability": "atomic",
  "file": "beverage_maxpricephysical-quantity_service.owls",
  "provider": {
    "type": "asp"
  },
  "inputs": [
    {
      "name": "_BEVERAGE",
      "type": "http://127.0.0.1/ontology/SUMO.owl#Beverage",
      "desc": "Input of service Beverage MaxPrice Physical-Quantity Service"
    }
  ],
  "name": "Beverage MaxPrice Physical-Quantity Service",
  "description": "This service informs the physical-quantity and latest maximum pruchase market price of a given beverage item.",
  "domains": [
    {
      "name": "Food_and_Drinks",
      "url": "http://www.surf.scss.tcd.ie/cityOntology/#Food_and_Drinks"
    }
  ],
  "id": "food/beverage_maxpricephysical-quantity_service",
  "state": true,
  "url": "http://surf.scss.tcd.ie/_provider_/food/beverage_maxpricephysical-quantity_service"
}