{
  "outputs": [
    {
      "name": "_BEDANDBREAKFAST",
      "type": "http://127.0.0.1/ontology/travel.owl#BedAndBreakfast",
      "desc": "Output of service Geopolitical-Entity BedAndBreakfast Service"
    }
  ],
  "capability": "atomic",
  "file": "geopolitical-entity_bedandbreakfast_service.owls",
  "provider": {
    "type": "wsdn"
  },
  "inputs": [
    {
      "name": "_GEOPOLITICAL-ENTITY",
      "type": "http://127.0.0.1/ontology/portal.owl#Geopolitical-Entity",
      "desc": "Input of service Geopolitical-Entity BedAndBreakfast Service"
    }
  ],
  "name": "Geopolitical-Entity BedAndBreakfast Service",
  "description": "This service is a favourite service that returns available bed-and-breakfast info of the given geopolitical-entity.",
  "domains": [
    {
      "name": "Travel",
      "url": "http://www.surf.scss.tcd.ie/cityOntology/#Travel"
    },
    {
      "name": "Accommodation",
      "url": "http://www.surf.scss.tcd.ie/cityOntology/#Accommodation"
    }
  ],
  "id": "accommodation/geopolitical-entity_bedandbreakfast_service",
  "state": true,
  "url": "http://surf.scss.tcd.ie/_provider_/accommodation/geopolitical-entity_bedandbreakfast_service"
}