{
  "outputs": [
    {
      "name": "_HISTORICCONTENT",
      "type": "http://www.surf.scss.tcd.ie/IoTservices.owl#historicContent",
      "desc": "Output of service search_historic_content"
    }
  ],
  "provider": {
    "type": "ws"
  },
  "inputs": [
    {
      "name": "_HISTORICPLACEINFO",
      "type": "http://www.surf.scss.tcd.ie/IoTservices.owl#historicPlaceInfo",
      "desc": "Input of service search_historic_content"
    }
  ],
  "name": "search_historic_content",
  "description": "This is the service search_historic_content",
  "domains": [
    {
      "name": "Touristic_Place",
      "url": "http://www.surf.scss.tcd.ie/cityOntology/#Touristic_Place"
    },
    {
      "name": "History",
      "url": "http://www.surf.scss.tcd.ie/cityOntology/#History"
    }
  ],
  "id": "touristicplace/80_search_historic_content",
  "state": true,
  "url": "http://surf.scss.tcd.ie/_provider_/touristicplace/80_search_historic_content"
}