{
  "outputs": [
    {
      "name": "_LATITUDE",
      "type": "http://127.0.0.1/ontology/protont.owl#latitude",
      "desc": "Output of service Zip code location finder service."
    },
    {
      "name": "_LONGITUDE",
      "type": "http://127.0.0.1/ontology/protont.owl#longitude",
      "desc": "Output of service Zip code location finder service."
    }
  ],
  "capability": "atomic",
  "file": "getLocationOfUSCity.owls",
  "provider": {
    "type": "wsdn"
  },
  "inputs": [
    {
      "name": "_CITY",
      "type": "http://127.0.0.1/ontology/protonu.owl#City",
      "desc": "Input of service Zip code location finder service."
    },
    {
      "name": "_STATE",
      "type": "http://127.0.0.1/ontology/protonu.owl#State",
      "desc": "Input of service Zip code location finder service."
    }
  ],
  "name": "Zip code location finder service.",
  "description": "This is A service that provides the geographic location (either centre or geographic area), defined with latitude/longitude pair, of a US city identified via city name + state name.",
  "domains": [
    {
      "name": "Geography",
      "url": "http://www.surf.scss.tcd.ie/cityOntology/#Geography"
    },
    {
      "name": "Travel",
      "url": "http://www.surf.scss.tcd.ie/cityOntology/#Travel"
    }
  ],
  "id": "travel/getLocationOfUSCity",
  "state": true,
  "url": "http://surf.scss.tcd.ie/_provider_/travel/getLocationOfUSCity"
}