{
  "outputs": [
    {
      "name": "_RECOMMENDEDPRICE",
      "type": "http://127.0.0.1/ontology/concept.owl#RecommendedPrice",
      "desc": "Output of service ScienceFictionNovelRecommendedPrice Service"
    }
  ],
  "capability": "atomic",
  "file": "SFNRecommendedPrice_service.owls",
  "provider": {
    "type": "webservice"
  },
  "inputs": [
    {
      "name": "_SCIENCE-FICTION-NOVEL",
      "type": "http://127.0.0.1/ontology/books.owl#Science-Fiction-Novel",
      "desc": "Input of service ScienceFictionNovelRecommendedPrice Service"
    },
    {
      "name": "_USER",
      "type": "http://127.0.0.1/ontology/books.owl#User",
      "desc": "Input of service ScienceFictionNovelRecommendedPrice Service"
    }
  ],
  "name": "ScienceFictionNovelRecommendedPrice Service",
  "description": "This service returns recommended price of a science-fiction novel for a specific authorized user. The price is different for each user.",
  "domains": [
    {
      "name": "Entertainment_Products",
      "url": "http://www.surf.scss.tcd.ie/cityOntology/#Entertainment_Products"
    }
  ],
  "id": "books/userscience-fiction-novel_recommendedprice_service",
  "state": true,
  "url": "http://surf.scss.tcd.ie/_provider_/books/userscience-fiction-novel_recommendedprice_service"
}