{
  "outputs": [
    {
      "name": "_ADDRESS",
      "type": "http://127.0.0.1/ontology/portal.owl#Address",
      "desc": "Output of service ResearchAssistant address  service"
    }
  ],
  "capability": "atomic",
  "file": "research-assistant-in-academia_address_service.owls",
  "provider": {
    "type": "wsdn"
  },
  "inputs": [
    {
      "name": "_RESEARCH-ASSISTANT-IN-ACADEMIA",
      "type": "http://127.0.0.1/ontology/portal.owl#Research-Assistant-In-Academia",
      "desc": "Input of service ResearchAssistant address  service"
    }
  ],
  "name": "ResearchAssistant address  service",
  "description": "This service returns an address of a research assistant.",
  "domains": [
    {
      "name": "Educational",
      "url": "http://www.surf.scss.tcd.ie/cityOntology/#Educational"
    },
    {
      "name": "Research_and_Science",
      "url": "http://www.surf.scss.tcd.ie/cityOntology/#Research_and_Science"
    }
  ],
  "id": "education/research-assistant-in-academia_address_service",
  "state": true,
  "url": "http://surf.scss.tcd.ie/_provider_/education/research-assistant-in-academia_address_service"
}