{
  "outputs": [
    {
      "name": "_RELATEDCONTENT",
      "type": "http://www.surf.scss.tcd.ie/IoTservices.owl#relatedContent",
      "desc": "Output of service related_content"
    }
  ],
  "provider": {
    "type": "ws"
  },
  "inputs": [
    {
      "name": "_ACTIVITYINFO",
      "type": "http://www.surf.scss.tcd.ie/IoTservices.owl#activityInfo",
      "desc": "Input of service related_content"
    }
  ],
  "name": "related_content",
  "description": "This is the service related_content",
  "domains": [
    {
      "name": "Activity",
      "url": "http://www.surf.scss.tcd.ie/cityOntology/#Activity"
    }
  ],
  "id": "activity/77_related_content",
  "state": true,
  "url": "http://surf.scss.tcd.ie/_provider_/activity/77_related_content"
}