{
  "outputs": [
    {
      "name": "_lecturer-in-academia",
      "type": "string",
      "desc": "Output of service HigherEducationalOrganizationLecturers"
    }
  ],
  "provider": {
    "type": "wsdn"
  },
  "inputs": [
    {
      "name": "_higher-educational-organization",
      "type": "string",
      "desc": "Input of service HigherEducationalOrganizationLecturers"
    }
  ],
  "name": "HigherEducationalOrganizationLecturers",
  "description": "This service returns Lecturers of the given higher educational organization.",
  "domains": [
    {
      "name": "Health",
      "url": "http://www.surf.scss.tcd.ie/cityOntology/#Health"
    }
  ],
  "id": "educational/higher-educational-organization_lecturer-in-academia_service",
  "state": true,
  "url": "http://surf.scss.tcd.ie/_provider_/educational/higher-educational-organization_lecturer-in-academia_service"
}