{
    "capability": "atomic",
    "description": "This service informs about available luxury hotels in a given geographical region.",
    "domains": [
        {
            "name": "Accommodation",
            "url": "http://www.surf.scss.tcd.ie/cityOntology/#Accommodation"
        }
    ],
    "file": "geographical-region_luxuryhotel_service.owls",
    "id": "travel/geographical-region_luxuryhotel_service",
    "inputs": [
        {
            "desc": "Input of service Geographical-Region LuxuryHotel Service",
            "name": "_GEOGRAPHICAL-REGION",
            "type": "http://127.0.0.1/ontology/portal.owl#Geographical-Region"
        }
    ],
    "name": "Geographical-Region LuxuryHotel Service",
    "outputs": [
        {
            "desc": "Output of service Geographical-Region LuxuryHotel Service",
            "name": "_LUXURYHOTEL",
            "type": "http://127.0.0.1/ontology/travel.owl#LuxuryHotel"
        }
    ],
    "provider": {
        "type": "webservice"
    },
    "state": true,
    "url": "http://surf.scss.tcd.ie/_provider_/travel/geographical-region_luxuryhotel_service"
}