{
  "outputs": [
    {
      "name": "_AUTHOR",
      "type": "http://127.0.0.1/ontology/books.owl#Author",
      "desc": "Output of service NovelAuthorGenreService"
    },
    {
      "name": "_GENRE",
      "type": "http://127.0.0.1/ontology/books.owl#Genre",
      "desc": "Output of service NovelAuthorGenreService"
    }
  ],
  "capability": "atomic",
  "file": "novel_authorgenre_service.owls",
  "provider": {
    "type": "webservice"
  },
  "inputs": [
    {
      "name": "_NOVEL",
      "type": "http://127.0.0.1/ontology/books.owl#Novel",
      "desc": "Input of service NovelAuthorGenreService"
    }
  ],
  "name": "NovelAuthorGenreService",
  "description": "This service returns author of the novel and also its genre that showsthat the novel is comic, fantasy or science-fiction.",
  "domains": [
    {
      "name": "Educational",
      "url": "http://www.surf.scss.tcd.ie/cityOntology/#Educational"
    },
    {
      "name": "Entertainment_Products",
      "url": "http://www.surf.scss.tcd.ie/cityOntology/#Entertainment_Products"
    }
  ],
  "id": "books/novel_authorgenre_service",
  "state": true,
  "url": "http://surf.scss.tcd.ie/_provider_/books/novel_authorgenre_service"
}