{
  "outputs": [
    {
      "name": "_PRICE",
      "type": "http://127.0.0.1/ontology/concept.owl#Price",
      "desc": "Output of service PFP Service"
    },
    {
      "name": "_DAY",
      "type": "http://127.0.0.1/ontology/SUMO.owl#Day",
      "desc": "Output of service PFP Service"
    }
  ],
  "capability": "atomic",
  "file": "preparedfood_priceday_service.owls",
  "provider": {
    "type": "webservice"
  },
  "inputs": [
    {
      "name": "_PREPAREDFOOD",
      "type": "http://127.0.0.1/ontology/Mid-level-ontology.owl#PreparedFood",
      "desc": "Input of service PFP Service"
    }
  ],
  "name": "PFP Service",
  "description": "PFP is a reknown service that returns not only price of a given preparedfood, but also its expiration date.",
  "domains": [
    {
      "name": "Food_and_Drinks",
      "url": "http://www.surf.scss.tcd.ie/cityOntology/#Food_and_Drinks"
    }
  ],
  "id": "food/preparedfood_priceday_service",
  "state": true,
  "url": "http://surf.scss.tcd.ie/_provider_/food/preparedfood_priceday_service"
}