{
  "outputs": [
    {
      "name": "_year",
      "type": "string",
      "desc": "Output of service CheapCar Year Price Service"
    },
    {
      "name": "_price",
      "type": "string",
      "desc": "Output of service CheapCar Year Price Service"
    }
  ],
  "provider": {
    "type": "wsdn"
  },
  "inputs": [
    {
      "name": "_cheapcar",
      "type": "string",
      "desc": "Input of service CheapCar Year Price Service"
    }
  ],
  "name": "CheapCar Year Price Service",
  "description": "This service provides the and model year of a given cheap car.",
  "domains": [
    {
      "name": "Entertainment_Products",
      "url": "http://www.surf.scss.tcd.ie/cityOntology/#Entertainment_Products"
    }
  ],
  "id": "retail/cheapcar_yearprice_service",
  "state": true,
  "url": "http://surf.scss.tcd.ie/_provider_/retail/cheapcar_yearprice_service"
}