{
  "outputs": [
    {
      "name": "_REVIEW",
      "type": "http://127.0.0.1/ontology/books.owl#Review",
      "desc": "Output of service BookPriceService"
    },
    {
      "name": "_PRICE",
      "type": "http://127.0.0.1/ontology/concept.owl#Price",
      "desc": "Output of service BookPriceService"
    }
  ],
  "capability": "atomic",
  "file": "book_reviewprice_service.owls",
  "provider": {
    "type": "asp"
  },
  "inputs": [
    {
      "name": "_BOOK",
      "type": "http://127.0.0.1/ontology/books.owl#Book",
      "desc": "Input of service BookPriceService"
    }
  ],
  "name": "BookPriceService",
  "description": "This service returns not only purchase price of a book, but also its review.",
  "domains": [
    {
      "name": "Entertainment_Products",
      "url": "http://www.surf.scss.tcd.ie/cityOntology/#Entertainment_Products"
    },
    {
      "name": "Educational",
      "url": "http://www.surf.scss.tcd.ie/cityOntology/#Educational"
    }
  ],
  "id": "books/book_reviewprice_service",
  "state": true,
  "url": "http://surf.scss.tcd.ie/_provider_/books/book_reviewprice_service"
}