{
  "outputs": [
    {
      "name": "_FUNDING",
      "type": "http://127.0.0.1/ontology/SUMO.owl#Funding",
      "desc": "Output of service GermanGovernment Academic-Degree Funding Duration Service"
    },
    {
      "name": "_DURATION",
      "type": "http://127.0.0.1/ontology/support.owl#Duration",
      "desc": "Output of service GermanGovernment Academic-Degree Funding Duration Service"
    }
  ],
  "capability": "atomic",
  "file": "academic-degree_fundingduration_GermanGovservice.owls",
  "provider": {
    "type": "webservice"
  },
  "inputs": [
    {
      "name": "_ACADEMIC-DEGREE",
      "type": "http://127.0.0.1/ontology/portal.owl#Academic-Degree",
      "desc": "Input of service GermanGovernment Academic-Degree Funding Duration Service"
    }
  ],
  "name": "GermanGovernment Academic-Degree Funding Duration Service",
  "description": "This service informs about funding offered for the academic-degree by the german government. The funding\u0027s duration is informed as well.",
  "domains": [
    {
      "name": "Educational",
      "url": "http://www.surf.scss.tcd.ie/cityOntology/#Educational"
    },
    {
      "name": "Government_and_Planning",
      "url": "http://www.surf.scss.tcd.ie/cityOntology/#Government_and_Planning"
    }
  ],
  "id": "education/academic-degree_fundingduration_GermanGovservice",
  "state": true,
  "url": "http://surf.scss.tcd.ie/_provider_/education/academic-degree_fundingduration_GermanGovservice"
}