{
  "outputs": [
    {
      "name": "_AUTHOR",
      "type": "http://127.0.0.1/ontology/books.owl#Author",
      "desc": "Output of service NovelAuthorCommittingService"
    },
    {
      "name": "_COMMITTING",
      "type": "http://127.0.0.1/ontology/SUMO.owl#Committing",
      "desc": "Output of service NovelAuthorCommittingService"
    }
  ],
  "capability": "atomic",
  "file": "novel_authorcommitting_service.owls",
  "provider": {
    "type": "wsdn"
  },
  "inputs": [
    {
      "name": "_NOVEL",
      "type": "http://127.0.0.1/ontology/books.owl#Novel",
      "desc": "Input of service NovelAuthorCommittingService"
    }
  ],
  "name": "NovelAuthorCommittingService",
  "description": "This service returns author of the novel, and his commitment.",
  "domains": [
    {
      "name": "Educational",
      "url": "http://www.surf.scss.tcd.ie/cityOntology/#Educational"
    },
    {
      "name": "Entertainment_Products",
      "url": "http://www.surf.scss.tcd.ie/cityOntology/#Entertainment_Products"
    }
  ],
  "id": "books/novel_authorcommitting_service",
  "state": true,
  "url": "http://surf.scss.tcd.ie/_provider_/books/novel_authorcommitting_service"
}