{
  "outputs": [
    {
      "name": "_ruralarea",
      "type": "string",
      "desc": "Output of service SportsRuralAreaService"
    }
  ],
  "provider": {
    "type": "asp"
  },
  "inputs": [
    {
      "name": "_sports",
      "type": "string",
      "desc": "Input of service SportsRuralAreaService"
    }
  ],
  "name": "SportsRuralAreaService",
  "description": "This is a nice service to know aboutthe rural area where you can the sports especially hiking and surfing.",
  "domains": [
    {
      "name": "Transport_and_Mobility",
      "url": "http://www.surf.scss.tcd.ie/cityOntology/#Transport_and_Mobility"
    }
  ],
  "id": "tourism/sports_ruralarea_service",
  "state": true,
  "url": "http://surf.scss.tcd.ie/_provider_/tourism/sports_ruralarea_service"
}