{
  "outputs": [
    {
      "name": "_SKILLEDOCCUPATION",
      "type": "http://127.0.0.1/ontology/Mid-level-ontology.owl#SkilledOccupation",
      "desc": "Output of service Municipal-Unit SkilledOcupation TimeMeasure service"
    },
    {
      "name": "_TIMEMEASURE",
      "type": "http://127.0.0.1/ontology/SUMO.owl#TimeMeasure",
      "desc": "Output of service Municipal-Unit SkilledOcupation TimeMeasure service"
    }
  ],
  "capability": "atomic",
  "file": "municipal-unit_skilledoccupationtimemeasure_service.owls",
  "provider": {
    "type": "asp"
  },
  "inputs": [
    {
      "name": "_MUNICIPAL-UNIT",
      "type": "http://127.0.0.1/ontology/portal.owl#Municipal-Unit",
      "desc": "Input of service Municipal-Unit SkilledOcupation TimeMeasure service"
    }
  ],
  "name": "Municipal-Unit SkilledOcupation TimeMeasure service",
  "description": "This service returns skilled occupation job in a given municipal-unit and its timemeasure (duration).",
  "domains": [
    {
      "name": "Educational",
      "url": "http://www.surf.scss.tcd.ie/cityOntology/#Educational"
    }
  ],
  "id": "education/municipal-unit_skilledoccupationtimemeasure_service",
  "state": true,
  "url": "http://surf.scss.tcd.ie/_provider_/education/municipal-unit_skilledoccupationtimemeasure_service"
}