{
  "outputs": [
    {
      "name": "_PRODUCTS",
      "type": "http://www.surf.scss.tcd.ie/IoTservices.owl#products",
      "desc": "Output of service buy_furniture_products"
    }
  ],
  "provider": {
    "type": "wsdn"
  },
  "inputs": [
    {
      "name": "_PRODUCTDATA",
      "type": "http://www.surf.scss.tcd.ie/IoTservices.owl#productData",
      "desc": "Input of service buy_furniture_products"
    }
  ],
  "name": "buy_furniture_products",
  "description": "This is the service buy_furniture_products",
  "domains": [
    {
      "name": "Furniture_and_Housing",
      "url": "http://www.surf.scss.tcd.ie/cityOntology/#Furniture_and_Housing"
    }
  ],
  "id": "furniture/133_buy_furniture_products",
  "state": true,
  "url": "http://surf.scss.tcd.ie/_provider_/furniture/133_buy_furniture_products"
}