{
  "outputs": [
    {
      "name": "_HOTEL",
      "type": "http://127.0.0.1/ontology/travel.owl#Hotel",
      "desc": "Output of service CityHotelInfoService"
    }
  ],
  "capability": "atomic",
  "file": "city_hotel_Saarlandservice.owls",
  "provider": {
    "type": "wsdn"
  },
  "inputs": [
    {
      "name": "_CITY",
      "type": "http://127.0.0.1/ontology/travel.owl#City",
      "desc": "Input of service CityHotelInfoService"
    }
  ],
  "name": "CityHotelInfoService",
  "description": "This service returns available hotels in a given city from Saarland state in germany.",
  "domains": [
    {
      "name": "Travel",
      "url": "http://www.surf.scss.tcd.ie/cityOntology/#Travel"
    }
  ],
  "id": "travel/city_hotel_service",
  "state": true,
  "url": "http://surf.scss.tcd.ie/_provider_/travel/city_hotel_service"
}