{
  "outputs": [
    {
      "name": "_PATIENTINFO",
      "type": "http://www.surf.scss.tcd.ie/IoTservices.owl#patientInfo",
      "desc": "Output of service detect_patient_emergency"
    }
  ],
  "provider": {
    "type": "wsdn"
  },
  "inputs": [
    {
      "name": "_PATIENTALERT",
      "type": "http://www.surf.scss.tcd.ie/IoTservices.owl#patientAlert",
      "desc": "Input of service detect_patient_emergency"
    }
  ],
  "name": "detect_patient_emergency",
  "description": "This is the service detect_patient_emergency",
  "domains": [
    {
      "name": "Health",
      "url": "http://www.surf.scss.tcd.ie/cityOntology/#Health"
    },
    {
      "name": "Safety_and_Emergencies",
      "url": "http://www.surf.scss.tcd.ie/cityOntology/#Safety_and_Emergencies"
    }
  ],
  "id": "health/92_detect_patient_emergency",
  "state": true,
  "url": "http://surf.scss.tcd.ie/_provider_/health/92_detect_patient_emergency"
}