{
  "outputs": [
    {
      "name": "_WEATHERSEASON",
      "type": "http://127.0.0.1/ontology/Mid-level-ontology.owl#WeatherSeason",
      "desc": "Output of service GEWS Service"
    }
  ],
  "capability": "atomic",
  "file": "geographical-region_weatherseason_service.owls",
  "provider": {
    "type": "webservice"
  },
  "inputs": [
    {
      "name": "_GEOGRAPHICAL-REGION",
      "type": "http://127.0.0.1/ontology/portal.owl#Geographical-Region",
      "desc": "Input of service GEWS Service"
    }
  ],
  "name": "GEWS Service",
  "description": "GEWS service is used to get season report of a particular geographical region.",
  "domains": [
    {
      "name": "Travel",
      "url": "http://www.surf.scss.tcd.ie/cityOntology/#Travel"
    },
    {
      "name": "Weather",
      "url": "http://www.surf.scss.tcd.ie/cityOntology/#Weather"
    }
  ],
  "id": "weather/geographical-region_weatherseason_service",
  "state": true,
  "url": "http://surf.scss.tcd.ie/_provider_/weather/geographical-region_weatherseason_service"
}