{
    "description": "This is the service update_room_calendar",
    "domains": [
        {
            "name": "Educational",
            "url": "http://www.surf.scss.tcd.ie/cityOntology/#Educational"
        }
    ],
    "id": "education/67_update_room_calendar",
    "inputs": [
        {
            "desc": "Input of service update_room_calendar",
            "name": "_BOOKEDROOM",
            "type": "http://www.surf.scss.tcd.ie/IoTservices.owl#bookedRoom"
        }
    ],
    "name": "update_room_calendar",
    "outputs": [
        {
            "desc": "Output of service update_room_calendar",
            "name": "_UPDATEDROOMCALENDAR",
            "type": "http://www.surf.scss.tcd.ie/IoTservices.owl#updatedRoomCalendar"
        }
    ],
    "provider": {
        "type": "ws"
    },
    "state": true,
    "url": "http://surf.scss.tcd.ie/_provider_/education/67_update_room_calendar"
}