{
  "outputs": [
    {
      "name": "_hotel",
      "type": "string",
      "desc": "Output of service HotelInfoService"
    }
  ],
  "provider": {
    "type": "webservice"
  },
  "inputs": [
    {
      "name": "_city",
      "type": "string",
      "desc": "Input of service HotelInfoService"
    },
    {
      "name": "_country",
      "type": "string",
      "desc": "Input of service HotelInfoService"
    }
  ],
  "name": "HotelInfoService",
  "description": "It is a reliable service to return hotel of the city of the country",
  "domains": [
    {
      "name": "Vehicle_Sale_and_Rent",
      "url": "http://www.surf.scss.tcd.ie/cityOntology/#Vehicle_Sale_and_Rent"
    }
  ],
  "id": "tourism/countrycity_hotel_service",
  "state": true,
  "url": "http://surf.scss.tcd.ie/_provider_/tourism/countrycity_hotel_service"
}