{
  "outputs": [
    {
      "name": "_MAXPRICE",
      "type": "http://127.0.0.1/ontology/concept.owl#MaxPrice",
      "desc": "Output of service Meat MaxPrice Quantity Service"
    },
    {
      "name": "_QUANTITY",
      "type": "http://127.0.0.1/ontology/support.owl#Quantity",
      "desc": "Output of service Meat MaxPrice Quantity Service"
    }
  ],
  "capability": "atomic",
  "file": "meat_maxpricequantity_service.owls",
  "provider": {
    "type": "asp"
  },
  "inputs": [
    {
      "name": "_MEAT",
      "type": "http://127.0.0.1/ontology/SUMO.owl#Meat",
      "desc": "Input of service Meat MaxPrice Quantity Service"
    }
  ],
  "name": "Meat MaxPrice Quantity Service",
  "description": "This service informs the quantity and maximum price of a given meat item.",
  "domains": [
    {
      "name": "Educational",
      "url": "http://www.surf.scss.tcd.ie/cityOntology/#Educational"
    }
  ],
  "id": "education/meat_maxpricequantity_service",
  "state": true,
  "url": "http://surf.scss.tcd.ie/_provider_/education/meat_maxpricequantity_service"
}