{
  "outputs": [
    {
      "name": "_COLA",
      "type": "http://127.0.0.1/ontology/my_ontology.owl#Cola",
      "desc": "Output of service BreadProviderService"
    },
    {
      "name": "_BREADORBISCUIT",
      "type": "http://127.0.0.1/ontology/Mid-level-ontology.owl#BreadOrBiscuit",
      "desc": "Output of service BreadProviderService"
    }
  ],
  "capability": "atomic",
  "file": "maxprice_colabreadorbiscuit_Bothservice.owls",
  "provider": {
    "type": "wsdn"
  },
  "inputs": [
    {
      "name": "_MAXPRICE",
      "type": "http://127.0.0.1/ontology/concept.owl#MaxPrice",
      "desc": "Input of service BreadProviderService"
    }
  ],
  "name": "BreadProviderService",
  "description": "This service provides a bread/biscuit for the maximum price and a cola (a small package for advertisement of another company)..",
  "domains": [
    {
      "name": "Food_and_Drinks",
      "url": "http://www.surf.scss.tcd.ie/cityOntology/#Food_and_Drinks"
    }
  ],
  "id": "food/maxprice_colabreadorbiscuit_Bothservice",
  "state": true,
  "url": "http://surf.scss.tcd.ie/_provider_/food/maxprice_colabreadorbiscuit_Bothservice"
}