{
  "outputs": [
    {
      "name": "_FODDER",
      "type": "http://127.0.0.1/ontology/Mid-level-ontology.owl#Fodder",
      "desc": "Output of service FodderSellerService"
    }
  ],
  "capability": "atomic",
  "file": "grocerystore_fodder_AnimalFoodservice.owls",
  "provider": {
    "type": "asp"
  },
  "inputs": [
    {
      "name": "_GROCERYSTORE",
      "type": "http://127.0.0.1/ontology/Mid-level-ontology.owl#GroceryStore",
      "desc": "Input of service FodderSellerService"
    }
  ],
  "name": "FodderSellerService",
  "description": "This serive returns Fodder, food for animal, obtainable from the certain grocery store.",
  "domains": [
    {
      "name": "Food_and_Drinks",
      "url": "http://www.surf.scss.tcd.ie/cityOntology/#Food_and_Drinks"
    }
  ],
  "id": "food/grocerystore_fodder_AnimalFoodservice",
  "state": true,
  "url": "http://surf.scss.tcd.ie/_provider_/food/grocerystore_fodder_AnimalFoodservice"
}