{
  "outputs": [
    {
      "name": "_CALENDAR-DATE",
      "type": "http://127.0.0.1/ontology/support.owl#Calendar-Date",
      "desc": "Output of service CameraPriceService"
    },
    {
      "name": "_PRICE",
      "type": "http://127.0.0.1/ontology/concept.owl#Price",
      "desc": "Output of service CameraPriceService"
    },
    {
      "name": "_CAMERA",
      "type": "http://127.0.0.1/ontology/extendedCamera.owl#Camera",
      "desc": "Output of service CameraPriceService"
    }
  ],
  "capability": "atomic",
  "file": "shoppingmall_calendar-datepricecamera_service.owls",
  "provider": {
    "type": "webservice"
  },
  "inputs": [
    {
      "name": "_SHOPPINGMALL",
      "type": "http://127.0.0.1/ontology/Mid-level-ontology.owl#ShoppingMall",
      "desc": "Input of service CameraPriceService"
    }
  ],
  "name": "CameraPriceService",
  "description": "This service informs you about available camera, its price and availability time in the certain shoppingmall.",
  "domains": [
    {
      "name": "Technology",
      "url": "http://www.surf.scss.tcd.ie/cityOntology/#Technology"
    }
  ],
  "id": "technology/shoppingmall_calendar-datepricecamera_service",
  "state": true,
  "url": "http://surf.scss.tcd.ie/_provider_/technology/shoppingmall_calendar-datepricecamera_service"
}