{
  "outputs": [
    {
      "name": "_PUBLICATION",
      "type": "http://127.0.0.1/ontology/portal.owl#Publication",
      "desc": "Output of service PublicationSearchingService"
    }
  ],
  "capability": "atomic",
  "file": "isbn_publication_service.owls",
  "provider": {
    "type": "webservice"
  },
  "inputs": [
    {
      "name": "_ISBN",
      "type": "http://127.0.0.1/ontology/portal.owl#ISBN",
      "desc": "Input of service PublicationSearchingService"
    }
  ],
  "name": "PublicationSearchingService",
  "description": "This service returns a publication title on given ISBN.",
  "domains": [
    {
      "name": "Educational",
      "url": "http://www.surf.scss.tcd.ie/cityOntology/#Educational"
    },
    {
      "name": "Entertainment_Products",
      "url": "http://www.surf.scss.tcd.ie/cityOntology/#Entertainment_Products"
    }
  ],
  "id": "books/isbn_publication_service",
  "state": true,
  "url": "http://surf.scss.tcd.ie/_provider_/books/isbn_publication_service"
}