{
  "outputs": [
    {
      "name": "_novel",
      "type": "string",
      "desc": "Output of service author_novelprice_service"
    },
    {
      "name": "_price",
      "type": "string",
      "desc": "Output of service author_novelprice_service"
    }
  ],
  "provider": {
    "type": "webservice"
  },
  "inputs": [
    {
      "name": "_author",
      "type": "string",
      "desc": "Input of service author_novelprice_service"
    }
  ],
  "name": "author_novelprice_service",
  "description": "This service is about retail",
  "domains": [
    {
      "name": "Religious",
      "url": "http://www.surf.scss.tcd.ie/cityOntology/#Religious"
    }
  ],
  "id": "retail/author_novelprice_service",
  "state": true,
  "url": "http://surf.scss.tcd.ie/_provider_/retail/author_novelprice_service"
}