{
  "outputs": [
    {
      "name": "_MAXPRICE",
      "type": "http://127.0.0.1/ontology/concept.owl#MaxPrice",
      "desc": "Output of service MediaPlayer MaxPrice service"
    }
  ],
  "capability": "atomic",
  "file": "mediaplayer_maxprice_service.owls",
  "provider": {
    "type": "webservice"
  },
  "inputs": [
    {
      "name": "_MEDIAPLAYER",
      "type": "http://127.0.0.1/ontology/my_ontology.owl#MediaPlayer",
      "desc": "Input of service MediaPlayer MaxPrice service"
    }
  ],
  "name": "MediaPlayer MaxPrice service",
  "description": "This service returns the max price of a given media player brand.",
  "domains": [
    {
      "name": "Technology",
      "url": "http://www.surf.scss.tcd.ie/cityOntology/#Technology"
    }
  ],
  "id": "technology/mediaplayer_maxprice_service",
  "state": true,
  "url": "http://surf.scss.tcd.ie/_provider_/technology/mediaplayer_maxprice_service"
}