{
  "outputs": [
    {
      "name": "_SANDWICH",
      "type": "http://127.0.0.1/ontology/Mid-level-ontology.owl#Sandwich",
      "desc": "Output of service GroceryStore Sandwich Quantity Service"
    },
    {
      "name": "_QUANTITY",
      "type": "http://127.0.0.1/ontology/support.owl#Quantity",
      "desc": "Output of service GroceryStore Sandwich Quantity Service"
    }
  ],
  "capability": "atomic",
  "file": "grocerystore_sandwichquantity_service.owls",
  "provider": {
    "type": "wsdn"
  },
  "inputs": [
    {
      "name": "_GROCERYSTORE",
      "type": "http://127.0.0.1/ontology/Mid-level-ontology.owl#GroceryStore",
      "desc": "Input of service GroceryStore Sandwich Quantity Service"
    }
  ],
  "name": "GroceryStore Sandwich Quantity Service",
  "description": "This service informs about sandwich type which is available in a given grocery store and its available quantity.",
  "domains": [
    {
      "name": "Food_and_Drinks",
      "url": "http://www.surf.scss.tcd.ie/cityOntology/#Food_and_Drinks"
    }
  ],
  "id": "food/grocerystore_sandwichquantity_service",
  "state": true,
  "url": "http://surf.scss.tcd.ie/_provider_/food/grocerystore_sandwichquantity_service"
}