{
  "outputs": [
    {
      "name": "_PUBLICATION",
      "type": "http://127.0.0.1/ontology/SUMO.owl#Publication",
      "desc": "Output of service PublicationFounderService"
    }
  ],
  "capability": "atomic",
  "file": "text_publication_service.owls",
  "provider": {
    "type": "wsdn"
  },
  "inputs": [
    {
      "name": "_TEXT",
      "type": "http://127.0.0.1/ontology/SUMO.owl#Text",
      "desc": "Input of service PublicationFounderService"
    }
  ],
  "name": "PublicationFounderService",
  "description": "This service returns the information of a publication whose publication numbermatches the given publication-number in a specific format text.",
  "domains": [
    {
      "name": "Educational",
      "url": "http://www.surf.scss.tcd.ie/cityOntology/#Educational"
    }
  ],
  "id": "education/text_publication_service",
  "state": true,
  "url": "http://surf.scss.tcd.ie/_provider_/education/text_publication_service"
}