{
    "capability": "atomic",
    "description": "This service returns lecturer of the given organization.",
    "domains": [
        {
            "name": "Educational",
            "url": "http://www.surf.scss.tcd.ie/cityOntology/#Educational"
        }
    ],
    "file": "organization_lecturer-in-academia_service.owls",
    "id": "education/organization_lecturer-in-academia_service",
    "inputs": [
        {
            "desc": "Input of service OrganizationLecturer Service",
            "name": "_ORGANIZATION",
            "type": "http://127.0.0.1/ontology/portal.owl#Organization"
        }
    ],
    "name": "OrganizationLecturer Service",
    "outputs": [
        {
            "desc": "Output of service OrganizationLecturer Service",
            "name": "_LECTURER-IN-ACADEMIA",
            "type": "http://127.0.0.1/ontology/portal.owl#Lecturer-In-Academia"
        }
    ],
    "provider": {
        "type": "wsdn"
    },
    "state": true,
    "url": "http://surf.scss.tcd.ie/_provider_/education/organization_lecturer-in-academia_service"
}