{
    "capability": "atomic",
    "description": "This service returns skilledoccupation job in a given geopolitical-entity and its time duration.",
    "domains": [
        {
            "name": "Industry",
            "url": "http://www.surf.scss.tcd.ie/cityOntology/#Industry"
        }
    ],
    "file": "geopolitical-entity_skilledoccupationtimeduration_service.owls",
    "id": "education/geopolitical-entity_skilledoccupationtimeduration_service",
    "inputs": [
        {
            "desc": "Input of service Geopolitical-Entity SkilledOccupation TimeDuration service",
            "name": "_GEOPOLITICAL-ENTITY",
            "type": "http://127.0.0.1/ontology/portal.owl#Geopolitical-Entity"
        }
    ],
    "name": "Geopolitical-Entity SkilledOccupation TimeDuration service",
    "outputs": [
        {
            "desc": "Output of service Geopolitical-Entity SkilledOccupation TimeDuration service",
            "name": "_SKILLEDOCCUPATION",
            "type": "http://127.0.0.1/ontology/Mid-level-ontology.owl#SkilledOccupation"
        },
        {
            "desc": "Output of service Geopolitical-Entity SkilledOccupation TimeDuration service",
            "name": "_TIMEDURATION",
            "type": "http://127.0.0.1/ontology/SUMO.owl#TimeDuration"
        }
    ],
    "provider": {
        "type": "wsdn"
    },
    "state": true,
    "url": "http://surf.scss.tcd.ie/_provider_/education/geopolitical-entity_skilledoccupationtimeduration_service"
}