{
  "outputs": [
    {
      "name": "_WHISKEY",
      "type": "http://127.0.0.1/ontology/my_ontology.owl#Whiskey",
      "desc": "Output of service WhiskeyService"
    },
    {
      "name": "_COLABEER",
      "type": "http://127.0.0.1/ontology/my_ontology.owl#ColaBeer",
      "desc": "Output of service WhiskeyService"
    }
  ],
  "capability": "atomic",
  "file": "maxprice_whiskeycolabeer_service.owls",
  "provider": {
    "type": "wsdn"
  },
  "inputs": [
    {
      "name": "_MAXPRICE",
      "type": "http://127.0.0.1/ontology/concept.owl#MaxPrice",
      "desc": "Input of service WhiskeyService"
    }
  ],
  "name": "WhiskeyService",
  "description": "This service provides a whiskey and colabeer for the maximum price",
  "domains": [
    {
      "name": "Food_and_Drinks",
      "url": "http://www.surf.scss.tcd.ie/cityOntology/#Food_and_Drinks"
    }
  ],
  "id": "food/maxprice_whiskeycolabeer_service",
  "state": true,
  "url": "http://surf.scss.tcd.ie/_provider_/food/maxprice_whiskeycolabeer_service"
}