{
  "outputs": [
    {
      "name": "_BOOK",
      "type": "http://127.0.0.1/ontology/books.owl#Book",
      "desc": "Output of service Author Book TaxFreePrice Service"
    },
    {
      "name": "_TAXFREEPRICE",
      "type": "http://127.0.0.1/ontology/concept.owl#TaxFreePrice",
      "desc": "Output of service Author Book TaxFreePrice Service"
    }
  ],
  "capability": "atomic",
  "file": "author_booktaxfreeprice_service.owls",
  "provider": {
    "type": "webservice"
  },
  "inputs": [
    {
      "name": "_AUTHOR",
      "type": "http://127.0.0.1/ontology/books.owl#Author",
      "desc": "Input of service Author Book TaxFreePrice Service"
    }
  ],
  "name": "Author Book TaxFreePrice Service",
  "description": "This service returns book titles written by the given author. The taxfree price is also informed.",
  "domains": [
    {
      "name": "Entertainment_Products",
      "url": "http://www.surf.scss.tcd.ie/cityOntology/#Entertainment_Products"
    }
  ],
  "id": "books/author_booktaxfreeprice_service",
  "state": true,
  "url": "http://surf.scss.tcd.ie/_provider_/books/author_booktaxfreeprice_service"
}