{
  "outputs": [
    {
      "name": "_BOOKSTATUS",
      "type": "http://www.surf.scss.tcd.ie/IoTservices.owl#bookStatus",
      "desc": "Output of service book_status"
    }
  ],
  "provider": {
    "type": "wsdn"
  },
  "inputs": [
    {
      "name": "_BOOKSINFORMATION",
      "type": "http://www.surf.scss.tcd.ie/IoTservices.owl#booksInformation",
      "desc": "Input of service book_status"
    }
  ],
  "name": "book_status",
  "description": "This is the service book_status",
  "domains": [
    {
      "name": "Educational",
      "url": "http://www.surf.scss.tcd.ie/cityOntology/#Educational"
    },
    {
      "name": "Research_and_Science",
      "url": "http://www.surf.scss.tcd.ie/cityOntology/#Research_and_Science"
    }
  ],
  "id": "researchandscience/56_book_status",
  "state": true,
  "url": "http://surf.scss.tcd.ie/_provider_/researchandscience/56_book_status"
}