{
  "outputs": [
    {
      "name": "_BIOPSY",
      "type": "http://127.0.0.1/ontology/Mid-level-ontology.owl#Biopsy",
      "desc": "Output of service CareOrganization Biopsy Availability"
    }
  ],
  "capability": "atomic",
  "file": "careorganization_biopsy_service.owls",
  "provider": {
    "type": "asp"
  },
  "inputs": [
    {
      "name": "_CAREORGANIZATION",
      "type": "http://127.0.0.1/ontology/Mid-level-ontology.owl#CareOrganization",
      "desc": "Input of service CareOrganization Biopsy Availability"
    }
  ],
  "name": "CareOrganization Biopsy Availability",
  "description": "This service returns certain type biopsy available in the certain care organization.",
  "domains": [
    {
      "name": "Health",
      "url": "http://www.surf.scss.tcd.ie/cityOntology/#Health"
    }
  ],
  "id": "medical/careorganization_biopsy_service",
  "state": true,
  "url": "http://surf.scss.tcd.ie/_provider_/medical/careorganization_biopsy_service"
}