{
  "outputs": [
    {
      "name": "_price",
      "type": "string",
      "desc": "Output of service SFNpriceAuthor Service"
    },
    {
      "name": "_author",
      "type": "string",
      "desc": "Output of service SFNpriceAuthor Service"
    }
  ],
  "provider": {
    "type": "wsdn"
  },
  "inputs": [
    {
      "name": "_science-fiction-novel",
      "type": "string",
      "desc": "Input of service SFNpriceAuthor Service"
    }
  ],
  "name": "SFNpriceAuthor Service",
  "description": "SFN is an attractive service to get price and author of a science-fiction novel.",
  "domains": [
    {
      "name": "Medicines",
      "url": "http://www.surf.scss.tcd.ie/cityOntology/#Medicines"
    }
  ],
  "id": "retail/science-fiction-novel_priceauthor_service",
  "state": true,
  "url": "http://surf.scss.tcd.ie/_provider_/retail/science-fiction-novel_priceauthor_service"
}