{
  "outputs": [
    {
      "name": "_CITY",
      "type": "http://127.0.0.1/ontology/travel.owl#City",
      "desc": "Output of service HikingSurfingCityService"
    }
  ],
  "capability": "atomic",
  "file": "hikingsurfing_city_service.owls",
  "provider": {
    "type": "asp"
  },
  "inputs": [
    {
      "name": "_SURFING",
      "type": "http://127.0.0.1/ontology/travel.owl#Surfing",
      "desc": "Input of service HikingSurfingCityService"
    },
    {
      "name": "_HIKING",
      "type": "http://127.0.0.1/ontology/travel.owl#Hiking",
      "desc": "Input of service HikingSurfingCityService"
    }
  ],
  "name": "HikingSurfingCityService",
  "description": "This is a nice service to know aboutthe city where you can find both sports hiking and surfing.",
  "domains": [
    {
      "name": "Travel",
      "url": "http://www.surf.scss.tcd.ie/cityOntology/#Travel"
    },
    {
      "name": "Activity",
      "url": "http://www.surf.scss.tcd.ie/cityOntology/#Activity"
    }
  ],
  "id": "activity/hikingsurfing_city_service",
  "state": true,
  "url": "http://surf.scss.tcd.ie/_provider_/activity/hikingsurfing_city_service"
}