{
  "outputs": [
    {
      "name": "_SCHOLARSHIP",
      "type": "http://127.0.0.1/ontology/Mid-level-ontology.owl#Scholarship",
      "desc": "Output of service GovernementOrganization ScholarshipService"
    }
  ],
  "capability": "atomic",
  "file": "governmentorganization_scholarship_service.owls",
  "provider": {
    "type": "webservice"
  },
  "inputs": [
    {
      "name": "_GOVERNMENTORGANIZATION",
      "type": "http://127.0.0.1/ontology/SUMO.owl#GovernmentOrganization",
      "desc": "Input of service GovernementOrganization ScholarshipService"
    }
  ],
  "name": "GovernementOrganization ScholarshipService",
  "description": "It is the recommended service to inform about available scholarship offered from the given government organization.",
  "domains": [
    {
      "name": "Educational",
      "url": "http://www.surf.scss.tcd.ie/cityOntology/#Educational"
    }
  ],
  "id": "education/governmentorganization_scholarship_service",
  "state": true,
  "url": "http://surf.scss.tcd.ie/_provider_/education/governmentorganization_scholarship_service"
}