{
  "outputs": [
    {
      "name": "_PREDICTING",
      "type": "http://127.0.0.1/ontology/SUMO.owl#Predicting",
      "desc": "Output of service MedicalClinic Predicting service"
    }
  ],
  "capability": "atomic",
  "file": "medicalclinic_predicting_service.owls",
  "provider": {
    "type": "webservice"
  },
  "inputs": [
    {
      "name": "_MEDICALCLINIC",
      "type": "http://127.0.0.1/ontology/Mid-level-ontology.owl#MedicalClinic",
      "desc": "Input of service MedicalClinic Predicting service"
    }
  ],
  "name": "MedicalClinic Predicting service",
  "description": "This service informs you about the predicting process, that is used for complex syndrome,avialable in a given medical clinic.",
  "domains": [
    {
      "name": "Health",
      "url": "http://www.surf.scss.tcd.ie/cityOntology/#Health"
    }
  ],
  "id": "medical/medicalclinic_predicting_service",
  "state": true,
  "url": "http://surf.scss.tcd.ie/_provider_/medical/medicalclinic_predicting_service"
}