{
  "outputs": [
    {
      "name": "_FUNDING",
      "type": "http://127.0.0.1/ontology/SUMO.owl#Funding",
      "desc": "Output of service GovMissilesAndWeaponsFundingService"
    }
  ],
  "capability": "atomic",
  "file": "governmentmissileweapon_funding_service.owls",
  "provider": {
    "type": "wsdn"
  },
  "inputs": [
    {
      "name": "_WEAPON",
      "type": "http://127.0.0.1/ontology/SUMO.owl#Weapon",
      "desc": "Input of service GovMissilesAndWeaponsFundingService"
    },
    {
      "name": "_MISSILE",
      "type": "http://127.0.0.1/ontology/Mid-level-ontology.owl#Missile",
      "desc": "Input of service GovMissilesAndWeaponsFundingService"
    },
    {
      "name": "_GOVERNMENT",
      "type": "http://127.0.0.1/ontology/SUMO.owl#Government",
      "desc": "Input of service GovMissilesAndWeaponsFundingService"
    }
  ],
  "name": "GovMissilesAndWeaponsFundingService",
  "description": "This service returns the funding for the given missile type and other weapons possessed by the given government.",
  "domains": [
    {
      "name": "Government_and_Planning",
      "url": "http://www.surf.scss.tcd.ie/cityOntology/#Government_and_Planning"
    }
  ],
  "id": "governmentandplanning/governmentmissileweapon_funding_service",
  "state": true,
  "url": "http://surf.scss.tcd.ie/_provider_/governmentandplanning/governmentmissileweapon_funding_service"
}