{
  "outputs": [
    {
      "name": "_PRICE",
      "type": "http://127.0.0.1/ontology/concept.owl#Price",
      "desc": "Output of service PrintedMaterialPriceService"
    }
  ],
  "capability": "atomic",
  "file": "printedmaterial_price_service.owls",
  "provider": {
    "type": "wsdn"
  },
  "inputs": [
    {
      "name": "_PRINTEDMATERIAL",
      "type": "http://127.0.0.1/ontology/books.owl#PrintedMaterial",
      "desc": "Input of service PrintedMaterialPriceService"
    }
  ],
  "name": "PrintedMaterialPriceService",
  "description": "This service returns price of printed material, either it is newspaper or a fiction novel.",
  "domains": [
    {
      "name": "Educational",
      "url": "http://www.surf.scss.tcd.ie/cityOntology/#Educational"
    }
  ],
  "id": "education/printedmaterial_price_service",
  "state": true,
  "url": "http://surf.scss.tcd.ie/_provider_/education/printedmaterial_price_service"
}