{
  "outputs": [
    {
      "name": "_PRICE",
      "type": "http://127.0.0.1/ontology/concept.owl#Price",
      "desc": "Output of service Car Price quality"
    },
    {
      "name": "_QUALITY",
      "type": "http://127.0.0.1/ontology/finance_th_web.owl#quality",
      "desc": "Output of service Car Price quality"
    }
  ],
  "capability": "atomic",
  "file": "car_pricequality_service.owls",
  "provider": {
    "type": "wsdn"
  },
  "inputs": [
    {
      "name": "_CAR",
      "type": "http://127.0.0.1/ontology/my_ontology.owl#Car",
      "desc": "Input of service Car Price quality"
    }
  ],
  "name": "Car Price quality",
  "description": "This service returns pruchase price and present condition of a given car model (the results contain both new or used cars matching the given car model).",
  "id": "economy/car_pricequality_service",
  "state": true,
  "url": "http://surf.scss.tcd.ie/_provider_/economy/car_pricequality_service"
}