{
  "outputs": [
    {
      "name": "_HOTEL",
      "type": "http://127.0.0.1/ontology/travel.owl#Hotel",
      "desc": "Output of service Time-Measure Country City Hotel InfoService"
    }
  ],
  "capability": "atomic",
  "file": "time-measurecountrycity_hotel_service.owls",
  "provider": {
    "type": "asp"
  },
  "inputs": [
    {
      "name": "_CITY",
      "type": "http://127.0.0.1/ontology/travel.owl#City",
      "desc": "Input of service Time-Measure Country City Hotel InfoService"
    },
    {
      "name": "_COUNTRY",
      "type": "http://127.0.0.1/ontology/portal.owl#Country",
      "desc": "Input of service Time-Measure Country City Hotel InfoService"
    },
    {
      "name": "_TIME-MEASURE",
      "type": "http://127.0.0.1/ontology/support.owl#Time-Measure",
      "desc": "Input of service Time-Measure Country City Hotel InfoService"
    }
  ],
  "name": "Time-Measure Country City Hotel InfoService",
  "description": "This service informs about the availability of hotels in a given city ofthe given country during the given time-measure duration.",
  "domains": [
    {
      "name": "Travel",
      "url": "http://www.surf.scss.tcd.ie/cityOntology/#Travel"
    },
    {
      "name": "Accommodation",
      "url": "http://www.surf.scss.tcd.ie/cityOntology/#Accommodation"
    }
  ],
  "id": "accommodation/time-measurecountrycity_hotel_service",
  "state": true,
  "url": "http://surf.scss.tcd.ie/_provider_/accommodation/time-measurecountrycity_hotel_service"
}