{
  "outputs": [
    {
      "name": "EBook",
      "type": "http://127.0.0.1/ontology/books.owl#Book",
      "desc": "Output of service EBookOrder3"
    }
  ],
  "capability": "atomic",
  "file": "EBookOrder3.owls",
  "provider": {
    "type": "asp"
  },
  "inputs": [
    {
      "name": "EBookRequest",
      "type": "http://127.0.0.1/ontology/books.owl#Title",
      "desc": "Input of service EBookOrder3"
    },
    {
      "name": "UserAccount",
      "type": "http://127.0.0.1/ontology/books.owl#User",
      "desc": "Input of service EBookOrder3"
    }
  ],
  "name": "EBookOrder3",
  "description": "An e-book order web service, where an ebook request is given by title and the required book is placed into the users shopping cart. The service also checks availability of the book in the stock and verifies user\u0027s account.",
  "domains": [
    {
      "name": "Entertainment_Products",
      "url": "http://www.surf.scss.tcd.ie/cityOntology/#Entertainment_Products"
    }
  ],
  "id": "books/ebookorder3service",
  "state": true,
  "url": "http://surf.scss.tcd.ie/_provider_/books/ebookorder3service"
}