{
  "outputs": [
    {
      "name": "_TAXEDPRICE",
      "type": "http://127.0.0.1/ontology/concept.owl#TaxedPrice",
      "desc": "Output of service Auto 2PersonBicycle TaxedPrice service"
    }
  ],
  "capability": "atomic",
  "file": "auto2personbicycle_taxedprice_service.owls",
  "provider": {
    "type": "wsdn"
  },
  "inputs": [
    {
      "name": "_2PERSONBICYCLE",
      "type": "http://127.0.0.1/ontology/my_ontology.owl#TwoPersonBicycle",
      "desc": "Input of service Auto 2PersonBicycle TaxedPrice service"
    },
    {
      "name": "_AUTO",
      "type": "http://127.0.0.1/ontology/my_ontology.owl#Auto",
      "desc": "Input of service Auto 2PersonBicycle TaxedPrice service"
    }
  ],
  "name": "Auto 2PersonBicycle TaxedPrice service",
  "description": "This service returns taxedprice of the pair of a given auto modeland given two person bicycle model.",
  "domains": [
    {
      "name": "Vehicle_Sale_and_Rent",
      "url": "http://www.surf.scss.tcd.ie/cityOntology/#Vehicle_Sale_and_Rent"
    }
  ],
  "id": "vehicle/auto2personbicycle_taxedprice_service",
  "state": true,
  "url": "http://surf.scss.tcd.ie/_provider_/vehicle/auto2personbicycle_taxedprice_service"
}