{
  "outputs": [
    {
      "name": "_RESEARCHER",
      "type": "http://127.0.0.1/ontology/portal.owl#Researcher",
      "desc": "Output of service UniversityResearcherService"
    }
  ],
  "capability": "atomic",
  "file": "university_researcher_service.owls",
  "provider": {
    "type": "webservice"
  },
  "inputs": [
    {
      "name": "_UNIVERSITY",
      "type": "http://127.0.0.1/ontology/portal.owl#University",
      "desc": "Input of service UniversityResearcherService"
    }
  ],
  "name": "UniversityResearcherService",
  "description": "This service returns researcher of a university",
  "domains": [
    {
      "name": "Educational",
      "url": "http://www.surf.scss.tcd.ie/cityOntology/#Educational"
    }
  ],
  "id": "education/university_researcher_service",
  "state": true,
  "url": "http://surf.scss.tcd.ie/_provider_/education/university_researcher_service"
}