{
  "outputs": [
    {
      "name": "_publication",
      "type": "string",
      "desc": "Output of service Academic-Number Publication Author Service"
    },
    {
      "name": "_author",
      "type": "string",
      "desc": "Output of service Academic-Number Publication Author Service"
    }
  ],
  "provider": {
    "type": "wsdn"
  },
  "inputs": [
    {
      "name": "_academic-item-number",
      "type": "string",
      "desc": "Input of service Academic-Number Publication Author Service"
    }
  ],
  "name": "Academic-Number Publication Author Service",
  "description": "Returns a publication and its author using the academic item number.",
  "domains": [
    {
      "name": "Entertainment_Products",
      "url": "http://www.surf.scss.tcd.ie/cityOntology/#Entertainment_Products"
    }
  ],
  "id": "educational/academic-item-number_publicationauthor_service",
  "state": true,
  "url": "http://surf.scss.tcd.ie/_provider_/educational/academic-item-number_publicationauthor_service"
}