{
  "outputs": [
    {
      "name": "_DISTRIBUTION_MAP",
      "type": "http://www.surf.scss.tcd.ie/IoTservices.owl#distribution_map",
      "desc": "Output of service vehicle_distribution"
    }
  ],
  "provider": {
    "type": "wsdn"
  },
  "inputs": [
    {
      "name": "_MONITOREDAREA",
      "type": "http://www.surf.scss.tcd.ie/IoTservices.owl#monitoredArea",
      "desc": "Input of service vehicle_distribution"
    }
  ],
  "name": "vehicle_distribution",
  "description": "This is the service vehicle_distribution",
  "domains": [
    {
      "name": "Transport_and_Mobility",
      "url": "http://www.surf.scss.tcd.ie/cityOntology/#Transport_and_Mobility"
    }
  ],
  "id": "transportandmobility/101_vehicle_distribution",
  "state": true,
  "url": "http://surf.scss.tcd.ie/_provider_/transportandmobility/101_vehicle_distribution"
}