{
    "capability": "atomic",
    "description": "This service returns publisher of a certain science fiction book.",
    "domains": [
        {
            "name": "Research_and_Science",
            "url": "http://www.surf.scss.tcd.ie/cityOntology/#Research_and_Science"
        }
    ],
    "file": "sciencefictionbook_publisher_service.owls",
    "id": "books/sciencefictionbook_publisher_service",
    "inputs": [
        {
            "desc": "Input of service ScienceFictionBook Publisher Service",
            "name": "_SCIENCEFICTIONBOOK",
            "type": "http://127.0.0.1/ontology/books.owl#ScienceFictionBook"
        }
    ],
    "name": "ScienceFictionBook Publisher Service",
    "outputs": [
        {
            "desc": "Output of service ScienceFictionBook Publisher Service",
            "name": "_PUBLISHER",
            "type": "http://127.0.0.1/ontology/books.owl#Publisher"
        }
    ],
    "provider": {
        "type": "asp"
    },
    "state": true,
    "url": "http://surf.scss.tcd.ie/_provider_/books/sciencefictionbook_publisher_service"
}