{
  "outputs": [
    {
      "name": "_recommendedprice",
      "type": "string",
      "desc": "Output of service Auto RecommendedPrice Color service"
    },
    {
      "name": "_color",
      "type": "string",
      "desc": "Output of service Auto RecommendedPrice Color service"
    }
  ],
  "provider": {
    "type": "asp"
  },
  "inputs": [
    {
      "name": "_auto",
      "type": "string",
      "desc": "Input of service Auto RecommendedPrice Color service"
    }
  ],
  "name": "Auto RecommendedPrice Color service",
  "description": "This service provides a list of recommended price of auto with its color.",
  "domains": [
    {
      "name": "Health",
      "url": "http://www.surf.scss.tcd.ie/cityOntology/#Health"
    }
  ],
  "id": "retail/auto_recommendedpricecolor_service",
  "state": true,
  "url": "http://surf.scss.tcd.ie/_provider_/retail/auto_recommendedpricecolor_service"
}