{
  "outputs": [
    {
      "name": "_MEDIA",
      "type": "http://127.0.0.1/ontology/my_ontology.owl#Media",
      "desc": "Output of service Media finder service"
    }
  ],
  "capability": "atomic",
  "file": "title_media_service.owls",
  "provider": {
    "type": "webservice"
  },
  "inputs": [
    {
      "name": "_TITLE",
      "type": "http://127.0.0.1/ontology/books.owl#Title",
      "desc": "Input of service Media finder service"
    }
  ],
  "name": "Media finder service",
  "description": "This is a service to find any media, Film, CD etc., for a title.",
  "domains": [
    {
      "name": "Communications",
      "url": "http://www.surf.scss.tcd.ie/cityOntology/#Communications"
    }
  ],
  "id": "communication/title_media_service",
  "state": true,
  "url": "http://surf.scss.tcd.ie/_provider_/communication/title_media_service"
}