{
  "outputs": [
    {
      "name": "_PRICE",
      "type": "http://127.0.0.1/ontology/concept.owl#Price",
      "desc": "Output of service Beverage Price Physical-Quantity Service"
    },
    {
      "name": "_PHYSICAL-QUANTITY",
      "type": "http://127.0.0.1/ontology/support.owl#Physical-Quantity",
      "desc": "Output of service Beverage Price Physical-Quantity Service"
    }
  ],
  "capability": "atomic",
  "file": "beverage_pricephysical-quantity_Aldiservice.owls",
  "provider": {
    "type": "webservice"
  },
  "inputs": [
    {
      "name": "_BEVERAGE",
      "type": "http://127.0.0.1/ontology/SUMO.owl#Beverage",
      "desc": "Input of service Beverage Price Physical-Quantity Service"
    }
  ],
  "name": "Beverage Price Physical-Quantity Service",
  "description": "This service informs the physical-quantity and approximately purhcase market price of a given beverage item.",
  "domains": [
    {
      "name": "Food_and_Drinks",
      "url": "http://www.surf.scss.tcd.ie/cityOntology/#Food_and_Drinks"
    }
  ],
  "id": "food/beverage_pricephysical-quantity_Aldiservice",
  "state": true,
  "url": "http://surf.scss.tcd.ie/_provider_/food/beverage_pricephysical-quantity_Aldiservice"
}