{
  "outputs": [
    {
      "name": "_SCHOLARSHIP",
      "type": "http://127.0.0.1/ontology/Mid-level-ontology.owl#Scholarship",
      "desc": "Output of service GermanGovernment Degree Scholarship Duration Service"
    },
    {
      "name": "_DURATION",
      "type": "http://127.0.0.1/ontology/support.owl#Duration",
      "desc": "Output of service GermanGovernment Degree Scholarship Duration Service"
    }
  ],
  "capability": "atomic",
  "file": "degree_scholarshipduration_GermanGovservice.owls",
  "provider": {
    "type": "wsdn"
  },
  "inputs": [
    {
      "name": "_DEGREE",
      "type": "http://127.0.0.1/ontology/portal.owl#Degree",
      "desc": "Input of service GermanGovernment Degree Scholarship Duration Service"
    }
  ],
  "name": "GermanGovernment Degree Scholarship Duration Service",
  "description": "This service informs about scholarship offered for the degree by the german government. The scholarship\u0027s duration is informed as well.",
  "domains": [
    {
      "name": "Educational",
      "url": "http://www.surf.scss.tcd.ie/cityOntology/#Educational"
    }
  ],
  "id": "education/degree_scholarshipduration_service",
  "state": true,
  "url": "http://surf.scss.tcd.ie/_provider_/education/degree_scholarshipduration_service"
}