{
  "outputs": [
    {
      "name": "_WARMFRONT",
      "type": "http://127.0.0.1/ontology/Mid-level-ontology.owl#WarmFront",
      "desc": "Output of service Municipal-Unit WarmFront Service"
    }
  ],
  "capability": "atomic",
  "file": "municipal-unit_warmfront_service.owls",
  "provider": {
    "type": "asp"
  },
  "inputs": [
    {
      "name": "_MUNICIPAL-UNIT",
      "type": "http://127.0.0.1/ontology/portal.owl#Municipal-Unit",
      "desc": "Input of service Municipal-Unit WarmFront Service"
    }
  ],
  "name": "Municipal-Unit WarmFront Service",
  "description": "This service informs about warmfront in a given municipal-unit.",
  "domains": [
    {
      "name": "Travel",
      "url": "http://www.surf.scss.tcd.ie/cityOntology/#Travel"
    }
  ],
  "id": "travel/municipal-unit_warmfront_service",
  "state": true,
  "url": "http://surf.scss.tcd.ie/_provider_/travel/municipal-unit_warmfront_service"
}