{
  "outputs": [
    {
      "name": "_RECOMMENDEDPRICEINDOLLAR",
      "type": "http://127.0.0.1/ontology/concept.owl#RecommendedPriceInDollar",
      "desc": "Output of service SRCameraService"
    },
    {
      "name": "_CAMERA",
      "type": "http://127.0.0.1/ontology/extendedCamera.owl#Camera",
      "desc": "Output of service SRCameraService"
    }
  ],
  "capability": "atomic",
  "file": "SRcamera_service.owls",
  "provider": {
    "type": "asp"
  },
  "inputs": [
    {
      "name": "_SHOPPINGMALL",
      "type": "http://127.0.0.1/ontology/Mid-level-ontology.owl#ShoppingMall",
      "desc": "Input of service SRCameraService"
    }
  ],
  "name": "SRCameraService",
  "description": "SR service returns available camera and its recommended price in the certain shoppingmall.",
  "domains": [
    {
      "name": "Technology",
      "url": "http://www.surf.scss.tcd.ie/cityOntology/#Technology"
    }
  ],
  "id": "technology/shoppingmall_recommendedpriceindollarcamera_service",
  "state": true,
  "url": "http://surf.scss.tcd.ie/_provider_/technology/shoppingmall_recommendedpriceindollarcamera_service"
}