{
  "outputs": [
    {
      "name": "_TAXEDPRICE",
      "type": "http://127.0.0.1/ontology/concept.owl#TaxedPrice",
      "desc": "Output of service Food TaxedPrice Physical-Quantity Service"
    },
    {
      "name": "_PHYSICAL-QUANTITY",
      "type": "http://127.0.0.1/ontology/support.owl#Physical-Quantity",
      "desc": "Output of service Food TaxedPrice Physical-Quantity Service"
    }
  ],
  "capability": "atomic",
  "file": "food_taxedpricephysical-quantity_Aldiservice.owls",
  "provider": {
    "type": "asp"
  },
  "inputs": [
    {
      "name": "_FOOD",
      "type": "http://127.0.0.1/ontology/SUMO.owl#Food",
      "desc": "Input of service Food TaxedPrice Physical-Quantity Service"
    }
  ],
  "name": "Food TaxedPrice Physical-Quantity Service",
  "description": "This service informs about the physical-quantity and approximately taxedprice of a given food item.",
  "domains": [
    {
      "name": "Educational",
      "url": "http://www.surf.scss.tcd.ie/cityOntology/#Educational"
    },
    {
      "name": "Food_and_Drinks",
      "url": "http://www.surf.scss.tcd.ie/cityOntology/#Food_and_Drinks"
    }
  ],
  "id": "food/food_taxedpricephysical-quantity_Aldiservice",
  "state": true,
  "url": "http://surf.scss.tcd.ie/_provider_/food/food_taxedpricephysical-quantity_Aldiservice"
}