{
  "outputs": [
    {
      "name": "_AUTHOR",
      "type": "http://127.0.0.1/ontology/books.owl#Author",
      "desc": "Output of service Novel Author RecommendedPrice Service"
    },
    {
      "name": "_RECOMMENDEDPRICE",
      "type": "http://127.0.0.1/ontology/concept.owl#RecommendedPrice",
      "desc": "Output of service Novel Author RecommendedPrice Service"
    }
  ],
  "capability": "atomic",
  "file": "novel_authorrecommendedprice_service.owls",
  "provider": {
    "type": "asp"
  },
  "inputs": [
    {
      "name": "_NOVEL",
      "type": "http://127.0.0.1/ontology/books.owl#Novel",
      "desc": "Input of service Novel Author RecommendedPrice Service"
    }
  ],
  "name": "Novel Author RecommendedPrice Service",
  "description": "This service returns author and recommended price of a given novel.",
  "domains": [
    {
      "name": "Entertainment_Products",
      "url": "http://www.surf.scss.tcd.ie/cityOntology/#Entertainment_Products"
    },
    {
      "name": "Educational",
      "url": "http://www.surf.scss.tcd.ie/cityOntology/#Educational"
    }
  ],
  "id": "books/novel_authorrecommendedprice_service",
  "state": true,
  "url": "http://surf.scss.tcd.ie/_provider_/books/novel_authorrecommendedprice_service"
}