{
  "outputs": [
    {
      "name": "_MAP",
      "type": "http://127.0.0.1/ontology/geographydataset.owl#Map",
      "desc": "Output of service Render Map Service."
    }
  ],
  "capability": "atomic",
  "file": "renderMapService.owls",
  "provider": {
    "type": "webservice"
  },
  "inputs": [
    {
      "name": "_WIDTH",
      "type": "http://127.0.0.1/ontology/ontosem.owl#width",
      "desc": "Input of service Render Map Service."
    },
    {
      "name": "_HEIGHT",
      "type": "http://127.0.0.1/ontology/ontosem.owl#height",
      "desc": "Input of service Render Map Service."
    },
    {
      "name": "_SOURCE",
      "type": "http://127.0.0.1/ontology/protons.owl#EntitySource",
      "desc": "Input of service Render Map Service."
    },
    {
      "name": "_LATITUDE",
      "type": "http://127.0.0.1/ontology/protont.owl#latitude",
      "desc": "Input of service Render Map Service."
    },
    {
      "name": "_LONGITUDE",
      "type": "http://127.0.0.1/ontology/protont.owl#longitude",
      "desc": "Input of service Render Map Service."
    }
  ],
  "name": "Render Map Service.",
  "description": "The Render Map service allows you to return a map based on specific criteria parsed in the input string. It gets width, height of map image, source from where to retrieve the map, map center coordinates and returns the map based on the input specifications.This service works worldwide but results will be more accurate for Germany.",
  "domains": [
    {
      "name": "Geography",
      "url": "http://www.surf.scss.tcd.ie/cityOntology/#Geography"
    },
    {
      "name": "Travel",
      "url": "http://www.surf.scss.tcd.ie/cityOntology/#Travel"
    }
  ],
  "id": "travel/renderMapService",
  "state": true,
  "url": "http://surf.scss.tcd.ie/_provider_/travel/renderMapService"
}