{
    "capability": "atomic",
    "description": "This service returns occupationaltrade job in a given geopolitical-entity and its timemeasure (duration).",
    "domains": [
        {
            "name": "Industry",
            "url": "http://www.surf.scss.tcd.ie/cityOntology/#Industry"
        }
    ],
    "file": "geopolitical-entity_occupationaltradetimemeasure_service.owls",
    "id": "education/geopolitical-entity_occupationaltradetimemeasure_service",
    "inputs": [
        {
            "desc": "Input of service Geopolitical-Entity OccupationalTrade TimeMeasure service",
            "name": "_GEOPOLITICAL-ENTITY",
            "type": "http://127.0.0.1/ontology/portal.owl#Geopolitical-Entity"
        }
    ],
    "name": "Geopolitical-Entity OccupationalTrade TimeMeasure service",
    "outputs": [
        {
            "desc": "Output of service Geopolitical-Entity OccupationalTrade TimeMeasure service",
            "name": "_OCCUPATIONALTRADE",
            "type": "http://127.0.0.1/ontology/Mid-level-ontology.owl#OccupationalTrade"
        },
        {
            "desc": "Output of service Geopolitical-Entity OccupationalTrade TimeMeasure service",
            "name": "_TIMEMEASURE",
            "type": "http://127.0.0.1/ontology/SUMO.owl#TimeMeasure"
        }
    ],
    "provider": {
        "type": "webservice"
    },
    "state": true,
    "url": "http://surf.scss.tcd.ie/_provider_/education/geopolitical-entity_occupationaltradetimemeasure_service"
}