{
  "outputs": [
    {
      "name": "_FILM",
      "type": "http://127.0.0.1/ontology/my_ontology.owl#Film",
      "desc": "Output of service Title Film TaxedPrice Quality service"
    },
    {
      "name": "_TAXEDPRICE",
      "type": "http://127.0.0.1/ontology/concept.owl#TaxedPrice",
      "desc": "Output of service Title Film TaxedPrice Quality service"
    },
    {
      "name": "_QUALITY",
      "type": "http://127.0.0.1/ontology/finance_th_web.owl#quality",
      "desc": "Output of service Title Film TaxedPrice Quality service"
    }
  ],
  "capability": "atomic",
  "file": "title_filmtaxedpricequality_service.owls",
  "provider": {
    "type": "asp"
  },
  "inputs": [
    {
      "name": "_TITLE",
      "type": "http://127.0.0.1/ontology/books.owl#Title",
      "desc": "Input of service Title Film TaxedPrice Quality service"
    }
  ],
  "name": "Title Film TaxedPrice Quality service",
  "description": "This service searches films for the given title, and also returnsits taxed purchase price in DVD format and its quality review by users.",
  "domains": [
    {
      "name": "Communications",
      "url": "http://www.surf.scss.tcd.ie/cityOntology/#Communications"
    },
    {
      "name": "Entertainment_Products",
      "url": "http://www.surf.scss.tcd.ie/cityOntology/#Entertainment_Products"
    }
  ],
  "id": "entertainment/title_filmtaxedpricequality_service",
  "state": true,
  "url": "http://surf.scss.tcd.ie/_provider_/entertainment/title_filmtaxedpricequality_service"
}