{
  "outputs": [
    {
      "name": "_weatherseason",
      "type": "string",
      "desc": "Output of service GEWS Service"
    }
  ],
  "provider": {
    "type": "wsdn"
  },
  "inputs": [
    {
      "name": "_geographical-region",
      "type": "string",
      "desc": "Input of service GEWS Service"
    }
  ],
  "name": "GEWS Service",
  "description": "GEWS service is used to get season report of a particular geogrphical region.",
  "domains": [
    {
      "name": "Food_and_Drinks",
      "url": "http://www.surf.scss.tcd.ie/cityOntology/#Food_and_Drinks"
    }
  ],
  "id": "environmental/geographical-region_weatherseason_service",
  "state": true,
  "url": "http://surf.scss.tcd.ie/_provider_/environmental/geographical-region_weatherseason_service"
}