{
  "outputs": [
    {
      "name": "_TAXEDPRICE",
      "type": "http://127.0.0.1/ontology/concept.owl#TaxedPrice",
      "desc": "Output of service MP3Player TaxedPrice service"
    }
  ],
  "capability": "atomic",
  "file": "mp3player_taxedprice_service.owls",
  "provider": {
    "type": "asp"
  },
  "inputs": [
    {
      "name": "_MP3PLAYER",
      "type": "http://127.0.0.1/ontology/my_ontology.owl#MP3Player",
      "desc": "Input of service MP3Player TaxedPrice service"
    }
  ],
  "name": "MP3Player TaxedPrice service",
  "description": "This service returns the current purchase taxed price of a given mp3 player brand.",
  "domains": [
    {
      "name": "Technology",
      "url": "http://www.surf.scss.tcd.ie/cityOntology/#Technology"
    }
  ],
  "id": "technology/mp3player_taxedprice_service",
  "state": true,
  "url": "http://surf.scss.tcd.ie/_provider_/technology/mp3player_taxedprice_service"
}