{
  "outputs": [
    {
      "name": "_PREPAREDFOOD",
      "type": "http://127.0.0.1/ontology/Mid-level-ontology.owl#PreparedFood",
      "desc": "Output of service GroceryFoodService"
    }
  ],
  "capability": "atomic",
  "file": "grocerystore_preparedfood_service.owls",
  "provider": {
    "type": "wsdn"
  },
  "inputs": [
    {
      "name": "_GROCERYSTORE",
      "type": "http://127.0.0.1/ontology/Mid-level-ontology.owl#GroceryStore",
      "desc": "Input of service GroceryFoodService"
    }
  ],
  "name": "GroceryFoodService",
  "description": "This service returns prepared food item that you can buy from the certain grocery store.",
  "domains": [
    {
      "name": "Food_and_Drinks",
      "url": "http://www.surf.scss.tcd.ie/cityOntology/#Food_and_Drinks"
    }
  ],
  "id": "food/grocerystore_preparedfood_service",
  "state": true,
  "url": "http://surf.scss.tcd.ie/_provider_/food/grocerystore_preparedfood_service"
}