{
  "outputs": [
    {
      "name": "_price",
      "type": "string",
      "desc": "Output of service Cheap car price service"
    }
  ],
  "provider": {
    "type": "webservice"
  },
  "inputs": [
    {
      "name": "_cheapcar",
      "type": "string",
      "desc": "Input of service Cheap car price service"
    }
  ],
  "name": "Cheap car price service",
  "description": "This service gives good opinion to buy a cheap car.",
  "domains": [
    {
      "name": "Marketing",
      "url": "http://www.surf.scss.tcd.ie/cityOntology/#Marketing"
    }
  ],
  "id": "retail/cheapcar_price_service",
  "state": true,
  "url": "http://surf.scss.tcd.ie/_provider_/retail/cheapcar_price_service"
}