{
  "outputs": [
    {
      "name": "_BOOK",
      "type": "http://127.0.0.1/ontology/univ-bench.owl#Book",
      "desc": "Output of service publication book"
    }
  ],
  "capability": "atomic",
  "file": "publication_book_service.owls",
  "provider": {
    "type": "webservice"
  },
  "inputs": [
    {
      "name": "_PUBLICATION",
      "type": "http://127.0.0.1/ontology/univ-bench.owl#Publication",
      "desc": "Input of service publication book"
    }
  ],
  "name": "publication book",
  "description": "This service return name of books published by the given publication.",
  "domains": [
    {
      "name": "Educational",
      "url": "http://www.surf.scss.tcd.ie/cityOntology/#Educational"
    },
    {
      "name": "Entertainment_Products",
      "url": "http://www.surf.scss.tcd.ie/cityOntology/#Entertainment_Products"
    }
  ],
  "id": "books/publication_book_service",
  "state": true,
  "url": "http://surf.scss.tcd.ie/_provider_/books/publication_book_service"
}