{
  "outputs": [
    {
      "name": "_DIAGNOSTICPROCESS",
      "type": "http://127.0.0.1/ontology/SUMO.owl#DiagnosticProcess",
      "desc": "Output of service MedicalClinic DiagnosticProcess TimeMeasure service"
    },
    {
      "name": "_TIMEMEASURE",
      "type": "http://127.0.0.1/ontology/SUMO.owl#TimeMeasure",
      "desc": "Output of service MedicalClinic DiagnosticProcess TimeMeasure service"
    }
  ],
  "capability": "atomic",
  "file": "medicalclinic_diagnosticprocesstimemeasure_service.owls",
  "provider": {
    "type": "webservice"
  },
  "inputs": [
    {
      "name": "_MEDICALCLINIC",
      "type": "http://127.0.0.1/ontology/Mid-level-ontology.owl#MedicalClinic",
      "desc": "Input of service MedicalClinic DiagnosticProcess TimeMeasure service"
    }
  ],
  "name": "MedicalClinic DiagnosticProcess TimeMeasure service",
  "description": "This service informs you about diagnostic process and its time duration for a given medical clinic.",
  "domains": [
    {
      "name": "Health",
      "url": "http://www.surf.scss.tcd.ie/cityOntology/#Health"
    }
  ],
  "id": "medical/medicalclinic_diagnosticprocesstimemeasure_service",
  "state": true,
  "url": "http://surf.scss.tcd.ie/_provider_/medical/medicalclinic_diagnosticprocesstimemeasure_service"
}