{
    "description": "This is the service street_anomaly_detection",
    "domains": [
        {
            "name": "Safety_and_Emergencies",
            "url": "http://www.surf.scss.tcd.ie/cityOntology/#Safety_and_Emergencies"
        }
    ],
    "id": "safetyandemergencies/25_street_anomaly_detection",
    "inputs": [
        {
            "desc": "Input of service street_anomaly_detection",
            "name": "_GUNSHOTALERT",
            "type": "http://www.surf.scss.tcd.ie/IoTservices.owl#gunshotAlert"
        },
        {
            "desc": "Input of service street_anomaly_detection",
            "name": "_ZONEINTRUSIONALERT",
            "type": "http://www.surf.scss.tcd.ie/IoTservices.owl#zoneIntrusionAlert"
        },
        {
            "desc": "Input of service street_anomaly_detection",
            "name": "_REPORT",
            "type": "http://www.surf.scss.tcd.ie/IoTservices.owl#report"
        }
    ],
    "name": "street_anomaly_detection",
    "outputs": [
        {
            "desc": "Output of service street_anomaly_detection",
            "name": "_PLACE",
            "type": "http://www.surf.scss.tcd.ie/IoTservices.owl#place"
        }
    ],
    "provider": {
        "type": "ws"
    },
    "state": true,
    "url": "http://surf.scss.tcd.ie/_provider_/safetyandemergencies/25_street_anomaly_detection"
}