{
  "outputs": [
    {
      "name": "_COFFEE",
      "type": "http://127.0.0.1/ontology/my_ontology.owl#Coffee",
      "desc": "Output of service EuroPriceWhiskeyCoffee Service"
    },
    {
      "name": "_WHISKEY",
      "type": "http://127.0.0.1/ontology/my_ontology.owl#Whiskey",
      "desc": "Output of service EuroPriceWhiskeyCoffee Service"
    }
  ],
  "capability": "atomic",
  "file": "recommendedpriceineuro_coffeewhiskey_service.owls",
  "provider": {
    "type": "webservice"
  },
  "inputs": [
    {
      "name": "_RECOMMENDEDPRICEINEURO",
      "type": "http://127.0.0.1/ontology/concept.owl#RecommendedPriceInEuro",
      "desc": "Input of service EuroPriceWhiskeyCoffee Service"
    }
  ],
  "name": "EuroPriceWhiskeyCoffee Service",
  "description": "It is a european service which takes price in euro as input and returns a coffee anda whiskey affordable within the given price.",
  "domains": [
    {
      "name": "Food_and_Drinks",
      "url": "http://www.surf.scss.tcd.ie/cityOntology/#Food_and_Drinks"
    }
  ],
  "id": "food/recommendedpriceineuro_coffeewhiskey_service",
  "state": true,
  "url": "http://surf.scss.tcd.ie/_provider_/food/recommendedpriceineuro_coffeewhiskey_service"
}