{
  "outputs": [
    {
      "name": "_COFFEE",
      "type": "http://127.0.0.1/ontology/my_ontology.owl#Coffee",
      "desc": "Output of service POZ service"
    },
    {
      "name": "_WHISKEY",
      "type": "http://127.0.0.1/ontology/my_ontology.owl#Whiskey",
      "desc": "Output of service POZ service"
    },
    {
      "name": "_QUALITY",
      "type": "http://127.0.0.1/ontology/finance_th_web.owl#quality",
      "desc": "Output of service POZ service"
    }
  ],
  "capability": "atomic",
  "file": "price_coffeewhiskeyquality_service.owls",
  "provider": {
    "type": "webservice"
  },
  "inputs": [
    {
      "name": "_PRICE",
      "type": "http://127.0.0.1/ontology/concept.owl#Price",
      "desc": "Input of service POZ service"
    }
  ],
  "name": "POZ service",
  "description": "This service returns the best coffee and whiskey for a given price, and also informs you about its quality.",
  "domains": [
    {
      "name": "Food_and_Drinks",
      "url": "http://www.surf.scss.tcd.ie/cityOntology/#Food_and_Drinks"
    }
  ],
  "id": "food/price_coffeewhiskeyquality_service",
  "state": true,
  "url": "http://surf.scss.tcd.ie/_provider_/food/price_coffeewhiskeyquality_service"
}