{
  "outputs": [
    {
      "name": "_SUNRISE",
      "type": "http://127.0.0.1/ontology/geographydataset.owl#Sunrise",
      "desc": "Output of service Sunrise Time Calcutator Service."
    }
  ],
  "capability": "atomic",
  "file": "calculateSunriseTime.owls",
  "provider": {
    "type": "wsdn"
  },
  "inputs": [
    {
      "name": "_LICENSEKEY",
      "type": "http://127.0.0.1/ontology/geographydataset.owl#Code",
      "desc": "Input of service Sunrise Time Calcutator Service."
    },
    {
      "name": "_DATE",
      "type": "http://127.0.0.1/ontology/protonu.owl#Date",
      "desc": "Input of service Sunrise Time Calcutator Service."
    },
    {
      "name": "_LATITUDE",
      "type": "http://127.0.0.1/ontology/protont.owl#latitude",
      "desc": "Input of service Sunrise Time Calcutator Service."
    },
    {
      "name": "_LONGITUDE",
      "type": "http://127.0.0.1/ontology/protont.owl#longitude",
      "desc": "Input of service Sunrise Time Calcutator Service."
    }
  ],
  "name": "Sunrise Time Calcutator Service.",
  "description": "This service calculates a Sunrise time for a certain date of a given location worldwide (latitude/longitude pair). For using this service valid License Key should be provided.",
  "domains": [
    {
      "name": "Geography",
      "url": "http://www.surf.scss.tcd.ie/cityOntology/#Geography"
    },
    {
      "name": "Travel",
      "url": "http://www.surf.scss.tcd.ie/cityOntology/#Travel"
    }
  ],
  "id": "travel/calculateSunriseTime",
  "state": true,
  "url": "http://surf.scss.tcd.ie/_provider_/travel/calculateSunriseTime"
}