{
  "outputs": [
    {
      "name": "_CORPORATION",
      "type": "http://127.0.0.1/ontology/finance_th_web.owl#corporation",
      "desc": "Output of service Country Corporation Profession Service"
    },
    {
      "name": "_PROFESSION",
      "type": "http://127.0.0.1/ontology/Mid-level-ontology.owl#Profession",
      "desc": "Output of service Country Corporation Profession Service"
    }
  ],
  "capability": "atomic",
  "file": "country_corporationprofession_service.owls",
  "provider": {
    "type": "wsdn"
  },
  "inputs": [
    {
      "name": "_COUNTRY",
      "type": "http://127.0.0.1/ontology/portal.owl#Country",
      "desc": "Input of service Country Corporation Profession Service"
    }
  ],
  "name": "Country Corporation Profession Service",
  "description": "This service finds positions for professionals in a given country and also returns corporation who offers that job.",
  "domains": [
    {
      "name": "Educational",
      "url": "http://www.surf.scss.tcd.ie/cityOntology/#Educational"
    }
  ],
  "id": "education/country_corporationprofession_service",
  "state": true,
  "url": "http://surf.scss.tcd.ie/_provider_/education/country_corporationprofession_service"
}