{
  "outputs": [
    {
      "name": "_DESTINATION",
      "type": "http://127.0.0.1/ontology/travel.owl#Destination",
      "desc": "Output of service SurfingLegalAgentDestinationService"
    }
  ],
  "capability": "atomic",
  "file": "legal-agentsurfing_destination_service.owls",
  "provider": {
    "type": "asp"
  },
  "inputs": [
    {
      "name": "_SURFING",
      "type": "http://127.0.0.1/ontology/travel.owl#Surfing",
      "desc": "Input of service SurfingLegalAgentDestinationService"
    },
    {
      "name": "_LEGAL-AGENT",
      "type": "http://127.0.0.1/ontology/portal.owl#Legal-Agent",
      "desc": "Input of service SurfingLegalAgentDestinationService"
    }
  ],
  "name": "SurfingLegalAgentDestinationService",
  "description": "This service returns destinations where given Legal agent works and is responsiblefor surfing.",
  "domains": [
    {
      "name": "Travel",
      "url": "http://www.surf.scss.tcd.ie/cityOntology/#Travel"
    },
    {
      "name": "Activity",
      "url": "http://www.surf.scss.tcd.ie/cityOntology/#Activity"
    }
  ],
  "id": "activity/legal-agentsurfing_destination_service",
  "state": true,
  "url": "http://surf.scss.tcd.ie/_provider_/activity/legal-agentsurfing_destination_service"
}