{
  "outputs": [
    {
      "name": "_DIGITAL-SLR",
      "type": "http://127.0.0.1/ontology/extendedCamera.owl#Digital-SLR",
      "desc": "Output of service DigitalSLRPriceService"
    },
    {
      "name": "_PRICE",
      "type": "http://127.0.0.1/ontology/concept.owl#Price",
      "desc": "Output of service DigitalSLRPriceService"
    },
    {
      "name": "_CALENDAR-DATE",
      "type": "http://127.0.0.1/ontology/support.owl#Calendar-Date",
      "desc": "Output of service DigitalSLRPriceService"
    }
  ],
  "capability": "atomic",
  "file": "shoppingmall_digital-slrpricecalendar-date_service.owls",
  "provider": {
    "type": "asp"
  },
  "inputs": [
    {
      "name": "_SHOPPINGMALL",
      "type": "http://127.0.0.1/ontology/Mid-level-ontology.owl#ShoppingMall",
      "desc": "Input of service DigitalSLRPriceService"
    }
  ],
  "name": "DigitalSLRPriceService",
  "description": "This service informs you about available digital SLR, its price and availability time in the certain shoppingmall.",
  "domains": [
    {
      "name": "Technology",
      "url": "http://www.surf.scss.tcd.ie/cityOntology/#Technology"
    }
  ],
  "id": "technology/shoppingmall_digital-slrpricecalendar-date_service",
  "state": true,
  "url": "http://surf.scss.tcd.ie/_provider_/technology/shoppingmall_digital-slrpricecalendar-date_service"
}