{
  "outputs": [
    {
      "name": "_RECOMMENDEDPRICE",
      "type": "http://127.0.0.1/ontology/concept.owl#RecommendedPrice",
      "desc": "Output of service Tea RecommendedPrice Service"
    }
  ],
  "capability": "atomic",
  "file": "tea_recommendedprice_service.owls",
  "provider": {
    "type": "wsdn"
  },
  "inputs": [
    {
      "name": "_TEA",
      "type": "http://127.0.0.1/ontology/Mid-level-ontology.owl#Tea",
      "desc": "Input of service Tea RecommendedPrice Service"
    }
  ],
  "name": "Tea RecommendedPrice Service",
  "description": "This service returns recommended purchase price of a given tea type. The price is for 1Kg of tea.",
  "domains": [
    {
      "name": "Food_and_Drinks",
      "url": "http://www.surf.scss.tcd.ie/cityOntology/#Food_and_Drinks"
    }
  ],
  "id": "food/tea_recommendedprice_service",
  "state": true,
  "url": "http://surf.scss.tcd.ie/_provider_/food/tea_recommendedprice_service"
}