{
  "outputs": [
    {
      "name": "_DRINKS",
      "type": "http://127.0.0.1/ontology/my_ontology.owl#Drinks",
      "desc": "Output of service DrinksService"
    }
  ],
  "capability": "atomic",
  "file": "maxprice_drinks_Hotservice.owls",
  "provider": {
    "type": "asp"
  },
  "inputs": [
    {
      "name": "_MAXPRICE",
      "type": "http://127.0.0.1/ontology/concept.owl#MaxPrice",
      "desc": "Input of service DrinksService"
    }
  ],
  "name": "DrinksService",
  "description": "This service offer a hot drink for a maximum price, for coffee, tea etc.",
  "domains": [
    {
      "name": "Food_and_Drinks",
      "url": "http://www.surf.scss.tcd.ie/cityOntology/#Food_and_Drinks"
    }
  ],
  "id": "food/maxprice_drinks_Hotservice",
  "state": true,
  "url": "http://surf.scss.tcd.ie/_provider_/food/maxprice_drinks_Hotservice"
}