{
  "outputs": [
    {
      "name": "_warmfront",
      "type": "string",
      "desc": "Output of service Country WarmFront Service"
    }
  ],
  "provider": {
    "type": "wsdn"
  },
  "inputs": [
    {
      "name": "_country",
      "type": "string",
      "desc": "Input of service Country WarmFront Service"
    }
  ],
  "name": "Country WarmFront Service",
  "description": "This service informs about warmfront in a given country.",
  "domains": [
    {
      "name": "Arts",
      "url": "http://www.surf.scss.tcd.ie/cityOntology/#Arts"
    }
  ],
  "id": "environmental/country_warmfront_service",
  "state": true,
  "url": "http://surf.scss.tcd.ie/_provider_/environmental/country_warmfront_service"
}