{
  "outputs": [
    {
      "name": "_destination",
      "type": "string",
      "desc": "Output of service AUS SurfingDestinationService"
    }
  ],
  "provider": {
    "type": "asp"
  },
  "inputs": [
    {
      "name": "_surfing",
      "type": "string",
      "desc": "Input of service AUS SurfingDestinationService"
    }
  ],
  "name": "AUS SurfingDestinationService",
  "description": "AUS is the most used service to know about the destination for surfing.",
  "domains": [
    {
      "name": "Vehicle_Sale_and_Rent",
      "url": "http://www.surf.scss.tcd.ie/cityOntology/#Vehicle_Sale_and_Rent"
    }
  ],
  "id": "tourism/surfing_destination_service",
  "state": true,
  "url": "http://surf.scss.tcd.ie/_provider_/tourism/surfing_destination_service"
}