{
  "outputs": [
    {
      "name": "_price",
      "type": "string",
      "desc": "Output of service PreparedFoodPriceService"
    }
  ],
  "provider": {
    "type": "webservice"
  },
  "inputs": [
    {
      "name": "_preparedfood",
      "type": "string",
      "desc": "Input of service PreparedFoodPriceService"
    }
  ],
  "name": "PreparedFoodPriceService",
  "description": "This service returns price of a prepared food.",
  "domains": [
    {
      "name": "Transport_and_Mobility",
      "url": "http://www.surf.scss.tcd.ie/cityOntology/#Transport_and_Mobility"
    }
  ],
  "id": "retail/preparedfood_price_service",
  "state": true,
  "url": "http://surf.scss.tcd.ie/_provider_/retail/preparedfood_price_service"
}