{
  "outputs": [
    {
      "name": "_senior-research-fellow-in-academia",
      "type": "string",
      "desc": "Output of service HigherEducationalOrganizationSeniorResearcherFellow"
    }
  ],
  "provider": {
    "type": "webservice"
  },
  "inputs": [
    {
      "name": "_higher-educational-organization",
      "type": "string",
      "desc": "Input of service HigherEducationalOrganizationSeniorResearcherFellow"
    }
  ],
  "name": "HigherEducationalOrganizationSeniorResearcherFellow",
  "description": "It is the first service that returns senior researcher fellow of the given higher educational organization.",
  "domains": [
    {
      "name": "Medicines",
      "url": "http://www.surf.scss.tcd.ie/cityOntology/#Medicines"
    }
  ],
  "id": "educational/higher-educational-organization_senior-research-fellow-in-academia_service",
  "state": true,
  "url": "http://surf.scss.tcd.ie/_provider_/educational/higher-educational-organization_senior-research-fellow-in-academia_service"
}