{
  "plans": [
    {
      "outputs": [
        {
          "name": "busAvailability",
          "type": "json"
        }
      ],
      "inputs": [
        {
          "name": "from",
          "type": "long"
        },
        {
          "name": "to",
          "type": "long"
        }
      ],
      "domains": [
        {
          "name": "Transport_and_Mobility",
          "url": "http://www.surf.scss.tcd.ie/cityOntology/#Transport_and_Mobility"
        }
      ],
      "state": 1,
      "steps": [
        {
          "outputs": [
            {
              "name": "busAvailability",
              "type": "json"
            }
          ],
          "inputs": [
            {
              "name": "from",
              "type": "long"
            },
            {
              "name": "to",
              "type": "long"
            }
          ],
          "type": "SequentialStep",
          "steps": [
            {
              "outputs": [
                {
                  "name": "busAvailability",
                  "type": "json"
                }
              ],
              "inputs": [
                {
                  "name": "routeParameters",
                  "type": "json"
                }
              ],
              "serviceDescription": {
                "outputs": [
                  {
                    "name": "busAvailability",
                    "type": "json"
                  }
                ],
                "provider": {
                  "type": "asp"
                },
                "inputs": [
                  {
                    "name": "routeParameters",
                    "type": "json"
                  }
                ],
                "name": "bus_availability",
                "description": "This is the service bus_availability",
                "domains": [
                  {
                    "name": "Transport_and_Mobility",
                    "url": "http://www.surf.scss.tcd.ie/cityOntology/#Transport_and_Mobility"
                  }
                ],
                "id": "8/bus_availability",
                "state": true,
                "url": "http://surf.scss.tcd.ie/_provider_/bus_availability"
              },
              "type": "SimpleStep",
              "order": 0
            },
            {
              "outputs": [
                {
                  "name": "routeParameters",
                  "type": "json"
                }
              ],
              "inputs": [
                {
                  "name": "from",
                  "type": "long"
                },
                {
                  "name": "to",
                  "type": "long"
                }
              ],
              "serviceDescription": {
                "outputs": [
                  {
                    "name": "routeParameters",
                    "type": "json"
                  }
                ],
                "provider": {
                  "type": "ws"
                },
                "inputs": [
                  {
                    "name": "from",
                    "type": "long"
                  },
                  {
                    "name": "to",
                    "type": "long"
                  }
                ],
                "name": "route_configurator",
                "description": "This is the service route_configurator",
                "domains": [
                  {
                    "name": "Transport_and_Mobility",
                    "url": "http://www.surf.scss.tcd.ie/cityOntology/#Transport_and_Mobility"
                  }
                ],
                "id": "1/route_configurator",
                "state": true,
                "url": "http://surf.scss.tcd.ie/_provider_/route_configurator"
              },
              "type": "SimpleStep",
              "order": 1
            }
          ],
          "order": 0
        }
      ]
    }
  ]
}