{
  "outputs": [
    {
      "name": "_accommodation",
      "type": "string",
      "desc": "Output of service AccomodationInfoService"
    }
  ],
  "provider": "",
  "inputs": [
    {
      "name": "_country",
      "type": "string",
      "desc": "Input of service AccomodationInfoService"
    },
    {
      "name": "_city",
      "type": "string",
      "desc": "Input of service AccomodationInfoService"
    }
  ],
  "latitude": 0.0,
  "name": "AccomodationInfoService",
  "description": "This service returns accomodation information, hotel, resturant etcin the city of the country.",
  "domains": [],
  "id": "tourism/citycountry_accommodation_service",
  "state": true,
  "type": "webservice",
  "url": "http://surf.scss.tcd.ie/_provider_/tourism/citycountry_accommodation_service",
  "longitude": 0.0
}