{
  "outputs": [
    {
      "name": "trafficInfo",
      "type": "json"
    }
  ],
  "qos": [],
  "inputs": [
    {
      "name": "buildingId",
      "type": "long"
    }
  ],
  "domains": [
    {
      "name": "Buildings",
      "url": "http://www.surf.scss.tcd.ie/cityOntology/#Buildings"
    },
    {
      "name": "Transport_and_Mobility",
      "url": "http://www.surf.scss.tcd.ie/cityOntology/#Transport_and_Mobility"
    }
  ],
  "location": {}
}