{
  "outputs": [
    {
      "name": "_author",
      "type": "string",
      "desc": "Output of service Short-Story Author Price Service"
    },
    {
      "name": "_price",
      "type": "string",
      "desc": "Output of service Short-Story Author Price Service"
    }
  ],
  "provider": {
    "type": "wsdn"
  },
  "inputs": [
    {
      "name": "_short-story",
      "type": "string",
      "desc": "Input of service Short-Story Author Price Service"
    }
  ],
  "name": "Short-Story Author Price Service",
  "description": "This service returns author and price of a given short-story.",
  "domains": [
    {
      "name": "Nature",
      "url": "http://www.surf.scss.tcd.ie/cityOntology/#Nature"
    }
  ],
  "id": "retail/short-story_authorprice_service",
  "state": true,
  "url": "http://surf.scss.tcd.ie/_provider_/retail/short-story_authorprice_service"
}