{
  "outputs": [
    {
      "name": "taxiLocation",
      "type": "json"
    }
  ],
  "provider": {
    "type": "wsdn"
  },
  "inputs": [
    {
      "name": "routeParameters",
      "type": "json"
    }
  ],
  "name": "taxi_location",
  "description": "This is the service taxi_location",
  "domains": [
    {
      "name": "Transport_and_Mobility",
      "url": "http://www.surf.scss.tcd.ie/cityOntology/#Transport_and_Mobility"
    }
  ],
  "id": "10/taxi_location",
  "state": true,
  "url": "http://surf.scss.tcd.ie/_provider_/taxi_location"
}