{
  "outputs": [
    {
      "name": "_author",
      "type": "string",
      "desc": "Output of service RomanticNovel Author Price Service"
    },
    {
      "name": "_price",
      "type": "string",
      "desc": "Output of service RomanticNovel Author Price Service"
    }
  ],
  "provider": {
    "type": "asp"
  },
  "inputs": [
    {
      "name": "_romanticnovel",
      "type": "string",
      "desc": "Input of service RomanticNovel Author Price Service"
    }
  ],
  "name": "RomanticNovel Author Price Service",
  "description": "This service returns author and price of a given romantic novel.",
  "domains": [
    {
      "name": "Technology",
      "url": "http://www.surf.scss.tcd.ie/cityOntology/#Technology"
    }
  ],
  "id": "retail/romanticnovel_authorprice_service",
  "state": true,
  "url": "http://surf.scss.tcd.ie/_provider_/retail/romanticnovel_authorprice_service"
}