{
  "outputs": [
    {
      "name": "routeParameters",
      "type": "json"
    }
  ],
  "provider": {
    "type": "ws"
  },
  "inputs": [
    {
      "name": "from",
      "type": "long"
    },
    {
      "name": "to",
      "type": "long"
    }
  ],
  "name": "route_configurator",
  "description": "This is the service route_configurator",
  "domains": [
    {
      "name": "Transport_and_Mobility",
      "url": "http://www.surf.scss.tcd.ie/cityOntology/#Transport_and_Mobility"
    }
  ],
  "id": "1/route_configurator",
  "state": true,
  "url": "http://surf.scss.tcd.ie/_provider_/route_configurator"
}