{
  "outputs": [
    {
      "name": "_book",
      "type": "string",
      "desc": "Output of service BookSearchingService"
    },
    {
      "name": "_author",
      "type": "string",
      "desc": "Output of service BookSearchingService"
    },
    {
      "name": "_publisher",
      "type": "string",
      "desc": "Output of service BookSearchingService"
    }
  ],
  "provider": {
    "type": "asp"
  },
  "inputs": [
    {
      "name": "_publication-number",
      "type": "string",
      "desc": "Input of service BookSearchingService"
    }
  ],
  "name": "BookSearchingService",
  "description": "This service returns a book on the given publication number, alsoits publisher and authors.",
  "domains": [
    {
      "name": "Entertainment_Products",
      "url": "http://www.surf.scss.tcd.ie/cityOntology/#Entertainment_Products"
    }
  ],
  "id": "educational/publication-number_bookauthorpublisher_service",
  "state": true,
  "url": "http://surf.scss.tcd.ie/_provider_/educational/publication-number_bookauthorpublisher_service"
}