{
  "outputs": [
    {
      "name": "_taxedpriceindollar",
      "type": "string",
      "desc": "Output of service PTP service"
    },
    {
      "name": "_price",
      "type": "string",
      "desc": "Output of service PTP service"
    }
  ],
  "provider": {
    "type": "asp"
  },
  "inputs": [
    {
      "name": "_preparedfood",
      "type": "string",
      "desc": "Input of service PTP service"
    }
  ],
  "name": "PTP service",
  "description": "This service returns price and tax price (in Dollar) of given prepared food.",
  "domains": [
    {
      "name": "Entertainment_Products",
      "url": "http://www.surf.scss.tcd.ie/cityOntology/#Entertainment_Products"
    }
  ],
  "id": "retail/preparedfood_taxedpriceindollarprice_service",
  "state": true,
  "url": "http://surf.scss.tcd.ie/_provider_/retail/preparedfood_taxedpriceindollarprice_service"
}