{
  "names": [
    "Request_109_110.json,http://www.surf.scss.tcd.ie/cityOntology/#Energy",
    "Request_15_16.json,http://www.surf.scss.tcd.ie/cityOntology/#Transport_and_Mobility",
    "Request_119_122.json,http://www.surf.scss.tcd.ie/cityOntology/#Sport,http://www.surf.scss.tcd.ie/cityOntology/#Leisure",
    "Request_6_13.json,http://www.surf.scss.tcd.ie/cityOntology/#Transport_and_Mobility",
    "Request_78_78.json,http://www.surf.scss.tcd.ie/cityOntology/#Activity",
    "Request_90_90.json,http://www.surf.scss.tcd.ie/cityOntology/#Health",
    "Request_36_39.json,http://www.surf.scss.tcd.ie/cityOntology/#Safety_and_Emergencies,http://www.surf.scss.tcd.ie/cityOntology/#Buildings",
    "Request_8_6.json,http://www.surf.scss.tcd.ie/cityOntology/#Transport_and_Mobility",
    "Request_6_7.json,http://www.surf.scss.tcd.ie/cityOntology/#Transport_and_Mobility",
    "Request_52_54.json,http://www.surf.scss.tcd.ie/cityOntology/#Educational",
    "Request_41_42.json,http://www.surf.scss.tcd.ie/cityOntology/#Safety_and_Emergencies,http://www.surf.scss.tcd.ie/cityOntology/#Construction",
    "Request_5_7.json,http://www.surf.scss.tcd.ie/cityOntology/#Transport_and_Mobility",
    "Request_77_75.json,http://www.surf.scss.tcd.ie/cityOntology/#Activity",
    "Request_44_44.json,http://www.surf.scss.tcd.ie/cityOntology/#Safety_and_Emergencies,http://www.surf.scss.tcd.ie/cityOntology/#Construction",
    "Request_1_9.json,http://www.surf.scss.tcd.ie/cityOntology/#Transport_and_Mobility",
    "Request_7_6.json,http://www.surf.scss.tcd.ie/cityOntology/#Transport_and_Mobility",
    "Request_49_49.json,http://www.surf.scss.tcd.ie/cityOntology/#Educational",
    "Request_59_59.json,http://www.surf.scss.tcd.ie/cityOntology/#Educational,http://www.surf.scss.tcd.ie/cityOntology/#Research_and_Science",
    "Request_38_39.json,http://www.surf.scss.tcd.ie/cityOntology/#Safety_and_Emergencies,http://www.surf.scss.tcd.ie/cityOntology/#Buildings",
    "Request_11_7.json,http://www.surf.scss.tcd.ie/cityOntology/#Transport_and_Mobility",
    "Request_132_134.json,http://www.surf.scss.tcd.ie/cityOntology/#Tools,http://www.surf.scss.tcd.ie/cityOntology/#Food_and_Drinks,http://www.surf.scss.tcd.ie/cityOntology/#Clothing,http://www.surf.scss.tcd.ie/cityOntology/#Sport,http://www.surf.scss.tcd.ie/cityOntology/#Furniture_and_Housing,http://www.surf.scss.tcd.ie/cityOntology/#Technology",
    "Request_5_10.json,http://www.surf.scss.tcd.ie/cityOntology/#Transport_and_Mobility",
    "Request_5_3.json,http://www.surf.scss.tcd.ie/cityOntology/#Transport_and_Mobility",
    "Request_134_136.json,http://www.surf.scss.tcd.ie/cityOntology/#Food_and_Drinks,http://www.surf.scss.tcd.ie/cityOntology/#Clothing,http://www.surf.scss.tcd.ie/cityOntology/#Sport,http://www.surf.scss.tcd.ie/cityOntology/#Tools,http://www.surf.scss.tcd.ie/cityOntology/#Furniture_and_Housing,http://www.surf.scss.tcd.ie/cityOntology/#Technology",
    "Request_104_104.json,http://www.surf.scss.tcd.ie/cityOntology/#Transport_and_Mobility",
    "Request_55_56.json,http://www.surf.scss.tcd.ie/cityOntology/#Educational,http://www.surf.scss.tcd.ie/cityOntology/#Research_and_Science",
    "Request_21_24.json,http://www.surf.scss.tcd.ie/cityOntology/#Safety_and_Emergencies",
    "Request_6_9.json,http://www.surf.scss.tcd.ie/cityOntology/#Transport_and_Mobility",
    "Request_72_72.json,http://www.surf.scss.tcd.ie/cityOntology/#Clothing",
    "Request_123_123.json,http://www.surf.scss.tcd.ie/cityOntology/#Sport",
    "Request_5_11.json,http://www.surf.scss.tcd.ie/cityOntology/#Transport_and_Mobility",
    "Request_80_81.json,http://www.surf.scss.tcd.ie/cityOntology/#Touristic_Place,http://www.surf.scss.tcd.ie/cityOntology/#History",
    "Request_115_115.json,http://www.surf.scss.tcd.ie/cityOntology/#Safety_and_Emergencies,http://www.surf.scss.tcd.ie/cityOntology/#Finance",
    "Request_116_117.json,http://www.surf.scss.tcd.ie/cityOntology/#Safety_and_Emergencies,http://www.surf.scss.tcd.ie/cityOntology/#Finance",
    "Request_64_66.json,http://www.surf.scss.tcd.ie/cityOntology/#Educational",
    "Request_1_13.json,http://www.surf.scss.tcd.ie/cityOntology/#Transport_and_Mobility",
    "Request_2_8.json,http://www.surf.scss.tcd.ie/cityOntology/#Transport_and_Mobility",
    "Request_30_30.json,http://www.surf.scss.tcd.ie/cityOntology/#Safety_and_Emergencies",
    "Request_31_33.json,http://www.surf.scss.tcd.ie/cityOntology/#Safety_and_Emergencies",
    "Request_15_15.json,http://www.surf.scss.tcd.ie/cityOntology/#Transport_and_Mobility",
    "Request_119_120.json,http://www.surf.scss.tcd.ie/cityOntology/#Sport,http://www.surf.scss.tcd.ie/cityOntology/#Leisure,http://www.surf.scss.tcd.ie/cityOntology/#Transport_and_Mobility",
    "Request_93_96.json,http://www.surf.scss.tcd.ie/cityOntology/#Health,http://www.surf.scss.tcd.ie/cityOntology/#Safety_and_Emergencies",
    "Request_88_91.json,http://www.surf.scss.tcd.ie/cityOntology/#Health",
    "Request_131_135.json,http://www.surf.scss.tcd.ie/cityOntology/#Technology,http://www.surf.scss.tcd.ie/cityOntology/#Food_and_Drinks,http://www.surf.scss.tcd.ie/cityOntology/#Clothing,http://www.surf.scss.tcd.ie/cityOntology/#Sport,http://www.surf.scss.tcd.ie/cityOntology/#Tools,http://www.surf.scss.tcd.ie/cityOntology/#Furniture_and_Housing",
    "Request_32_34.json,http://www.surf.scss.tcd.ie/cityOntology/#Safety_and_Emergencies",
    "Request_42_42.json,http://www.surf.scss.tcd.ie/cityOntology/#Safety_and_Emergencies,http://www.surf.scss.tcd.ie/cityOntology/#Construction",
    "Request_51_52.json,http://www.surf.scss.tcd.ie/cityOntology/#Educational",
    "Request_25_28.json,http://www.surf.scss.tcd.ie/cityOntology/#Safety_and_Emergencies",
    "Request_84_85.json,http://www.surf.scss.tcd.ie/cityOntology/#Accommodation",
    "Request_57_57.json,http://www.surf.scss.tcd.ie/cityOntology/#Educational,http://www.surf.scss.tcd.ie/cityOntology/#Research_and_Science",
    "Request_44_45.json,http://www.surf.scss.tcd.ie/cityOntology/#Safety_and_Emergencies,http://www.surf.scss.tcd.ie/cityOntology/#Construction",
    "Request_14_14.json,http://www.surf.scss.tcd.ie/cityOntology/#Transport_and_Mobility",
    "Request_69_135.json,http://www.surf.scss.tcd.ie/cityOntology/#Clothing,http://www.surf.scss.tcd.ie/cityOntology/#Food_and_Drinks,http://www.surf.scss.tcd.ie/cityOntology/#Sport,http://www.surf.scss.tcd.ie/cityOntology/#Tools,http://www.surf.scss.tcd.ie/cityOntology/#Furniture_and_Housing,http://www.surf.scss.tcd.ie/cityOntology/#Technology",
    "Request_21_23.json,http://www.surf.scss.tcd.ie/cityOntology/#Safety_and_Emergencies",
    "Request_43_45.json,http://www.surf.scss.tcd.ie/cityOntology/#Safety_and_Emergencies,http://www.surf.scss.tcd.ie/cityOntology/#Construction",
    "Request_77_76.json,http://www.surf.scss.tcd.ie/cityOntology/#Activity",
    "Request_71_73.json,http://www.surf.scss.tcd.ie/cityOntology/#Clothing",
    "Request_79_80.json,http://www.surf.scss.tcd.ie/cityOntology/#Touristic_Place,http://www.surf.scss.tcd.ie/cityOntology/#History",
    "Request_67_67.json,http://www.surf.scss.tcd.ie/cityOntology/#Educational",
    "Request_1_8.json,http://www.surf.scss.tcd.ie/cityOntology/#Transport_and_Mobility",
    "Request_43_44.json,http://www.surf.scss.tcd.ie/cityOntology/#Safety_and_Emergencies,http://www.surf.scss.tcd.ie/cityOntology/#Construction",
    "Request_134_134.json,http://www.surf.scss.tcd.ie/cityOntology/#Food_and_Drinks,http://www.surf.scss.tcd.ie/cityOntology/#Clothing,http://www.surf.scss.tcd.ie/cityOntology/#Sport,http://www.surf.scss.tcd.ie/cityOntology/#Tools,http://www.surf.scss.tcd.ie/cityOntology/#Furniture_and_Housing,http://www.surf.scss.tcd.ie/cityOntology/#Technology",
    "Request_42_45.json,http://www.surf.scss.tcd.ie/cityOntology/#Safety_and_Emergencies,http://www.surf.scss.tcd.ie/cityOntology/#Construction",
    "Request_81_81.json,http://www.surf.scss.tcd.ie/cityOntology/#Touristic_Place,http://www.surf.scss.tcd.ie/cityOntology/#History",
    "Request_2_6.json,http://www.surf.scss.tcd.ie/cityOntology/#Transport_and_Mobility",
    "Request_82_87.json,http://www.surf.scss.tcd.ie/cityOntology/#Accommodation",
    "Request_21_21.json,http://www.surf.scss.tcd.ie/cityOntology/#Safety_and_Emergencies",
    "Request_82_83.json,http://www.surf.scss.tcd.ie/cityOntology/#Accommodation",
    "Request_24_28.json,http://www.surf.scss.tcd.ie/cityOntology/#Safety_and_Emergencies",
    "Request_25_26.json,http://www.surf.scss.tcd.ie/cityOntology/#Safety_and_Emergencies",
    "Request_57_58.json,http://www.surf.scss.tcd.ie/cityOntology/#Educational,http://www.surf.scss.tcd.ie/cityOntology/#Research_and_Science",
    "Request_46_46.json,http://www.surf.scss.tcd.ie/cityOntology/#Educational",
    "Request_70_136.json,http://www.surf.scss.tcd.ie/cityOntology/#Clothing,http://www.surf.scss.tcd.ie/cityOntology/#Food_and_Drinks,http://www.surf.scss.tcd.ie/cityOntology/#Sport,http://www.surf.scss.tcd.ie/cityOntology/#Tools,http://www.surf.scss.tcd.ie/cityOntology/#Furniture_and_Housing,http://www.surf.scss.tcd.ie/cityOntology/#Technology",
    "Request_6_5.json,http://www.surf.scss.tcd.ie/cityOntology/#Transport_and_Mobility",
    "Request_11_11.json,http://www.surf.scss.tcd.ie/cityOntology/#Transport_and_Mobility",
    "Request_7_2.json,http://www.surf.scss.tcd.ie/cityOntology/#Transport_and_Mobility",
    "Request_97_99.json,http://www.surf.scss.tcd.ie/cityOntology/#Logistic,http://www.surf.scss.tcd.ie/cityOntology/#Communications",
    "Request_10_10.json,http://www.surf.scss.tcd.ie/cityOntology/#Transport_and_Mobility",
    "Request_76_75.json,http://www.surf.scss.tcd.ie/cityOntology/#Activity",
    "Request_2_11.json,http://www.surf.scss.tcd.ie/cityOntology/#Transport_and_Mobility",
    "Request_72_73.json,http://www.surf.scss.tcd.ie/cityOntology/#Clothing",
    "Request_2_10.json,http://www.surf.scss.tcd.ie/cityOntology/#Transport_and_Mobility",
    "Request_74_75.json,http://www.surf.scss.tcd.ie/cityOntology/#Activity",
    "Request_56_58.json,http://www.surf.scss.tcd.ie/cityOntology/#Educational,http://www.surf.scss.tcd.ie/cityOntology/#Research_and_Science",
    "Request_46_49.json,http://www.surf.scss.tcd.ie/cityOntology/#Educational",
    "Request_22_23.json,http://www.surf.scss.tcd.ie/cityOntology/#Safety_and_Emergencies",
    "Request_82_85.json,http://www.surf.scss.tcd.ie/cityOntology/#Accommodation",
    "Request_75_75.json,http://www.surf.scss.tcd.ie/cityOntology/#Activity",
    "Request_48_49.json,http://www.surf.scss.tcd.ie/cityOntology/#Educational",
    "Request_5_4.json,http://www.surf.scss.tcd.ie/cityOntology/#Transport_and_Mobility",
    "Request_37_39.json,http://www.surf.scss.tcd.ie/cityOntology/#Safety_and_Emergencies,http://www.surf.scss.tcd.ie/cityOntology/#Buildings",
    "Request_54_54.json,http://www.surf.scss.tcd.ie/cityOntology/#Educational",
    "Request_5_5.json,http://www.surf.scss.tcd.ie/cityOntology/#Transport_and_Mobility",
    "Request_85_87.json,http://www.surf.scss.tcd.ie/cityOntology/#Accommodation",
    "Request_85_85.json,http://www.surf.scss.tcd.ie/cityOntology/#Accommodation",
    "Request_11_6.json,http://www.surf.scss.tcd.ie/cityOntology/#Transport_and_Mobility",
    "Request_31_30.json,http://www.surf.scss.tcd.ie/cityOntology/#Safety_and_Emergencies",
    "Request_6_6.json,http://www.surf.scss.tcd.ie/cityOntology/#Transport_and_Mobility",
    "Request_17_20.json,http://www.surf.scss.tcd.ie/cityOntology/#Safety_and_Emergencies",
    "Request_60_60.json,http://www.surf.scss.tcd.ie/cityOntology/#Educational,http://www.surf.scss.tcd.ie/cityOntology/#Research_and_Science",
    "Request_64_64.json,http://www.surf.scss.tcd.ie/cityOntology/#Educational",
    "Request_113_113.json,http://www.surf.scss.tcd.ie/cityOntology/#Safety_and_Emergencies",
    "Request_41_45.json,http://www.surf.scss.tcd.ie/cityOntology/#Safety_and_Emergencies,http://www.surf.scss.tcd.ie/cityOntology/#Construction",
    "Request_70_134.json,http://www.surf.scss.tcd.ie/cityOntology/#Clothing,http://www.surf.scss.tcd.ie/cityOntology/#Food_and_Drinks,http://www.surf.scss.tcd.ie/cityOntology/#Sport,http://www.surf.scss.tcd.ie/cityOntology/#Tools,http://www.surf.scss.tcd.ie/cityOntology/#Furniture_and_Housing,http://www.surf.scss.tcd.ie/cityOntology/#Technology",
    "Request_126_128.json,http://www.surf.scss.tcd.ie/cityOntology/#Government_and_Planning,http://www.surf.scss.tcd.ie/cityOntology/#Nature",
    "Request_48_50.json,http://www.surf.scss.tcd.ie/cityOntology/#Educational",
    "Request_4_8.json,http://www.surf.scss.tcd.ie/cityOntology/#Transport_and_Mobility",
    "Request_64_67.json,http://www.surf.scss.tcd.ie/cityOntology/#Educational",
    "Request_61_62.json,http://www.surf.scss.tcd.ie/cityOntology/#Educational",
    "Request_42_43.json,http://www.surf.scss.tcd.ie/cityOntology/#Safety_and_Emergencies,http://www.surf.scss.tcd.ie/cityOntology/#Construction",
    "Request_21_25.json,http://www.surf.scss.tcd.ie/cityOntology/#Safety_and_Emergencies",
    "Request_11_12.json,http://www.surf.scss.tcd.ie/cityOntology/#Transport_and_Mobility",
    "Request_82_82.json,http://www.surf.scss.tcd.ie/cityOntology/#Accommodation",
    "Request_7_5.json,http://www.surf.scss.tcd.ie/cityOntology/#Transport_and_Mobility",
    "Request_55_60.json,http://www.surf.scss.tcd.ie/cityOntology/#Educational,http://www.surf.scss.tcd.ie/cityOntology/#Research_and_Science",
    "Request_70_135.json,http://www.surf.scss.tcd.ie/cityOntology/#Clothing,http://www.surf.scss.tcd.ie/cityOntology/#Food_and_Drinks,http://www.surf.scss.tcd.ie/cityOntology/#Sport,http://www.surf.scss.tcd.ie/cityOntology/#Tools,http://www.surf.scss.tcd.ie/cityOntology/#Furniture_and_Housing,http://www.surf.scss.tcd.ie/cityOntology/#Technology",
    "Request_1_6.json,http://www.surf.scss.tcd.ie/cityOntology/#Transport_and_Mobility",
    "Request_98_99.json,http://www.surf.scss.tcd.ie/cityOntology/#Logistic,http://www.surf.scss.tcd.ie/cityOntology/#Communications",
    "Request_51_53.json,http://www.surf.scss.tcd.ie/cityOntology/#Educational",
    "Request_8_8.json,http://www.surf.scss.tcd.ie/cityOntology/#Transport_and_Mobility",
    "Request_7_11.json,http://www.surf.scss.tcd.ie/cityOntology/#Transport_and_Mobility",
    "Request_70_70.json,http://www.surf.scss.tcd.ie/cityOntology/#Clothing",
    "Request_22_22.json,http://www.surf.scss.tcd.ie/cityOntology/#Safety_and_Emergencies",
    "Request_63_65.json,http://www.surf.scss.tcd.ie/cityOntology/#Educational",
    "Request_7_9.json,http://www.surf.scss.tcd.ie/cityOntology/#Transport_and_Mobility",
    "Request_32_35.json,http://www.surf.scss.tcd.ie/cityOntology/#Safety_and_Emergencies",
    "Request_58_60.json,http://www.surf.scss.tcd.ie/cityOntology/#Educational,http://www.surf.scss.tcd.ie/cityOntology/#Research_and_Science",
    "Request_75_78.json,http://www.surf.scss.tcd.ie/cityOntology/#Activity",
    "Request_77_78.json,http://www.surf.scss.tcd.ie/cityOntology/#Activity",
    "Request_82_86.json,http://www.surf.scss.tcd.ie/cityOntology/#Accommodation",
    "Request_29_29.json,http://www.surf.scss.tcd.ie/cityOntology/#Safety_and_Emergencies",
    "Request_30_34.json,http://www.surf.scss.tcd.ie/cityOntology/#Safety_and_Emergencies",
    "Request_122_123.json,http://www.surf.scss.tcd.ie/cityOntology/#Sport",
    "Request_8_3.json,http://www.surf.scss.tcd.ie/cityOntology/#Transport_and_Mobility",
    "Request_29_31.json,http://www.surf.scss.tcd.ie/cityOntology/#Safety_and_Emergencies",
    "Request_65_64.json,http://www.surf.scss.tcd.ie/cityOntology/#Educational",
    "Request_76_77.json,http://www.surf.scss.tcd.ie/cityOntology/#Activity",
    "Request_3_13.json,http://www.surf.scss.tcd.ie/cityOntology/#Transport_and_Mobility",
    "Request_99_98.json,http://www.surf.scss.tcd.ie/cityOntology/#Logistic,http://www.surf.scss.tcd.ie/cityOntology/#Communications",
    "Request_120_123.json,http://www.surf.scss.tcd.ie/cityOntology/#Transport_and_Mobility,http://www.surf.scss.tcd.ie/cityOntology/#Sport",
    "Request_34_34.json,http://www.surf.scss.tcd.ie/cityOntology/#Safety_and_Emergencies",
    "Request_83_85.json,http://www.surf.scss.tcd.ie/cityOntology/#Accommodation",
    "Request_45_45.json,http://www.surf.scss.tcd.ie/cityOntology/#Safety_and_Emergencies,http://www.surf.scss.tcd.ie/cityOntology/#Construction",
    "Request_58_58.json,http://www.surf.scss.tcd.ie/cityOntology/#Educational",
    "Request_124_124.json,http://www.surf.scss.tcd.ie/cityOntology/#Safety_and_Emergencies,http://www.surf.scss.tcd.ie/cityOntology/#Transport_and_Mobility,http://www.surf.scss.tcd.ie/cityOntology/#Government_and_Planning",
    "Request_77_77.json,http://www.surf.scss.tcd.ie/cityOntology/#Activity",
    "Request_8_13.json,http://www.surf.scss.tcd.ie/cityOntology/#Transport_and_Mobility",
    "Request_4_3.json,http://www.surf.scss.tcd.ie/cityOntology/#Transport_and_Mobility",
    "Request_8_10.json,http://www.surf.scss.tcd.ie/cityOntology/#Transport_and_Mobility",
    "Request_83_87.json,http://www.surf.scss.tcd.ie/cityOntology/#Accommodation",
    "Request_29_34.json,http://www.surf.scss.tcd.ie/cityOntology/#Safety_and_Emergencies",
    "Request_10_9.json,http://www.surf.scss.tcd.ie/cityOntology/#Transport_and_Mobility",
    "Request_34_33.json,http://www.surf.scss.tcd.ie/cityOntology/#Safety_and_Emergencies",
    "Request_1_4.json,http://www.surf.scss.tcd.ie/cityOntology/#Transport_and_Mobility",
    "Request_114_117.json,http://www.surf.scss.tcd.ie/cityOntology/#Safety_and_Emergencies,http://www.surf.scss.tcd.ie/cityOntology/#Finance",
    "Request_88_89.json,http://www.surf.scss.tcd.ie/cityOntology/#Health",
    "Request_10_11.json,http://www.surf.scss.tcd.ie/cityOntology/#Transport_and_Mobility",
    "Request_4_4.json,http://www.surf.scss.tcd.ie/cityOntology/#Transport_and_Mobility",
    "Request_115_117.json,http://www.surf.scss.tcd.ie/cityOntology/#Safety_and_Emergencies,http://www.surf.scss.tcd.ie/cityOntology/#Finance",
    "Request_41_44.json,http://www.surf.scss.tcd.ie/cityOntology/#Safety_and_Emergencies,http://www.surf.scss.tcd.ie/cityOntology/#Construction",
    "Request_131_136.json,http://www.surf.scss.tcd.ie/cityOntology/#Technology,http://www.surf.scss.tcd.ie/cityOntology/#Food_and_Drinks,http://www.surf.scss.tcd.ie/cityOntology/#Sport,http://www.surf.scss.tcd.ie/cityOntology/#Tools,http://www.surf.scss.tcd.ie/cityOntology/#Furniture_and_Housing,http://www.surf.scss.tcd.ie/cityOntology/#Clothing",
    "Request_59_60.json,http://www.surf.scss.tcd.ie/cityOntology/#Educational,http://www.surf.scss.tcd.ie/cityOntology/#Research_and_Science",
    "Request_5_8.json,http://www.surf.scss.tcd.ie/cityOntology/#Transport_and_Mobility",
    "Request_1_2.json,http://www.surf.scss.tcd.ie/cityOntology/#Transport_and_Mobility",
    "Request_23_28.json,http://www.surf.scss.tcd.ie/cityOntology/#Safety_and_Emergencies",
    "Request_122_122.json,http://www.surf.scss.tcd.ie/cityOntology/#Sport",
    "Request_7_3.json,http://www.surf.scss.tcd.ie/cityOntology/#Transport_and_Mobility",
    "Request_75_77.json,http://www.surf.scss.tcd.ie/cityOntology/#Activity",
    "Request_2_4.json,http://www.surf.scss.tcd.ie/cityOntology/#Transport_and_Mobility",
    "Request_63_63.json,http://www.surf.scss.tcd.ie/cityOntology/#Educational",
    "Request_84_84.json,http://www.surf.scss.tcd.ie/cityOntology/#Accommodation",
    "Request_29_35.json,http://www.surf.scss.tcd.ie/cityOntology/#Safety_and_Emergencies",
    "Request_31_34.json,http://www.surf.scss.tcd.ie/cityOntology/#Safety_and_Emergencies",
    "Request_97_100.json,http://www.surf.scss.tcd.ie/cityOntology/#Logistic,http://www.surf.scss.tcd.ie/cityOntology/#Communications",
    "Request_94_96.json,http://www.surf.scss.tcd.ie/cityOntology/#Transport_and_Mobility,http://www.surf.scss.tcd.ie/cityOntology/#Health,http://www.surf.scss.tcd.ie/cityOntology/#Safety_and_Emergencies",
    "Request_30_35.json,http://www.surf.scss.tcd.ie/cityOntology/#Safety_and_Emergencies",
    "Request_10_4.json,http://www.surf.scss.tcd.ie/cityOntology/#Transport_and_Mobility",
    "Request_21_28.json,http://www.surf.scss.tcd.ie/cityOntology/#Safety_and_Emergencies",
    "Request_125_126.json,http://www.surf.scss.tcd.ie/cityOntology/#Government_and_Planning,http://www.surf.scss.tcd.ie/cityOntology/#Nature",
    "Request_6_2.json,http://www.surf.scss.tcd.ie/cityOntology/#Transport_and_Mobility",
    "Request_62_62.json,http://www.surf.scss.tcd.ie/cityOntology/#Educational",
    "Request_119_123.json,http://www.surf.scss.tcd.ie/cityOntology/#Sport,http://www.surf.scss.tcd.ie/cityOntology/#Leisure",
    "Request_19_20.json,http://www.surf.scss.tcd.ie/cityOntology/#Safety_and_Emergencies",
    "Request_53_53.json,http://www.surf.scss.tcd.ie/cityOntology/#Educational",
    "Request_98_98.json,http://www.surf.scss.tcd.ie/cityOntology/#Logistic,http://www.surf.scss.tcd.ie/cityOntology/#Communications",
    "Request_68_136.json,http://www.surf.scss.tcd.ie/cityOntology/#Food_and_Drinks,http://www.surf.scss.tcd.ie/cityOntology/#Sport,http://www.surf.scss.tcd.ie/cityOntology/#Tools,http://www.surf.scss.tcd.ie/cityOntology/#Furniture_and_Housing,http://www.surf.scss.tcd.ie/cityOntology/#Clothing,http://www.surf.scss.tcd.ie/cityOntology/#Technology",
    "Request_40_45.json,http://www.surf.scss.tcd.ie/cityOntology/#Safety_and_Emergencies,http://www.surf.scss.tcd.ie/cityOntology/#Construction",
    "Request_3_3.json,http://www.surf.scss.tcd.ie/cityOntology/#Transport_and_Mobility",
    "Request_63_67.json,http://www.surf.scss.tcd.ie/cityOntology/#Educational",
    "Request_11_9.json,http://www.surf.scss.tcd.ie/cityOntology/#Transport_and_Mobility",
    "Request_7_8.json,http://www.surf.scss.tcd.ie/cityOntology/#Transport_and_Mobility",
    "Request_46_47.json,http://www.surf.scss.tcd.ie/cityOntology/#Educational",
    "Request_119_119.json,http://www.surf.scss.tcd.ie/cityOntology/#Sport,http://www.surf.scss.tcd.ie/cityOntology/#Leisure",
    "Request_133_134.json,http://www.surf.scss.tcd.ie/cityOntology/#Furniture_and_Housing,http://www.surf.scss.tcd.ie/cityOntology/#Food_and_Drinks,http://www.surf.scss.tcd.ie/cityOntology/#Clothing,http://www.surf.scss.tcd.ie/cityOntology/#Sport,http://www.surf.scss.tcd.ie/cityOntology/#Tools,http://www.surf.scss.tcd.ie/cityOntology/#Technology",
    "Request_97_97.json,http://www.surf.scss.tcd.ie/cityOntology/#Logistic,http://www.surf.scss.tcd.ie/cityOntology/#Communications",
    "Request_56_57.json,http://www.surf.scss.tcd.ie/cityOntology/#Educational,http://www.surf.scss.tcd.ie/cityOntology/#Research_and_Science",
    "Request_74_78.json,http://www.surf.scss.tcd.ie/cityOntology/#Activity",
    "Request_92_92.json,http://www.surf.scss.tcd.ie/cityOntology/#Health,http://www.surf.scss.tcd.ie/cityOntology/#Safety_and_Emergencies",
    "Request_37_37.json,http://www.surf.scss.tcd.ie/cityOntology/#Safety_and_Emergencies,http://www.surf.scss.tcd.ie/cityOntology/#Buildings",
    "Request_89_90.json,http://www.surf.scss.tcd.ie/cityOntology/#Health",
    "Request_52_52.json,http://www.surf.scss.tcd.ie/cityOntology/#Educational",
    "Request_132_135.json,http://www.surf.scss.tcd.ie/cityOntology/#Tools,http://www.surf.scss.tcd.ie/cityOntology/#Food_and_Drinks,http://www.surf.scss.tcd.ie/cityOntology/#Clothing,http://www.surf.scss.tcd.ie/cityOntology/#Sport,http://www.surf.scss.tcd.ie/cityOntology/#Furniture_and_Housing,http://www.surf.scss.tcd.ie/cityOntology/#Technology",
    "Request_114_114.json,http://www.surf.scss.tcd.ie/cityOntology/#Safety_and_Emergencies,http://www.surf.scss.tcd.ie/cityOntology/#Finance",
    "Request_86_87.json,http://www.surf.scss.tcd.ie/cityOntology/#Accommodation",
    "Request_26_27.json,http://www.surf.scss.tcd.ie/cityOntology/#Safety_and_Emergencies",
    "Request_114_115.json,http://www.surf.scss.tcd.ie/cityOntology/#Safety_and_Emergencies,http://www.surf.scss.tcd.ie/cityOntology/#Finance",
    "Request_69_134.json,http://www.surf.scss.tcd.ie/cityOntology/#Clothing,http://www.surf.scss.tcd.ie/cityOntology/#Food_and_Drinks,http://www.surf.scss.tcd.ie/cityOntology/#Sport,http://www.surf.scss.tcd.ie/cityOntology/#Tools,http://www.surf.scss.tcd.ie/cityOntology/#Furniture_and_Housing,http://www.surf.scss.tcd.ie/cityOntology/#Technology",
    "Request_39_39.json,http://www.surf.scss.tcd.ie/cityOntology/#Safety_and_Emergencies,http://www.surf.scss.tcd.ie/cityOntology/#Buildings",
    "Request_132_132.json,http://www.surf.scss.tcd.ie/cityOntology/#Tools",
    "Request_103_103.json,http://www.surf.scss.tcd.ie/cityOntology/#Transport_and_Mobility",
    "Request_68_134.json,http://www.surf.scss.tcd.ie/cityOntology/#Food_and_Drinks,http://www.surf.scss.tcd.ie/cityOntology/#Clothing,http://www.surf.scss.tcd.ie/cityOntology/#Sport,http://www.surf.scss.tcd.ie/cityOntology/#Tools,http://www.surf.scss.tcd.ie/cityOntology/#Furniture_and_Housing,http://www.surf.scss.tcd.ie/cityOntology/#Technology",
    "Request_93_94.json,http://www.surf.scss.tcd.ie/cityOntology/#Health,http://www.surf.scss.tcd.ie/cityOntology/#Safety_and_Emergencies,http://www.surf.scss.tcd.ie/cityOntology/#Transport_and_Mobility",
    "Request_92_93.json,http://www.surf.scss.tcd.ie/cityOntology/#Health,http://www.surf.scss.tcd.ie/cityOntology/#Safety_and_Emergencies",
    "Request_90_91.json,http://www.surf.scss.tcd.ie/cityOntology/#Health",
    "Request_115_116.json,http://www.surf.scss.tcd.ie/cityOntology/#Safety_and_Emergencies,http://www.surf.scss.tcd.ie/cityOntology/#Finance",
    "Request_4_10.json,http://www.surf.scss.tcd.ie/cityOntology/#Transport_and_Mobility",
    "Request_128_128.json,http://www.surf.scss.tcd.ie/cityOntology/#Government_and_Planning",
    "Request_10_13.json,http://www.surf.scss.tcd.ie/cityOntology/#Transport_and_Mobility",
    "Request_21_26.json,http://www.surf.scss.tcd.ie/cityOntology/#Safety_and_Emergencies",
    "Request_68_68.json,http://www.surf.scss.tcd.ie/cityOntology/#Food_and_Drinks",
    "Request_23_26.json,http://www.surf.scss.tcd.ie/cityOntology/#Safety_and_Emergencies",
    "Request_75_76.json,http://www.surf.scss.tcd.ie/cityOntology/#Activity",
    "Request_101_101.json,http://www.surf.scss.tcd.ie/cityOntology/#Transport_and_Mobility",
    "Request_23_24.json,http://www.surf.scss.tcd.ie/cityOntology/#Safety_and_Emergencies",
    "Request_8_2.json,http://www.surf.scss.tcd.ie/cityOntology/#Transport_and_Mobility",
    "Request_10_8.json,http://www.surf.scss.tcd.ie/cityOntology/#Transport_and_Mobility",
    "Request_33_35.json,http://www.surf.scss.tcd.ie/cityOntology/#Safety_and_Emergencies",
    "Request_12_12.json,http://www.surf.scss.tcd.ie/cityOntology/#Transport_and_Mobility",
    "Request_76_78.json,http://www.surf.scss.tcd.ie/cityOntology/#Activity",
    "Request_5_9.json,http://www.surf.scss.tcd.ie/cityOntology/#Transport_and_Mobility",
    "Request_2_2.json,http://www.surf.scss.tcd.ie/cityOntology/#Transport_and_Mobility",
    "Request_130_136.json,http://www.surf.scss.tcd.ie/cityOntology/#Sport,http://www.surf.scss.tcd.ie/cityOntology/#Food_and_Drinks,http://www.surf.scss.tcd.ie/cityOntology/#Tools,http://www.surf.scss.tcd.ie/cityOntology/#Furniture_and_Housing,http://www.surf.scss.tcd.ie/cityOntology/#Clothing,http://www.surf.scss.tcd.ie/cityOntology/#Technology",
    "Request_116_115.json,http://www.surf.scss.tcd.ie/cityOntology/#Safety_and_Emergencies,http://www.surf.scss.tcd.ie/cityOntology/#Finance",
    "Request_126_126.json,http://www.surf.scss.tcd.ie/cityOntology/#Government_and_Planning,http://www.surf.scss.tcd.ie/cityOntology/#Nature",
    "Request_110_110.json,http://www.surf.scss.tcd.ie/cityOntology/#Energy",
    "Request_34_35.json,http://www.surf.scss.tcd.ie/cityOntology/#Safety_and_Emergencies",
    "Request_74_76.json,http://www.surf.scss.tcd.ie/cityOntology/#Activity",
    "Request_90_89.json,http://www.surf.scss.tcd.ie/cityOntology/#Health",
    "Request_49_50.json,http://www.surf.scss.tcd.ie/cityOntology/#Educational",
    "Request_11_8.json,http://www.surf.scss.tcd.ie/cityOntology/#Transport_and_Mobility",
    "Request_97_98.json,http://www.surf.scss.tcd.ie/cityOntology/#Logistic,http://www.surf.scss.tcd.ie/cityOntology/#Communications",
    "Request_1_12.json,http://www.surf.scss.tcd.ie/cityOntology/#Transport_and_Mobility",
    "Request_55_57.json,http://www.surf.scss.tcd.ie/cityOntology/#Educational,http://www.surf.scss.tcd.ie/cityOntology/#Research_and_Science",
    "Request_50_50.json,http://www.surf.scss.tcd.ie/cityOntology/#Educational",
    "Request_94_94.json,http://www.surf.scss.tcd.ie/cityOntology/#Transport_and_Mobility",
    "Request_124_126.json,http://www.surf.scss.tcd.ie/cityOntology/#Safety_and_Emergencies,http://www.surf.scss.tcd.ie/cityOntology/#Transport_and_Mobility,http://www.surf.scss.tcd.ie/cityOntology/#Government_and_Planning,http://www.surf.scss.tcd.ie/cityOntology/#Nature",
    "Request_125_127.json,http://www.surf.scss.tcd.ie/cityOntology/#Government_and_Planning,http://www.surf.scss.tcd.ie/cityOntology/#Nature",
    "Request_114_116.json,http://www.surf.scss.tcd.ie/cityOntology/#Safety_and_Emergencies,http://www.surf.scss.tcd.ie/cityOntology/#Finance",
    "Request_40_42.json,http://www.surf.scss.tcd.ie/cityOntology/#Safety_and_Emergencies,http://www.surf.scss.tcd.ie/cityOntology/#Construction",
    "Request_95_96.json,http://www.surf.scss.tcd.ie/cityOntology/#Communications,http://www.surf.scss.tcd.ie/cityOntology/#Transport_and_Mobility,http://www.surf.scss.tcd.ie/cityOntology/#Health,http://www.surf.scss.tcd.ie/cityOntology/#Safety_and_Emergencies",
    "Request_121_123.json,http://www.surf.scss.tcd.ie/cityOntology/#Sport,http://www.surf.scss.tcd.ie/cityOntology/#Leisure",
    "Request_56_56.json,http://www.surf.scss.tcd.ie/cityOntology/#Educational,http://www.surf.scss.tcd.ie/cityOntology/#Research_and_Science",
    "Request_2_12.json,http://www.surf.scss.tcd.ie/cityOntology/#Transport_and_Mobility",
    "Request_92_94.json,http://www.surf.scss.tcd.ie/cityOntology/#Health,http://www.surf.scss.tcd.ie/cityOntology/#Safety_and_Emergencies,http://www.surf.scss.tcd.ie/cityOntology/#Transport_and_Mobility",
    "Request_46_50.json,http://www.surf.scss.tcd.ie/cityOntology/#Educational",
    "Request_4_12.json,http://www.surf.scss.tcd.ie/cityOntology/#Transport_and_Mobility",
    "Request_11_13.json,http://www.surf.scss.tcd.ie/cityOntology/#Transport_and_Mobility",
    "Request_68_135.json,http://www.surf.scss.tcd.ie/cityOntology/#Food_and_Drinks,http://www.surf.scss.tcd.ie/cityOntology/#Clothing,http://www.surf.scss.tcd.ie/cityOntology/#Sport,http://www.surf.scss.tcd.ie/cityOntology/#Tools,http://www.surf.scss.tcd.ie/cityOntology/#Furniture_and_Housing,http://www.surf.scss.tcd.ie/cityOntology/#Technology",
    "Request_71_72.json,http://www.surf.scss.tcd.ie/cityOntology/#Clothing",
    "Request_135_136.json,http://www.surf.scss.tcd.ie/cityOntology/#Food_and_Drinks,http://www.surf.scss.tcd.ie/cityOntology/#Clothing,http://www.surf.scss.tcd.ie/cityOntology/#Sport,http://www.surf.scss.tcd.ie/cityOntology/#Tools,http://www.surf.scss.tcd.ie/cityOntology/#Furniture_and_Housing,http://www.surf.scss.tcd.ie/cityOntology/#Technology",
    "Request_83_86.json,http://www.surf.scss.tcd.ie/cityOntology/#Accommodation",
    "Request_24_27.json,http://www.surf.scss.tcd.ie/cityOntology/#Safety_and_Emergencies",
    "Request_76_76.json,http://www.surf.scss.tcd.ie/cityOntology/#Activity",
    "Request_29_33.json,http://www.surf.scss.tcd.ie/cityOntology/#Safety_and_Emergencies",
    "Request_79_79.json,http://www.surf.scss.tcd.ie/cityOntology/#Touristic_Place,http://www.surf.scss.tcd.ie/cityOntology/#History",
    "Request_17_18.json,http://www.surf.scss.tcd.ie/cityOntology/#Safety_and_Emergencies",
    "Request_42_44.json,http://www.surf.scss.tcd.ie/cityOntology/#Safety_and_Emergencies,http://www.surf.scss.tcd.ie/cityOntology/#Construction",
    "Request_22_26.json,http://www.surf.scss.tcd.ie/cityOntology/#Safety_and_Emergencies",
    "Request_66_66.json,http://www.surf.scss.tcd.ie/cityOntology/#Educational",
    "Request_112_112.json,http://www.surf.scss.tcd.ie/cityOntology/#Educational",
    "Request_25_25.json,http://www.surf.scss.tcd.ie/cityOntology/#Safety_and_Emergencies",
    "Request_8_11.json,http://www.surf.scss.tcd.ie/cityOntology/#Transport_and_Mobility",
    "Request_124_125.json,http://www.surf.scss.tcd.ie/cityOntology/#Safety_and_Emergencies,http://www.surf.scss.tcd.ie/cityOntology/#Transport_and_Mobility,http://www.surf.scss.tcd.ie/cityOntology/#Government_and_Planning",
    "Request_5_2.json,http://www.surf.scss.tcd.ie/cityOntology/#Transport_and_Mobility",
    "Request_2_7.json,http://www.surf.scss.tcd.ie/cityOntology/#Transport_and_Mobility",
    "Request_130_135.json,http://www.surf.scss.tcd.ie/cityOntology/#Sport,http://www.surf.scss.tcd.ie/cityOntology/#Food_and_Drinks,http://www.surf.scss.tcd.ie/cityOntology/#Clothing,http://www.surf.scss.tcd.ie/cityOntology/#Tools,http://www.surf.scss.tcd.ie/cityOntology/#Furniture_and_Housing,http://www.surf.scss.tcd.ie/cityOntology/#Technology",
    "Request_121_121.json,http://www.surf.scss.tcd.ie/cityOntology/#Sport,http://www.surf.scss.tcd.ie/cityOntology/#Leisure",
    "Request_4_6.json,http://www.surf.scss.tcd.ie/cityOntology/#Transport_and_Mobility",
    "Request_6_8.json,http://www.surf.scss.tcd.ie/cityOntology/#Transport_and_Mobility",
    "Request_36_38.json,http://www.surf.scss.tcd.ie/cityOntology/#Safety_and_Emergencies,http://www.surf.scss.tcd.ie/cityOntology/#Buildings",
    "Request_35_35.json,http://www.surf.scss.tcd.ie/cityOntology/#Safety_and_Emergencies",
    "Request_11_10.json,http://www.surf.scss.tcd.ie/cityOntology/#Transport_and_Mobility",
    "Request_24_22.json,http://www.surf.scss.tcd.ie/cityOntology/#Safety_and_Emergencies",
    "Request_7_12.json,http://www.surf.scss.tcd.ie/cityOntology/#Transport_and_Mobility",
    "Request_48_48.json,http://www.surf.scss.tcd.ie/cityOntology/#Educational",
    "Request_14_16.json,http://www.surf.scss.tcd.ie/cityOntology/#Transport_and_Mobility",
    "Request_83_84.json,http://www.surf.scss.tcd.ie/cityOntology/#Accommodation",
    "Request_133_136.json,http://www.surf.scss.tcd.ie/cityOntology/#Furniture_and_Housing,http://www.surf.scss.tcd.ie/cityOntology/#Food_and_Drinks,http://www.surf.scss.tcd.ie/cityOntology/#Sport,http://www.surf.scss.tcd.ie/cityOntology/#Tools,http://www.surf.scss.tcd.ie/cityOntology/#Clothing,http://www.surf.scss.tcd.ie/cityOntology/#Technology",
    "Request_86_86.json,http://www.surf.scss.tcd.ie/cityOntology/#Accommodation",
    "Request_1_3.json,http://www.surf.scss.tcd.ie/cityOntology/#Transport_and_Mobility",
    "Request_120_120.json,http://www.surf.scss.tcd.ie/cityOntology/#Transport_and_Mobility",
    "Request_21_27.json,http://www.surf.scss.tcd.ie/cityOntology/#Safety_and_Emergencies",
    "Request_91_91.json,http://www.surf.scss.tcd.ie/cityOntology/#Health",
    "Request_64_65.json,http://www.surf.scss.tcd.ie/cityOntology/#Educational",
    "Request_99_99.json,http://www.surf.scss.tcd.ie/cityOntology/#Logistic,http://www.surf.scss.tcd.ie/cityOntology/#Communications",
    "Request_8_4.json,http://www.surf.scss.tcd.ie/cityOntology/#Transport_and_Mobility",
    "Request_125_128.json,http://www.surf.scss.tcd.ie/cityOntology/#Government_and_Planning",
    "Request_30_32.json,http://www.surf.scss.tcd.ie/cityOntology/#Safety_and_Emergencies",
    "Request_130_134.json,http://www.surf.scss.tcd.ie/cityOntology/#Sport,http://www.surf.scss.tcd.ie/cityOntology/#Food_and_Drinks,http://www.surf.scss.tcd.ie/cityOntology/#Clothing,http://www.surf.scss.tcd.ie/cityOntology/#Tools,http://www.surf.scss.tcd.ie/cityOntology/#Furniture_and_Housing,http://www.surf.scss.tcd.ie/cityOntology/#Technology",
    "Request_93_95.json,http://www.surf.scss.tcd.ie/cityOntology/#Health,http://www.surf.scss.tcd.ie/cityOntology/#Safety_and_Emergencies,http://www.surf.scss.tcd.ie/cityOntology/#Communications,http://www.surf.scss.tcd.ie/cityOntology/#Transport_and_Mobility",
    "Request_7_4.json,http://www.surf.scss.tcd.ie/cityOntology/#Transport_and_Mobility",
    "Request_22_24.json,http://www.surf.scss.tcd.ie/cityOntology/#Safety_and_Emergencies",
    "Request_56_60.json,http://www.surf.scss.tcd.ie/cityOntology/#Educational,http://www.surf.scss.tcd.ie/cityOntology/#Research_and_Science",
    "Request_132_136.json,http://www.surf.scss.tcd.ie/cityOntology/#Tools,http://www.surf.scss.tcd.ie/cityOntology/#Food_and_Drinks,http://www.surf.scss.tcd.ie/cityOntology/#Sport,http://www.surf.scss.tcd.ie/cityOntology/#Furniture_and_Housing,http://www.surf.scss.tcd.ie/cityOntology/#Clothing,http://www.surf.scss.tcd.ie/cityOntology/#Technology",
    "Request_46_48.json,http://www.surf.scss.tcd.ie/cityOntology/#Educational",
    "Request_31_32.json,http://www.surf.scss.tcd.ie/cityOntology/#Safety_and_Emergencies",
    "Request_32_33.json,http://www.surf.scss.tcd.ie/cityOntology/#Safety_and_Emergencies",
    "Request_36_36.json,http://www.surf.scss.tcd.ie/cityOntology/#Safety_and_Emergencies,http://www.surf.scss.tcd.ie/cityOntology/#Buildings",
    "Request_11_5.json,http://www.surf.scss.tcd.ie/cityOntology/#Transport_and_Mobility",
    "Request_43_43.json,http://www.surf.scss.tcd.ie/cityOntology/#Safety_and_Emergencies,http://www.surf.scss.tcd.ie/cityOntology/#Construction",
    "Request_58_59.json,http://www.surf.scss.tcd.ie/cityOntology/#Educational,http://www.surf.scss.tcd.ie/cityOntology/#Research_and_Science",
    "Request_6_10.json,http://www.surf.scss.tcd.ie/cityOntology/#Transport_and_Mobility",
    "Request_55_58.json,http://www.surf.scss.tcd.ie/cityOntology/#Educational,http://www.surf.scss.tcd.ie/cityOntology/#Research_and_Science",
    "Request_69_136.json,http://www.surf.scss.tcd.ie/cityOntology/#Clothing,http://www.surf.scss.tcd.ie/cityOntology/#Food_and_Drinks,http://www.surf.scss.tcd.ie/cityOntology/#Sport,http://www.surf.scss.tcd.ie/cityOntology/#Tools,http://www.surf.scss.tcd.ie/cityOntology/#Furniture_and_Housing,http://www.surf.scss.tcd.ie/cityOntology/#Technology",
    "Request_135_135.json,http://www.surf.scss.tcd.ie/cityOntology/#Food_and_Drinks,http://www.surf.scss.tcd.ie/cityOntology/#Clothing,http://www.surf.scss.tcd.ie/cityOntology/#Sport,http://www.surf.scss.tcd.ie/cityOntology/#Tools,http://www.surf.scss.tcd.ie/cityOntology/#Furniture_and_Housing,http://www.surf.scss.tcd.ie/cityOntology/#Technology",
    "Request_89_91.json,http://www.surf.scss.tcd.ie/cityOntology/#Health",
    "Request_30_33.json,http://www.surf.scss.tcd.ie/cityOntology/#Safety_and_Emergencies",
    "Request_5_13.json,http://www.surf.scss.tcd.ie/cityOntology/#Transport_and_Mobility",
    "Request_38_37.json,http://www.surf.scss.tcd.ie/cityOntology/#Safety_and_Emergencies,http://www.surf.scss.tcd.ie/cityOntology/#Buildings",
    "Request_24_23.json,http://www.surf.scss.tcd.ie/cityOntology/#Safety_and_Emergencies",
    "Request_17_17.json,http://www.surf.scss.tcd.ie/cityOntology/#Safety_and_Emergencies",
    "Request_127_126.json,http://www.surf.scss.tcd.ie/cityOntology/#Government_and_Planning,http://www.surf.scss.tcd.ie/cityOntology/#Nature",
    "Request_74_74.json,http://www.surf.scss.tcd.ie/cityOntology/#Activity",
    "Request_1_1.json,http://www.surf.scss.tcd.ie/cityOntology/#Transport_and_Mobility",
    "Request_37_38.json,http://www.surf.scss.tcd.ie/cityOntology/#Safety_and_Emergencies,http://www.surf.scss.tcd.ie/cityOntology/#Buildings",
    "Request_63_64.json,http://www.surf.scss.tcd.ie/cityOntology/#Educational",
    "Request_31_35.json,http://www.surf.scss.tcd.ie/cityOntology/#Safety_and_Emergencies",
    "Request_2_3.json,http://www.surf.scss.tcd.ie/cityOntology/#Transport_and_Mobility",
    "Request_4_5.json,http://www.surf.scss.tcd.ie/cityOntology/#Transport_and_Mobility",
    "Request_66_67.json,http://www.surf.scss.tcd.ie/cityOntology/#Educational",
    "Request_24_26.json,http://www.surf.scss.tcd.ie/cityOntology/#Safety_and_Emergencies",
    "Request_69_69.json,http://www.surf.scss.tcd.ie/cityOntology/#Clothing",
    "Request_9_9.json,http://www.surf.scss.tcd.ie/cityOntology/#Transport_and_Mobility",
    "Request_55_55.json,http://www.surf.scss.tcd.ie/cityOntology/#Educational,http://www.surf.scss.tcd.ie/cityOntology/#Research_and_Science",
    "Request_1_7.json,http://www.surf.scss.tcd.ie/cityOntology/#Transport_and_Mobility",
    "Request_73_73.json,http://www.surf.scss.tcd.ie/cityOntology/#Clothing",
    "Request_74_77.json,http://www.surf.scss.tcd.ie/cityOntology/#Activity",
    "Request_61_61.json,http://www.surf.scss.tcd.ie/cityOntology/#Educational",
    "Request_105_105.json,http://www.surf.scss.tcd.ie/cityOntology/#Transport_and_Mobility",
    "Request_133_135.json,http://www.surf.scss.tcd.ie/cityOntology/#Furniture_and_Housing,http://www.surf.scss.tcd.ie/cityOntology/#Food_and_Drinks,http://www.surf.scss.tcd.ie/cityOntology/#Clothing,http://www.surf.scss.tcd.ie/cityOntology/#Sport,http://www.surf.scss.tcd.ie/cityOntology/#Tools,http://www.surf.scss.tcd.ie/cityOntology/#Technology",
    "Request_6_3.json,http://www.surf.scss.tcd.ie/cityOntology/#Transport_and_Mobility",
    "Request_1_10.json,http://www.surf.scss.tcd.ie/cityOntology/#Transport_and_Mobility",
    "Request_20_20.json,http://www.surf.scss.tcd.ie/cityOntology/#Safety_and_Emergencies",
    "Request_31_31.json,http://www.surf.scss.tcd.ie/cityOntology/#Safety_and_Emergencies",
    "Request_10_3.json,http://www.surf.scss.tcd.ie/cityOntology/#Transport_and_Mobility",
    "Request_124_127.json,http://www.surf.scss.tcd.ie/cityOntology/#Safety_and_Emergencies,http://www.surf.scss.tcd.ie/cityOntology/#Transport_and_Mobility,http://www.surf.scss.tcd.ie/cityOntology/#Government_and_Planning,http://www.surf.scss.tcd.ie/cityOntology/#Nature",
    "Request_28_28.json,http://www.surf.scss.tcd.ie/cityOntology/#Safety_and_Emergencies",
    "Request_10_5.json,http://www.surf.scss.tcd.ie/cityOntology/#Transport_and_Mobility",
    "Request_41_41.json,http://www.surf.scss.tcd.ie/cityOntology/#Safety_and_Emergencies,http://www.surf.scss.tcd.ie/cityOntology/#Construction",
    "Request_40_41.json,http://www.surf.scss.tcd.ie/cityOntology/#Safety_and_Emergencies,http://www.surf.scss.tcd.ie/cityOntology/#Construction",
    "Request_29_30.json,http://www.surf.scss.tcd.ie/cityOntology/#Safety_and_Emergencies",
    "Request_88_88.json,http://www.surf.scss.tcd.ie/cityOntology/#Health",
    "Request_133_133.json,http://www.surf.scss.tcd.ie/cityOntology/#Furniture_and_Housing",
    "Request_25_27.json,http://www.surf.scss.tcd.ie/cityOntology/#Safety_and_Emergencies",
    "Request_106_106.json,http://www.surf.scss.tcd.ie/cityOntology/#Transport_and_Mobility",
    "Request_87_87.json,http://www.surf.scss.tcd.ie/cityOntology/#Accommodation",
    "Request_24_25.json,http://www.surf.scss.tcd.ie/cityOntology/#Safety_and_Emergencies",
    "Request_11_4.json,http://www.surf.scss.tcd.ie/cityOntology/#Transport_and_Mobility",
    "Request_92_95.json,http://www.surf.scss.tcd.ie/cityOntology/#Health,http://www.surf.scss.tcd.ie/cityOntology/#Safety_and_Emergencies,http://www.surf.scss.tcd.ie/cityOntology/#Communications,http://www.surf.scss.tcd.ie/cityOntology/#Transport_and_Mobility",
    "Request_16_16.json,http://www.surf.scss.tcd.ie/cityOntology/#Transport_and_Mobility",
    "Request_10_7.json,http://www.surf.scss.tcd.ie/cityOntology/#Transport_and_Mobility",
    "Request_57_60.json,http://www.surf.scss.tcd.ie/cityOntology/#Educational,http://www.surf.scss.tcd.ie/cityOntology/#Research_and_Science",
    "Request_33_33.json,http://www.surf.scss.tcd.ie/cityOntology/#Safety_and_Emergencies",
    "Request_4_13.json,http://www.surf.scss.tcd.ie/cityOntology/#Transport_and_Mobility",
    "Request_80_80.json,http://www.surf.scss.tcd.ie/cityOntology/#Touristic_Place,http://www.surf.scss.tcd.ie/cityOntology/#History",
    "Request_88_90.json,http://www.surf.scss.tcd.ie/cityOntology/#Health",
    "Request_4_2.json,http://www.surf.scss.tcd.ie/cityOntology/#Transport_and_Mobility",
    "Request_7_13.json,http://www.surf.scss.tcd.ie/cityOntology/#Transport_and_Mobility",
    "Request_82_84.json,http://www.surf.scss.tcd.ie/cityOntology/#Accommodation",
    "Request_111_111.json,http://www.surf.scss.tcd.ie/cityOntology/#Educational",
    "Request_47_48.json,http://www.surf.scss.tcd.ie/cityOntology/#Educational",
    "Request_24_24.json,http://www.surf.scss.tcd.ie/cityOntology/#Safety_and_Emergencies",
    "Request_40_43.json,http://www.surf.scss.tcd.ie/cityOntology/#Safety_and_Emergencies,http://www.surf.scss.tcd.ie/cityOntology/#Construction",
    "Request_94_95.json,http://www.surf.scss.tcd.ie/cityOntology/#Transport_and_Mobility,http://www.surf.scss.tcd.ie/cityOntology/#Communications",
    "Request_22_25.json,http://www.surf.scss.tcd.ie/cityOntology/#Safety_and_Emergencies",
    "Request_51_54.json,http://www.surf.scss.tcd.ie/cityOntology/#Educational",
    "Request_23_23.json,http://www.surf.scss.tcd.ie/cityOntology/#Safety_and_Emergencies",
    "Request_71_71.json,http://www.surf.scss.tcd.ie/cityOntology/#Clothing",
    "Request_23_27.json,http://www.surf.scss.tcd.ie/cityOntology/#Safety_and_Emergencies",
    "Request_134_135.json,http://www.surf.scss.tcd.ie/cityOntology/#Food_and_Drinks,http://www.surf.scss.tcd.ie/cityOntology/#Clothing,http://www.surf.scss.tcd.ie/cityOntology/#Sport,http://www.surf.scss.tcd.ie/cityOntology/#Tools,http://www.surf.scss.tcd.ie/cityOntology/#Furniture_and_Housing,http://www.surf.scss.tcd.ie/cityOntology/#Technology",
    "Request_47_49.json,http://www.surf.scss.tcd.ie/cityOntology/#Educational",
    "Request_7_10.json,http://www.surf.scss.tcd.ie/cityOntology/#Transport_and_Mobility",
    "Request_17_19.json,http://www.surf.scss.tcd.ie/cityOntology/#Safety_and_Emergencies",
    "Request_22_27.json,http://www.surf.scss.tcd.ie/cityOntology/#Safety_and_Emergencies",
    "Request_124_128.json,http://www.surf.scss.tcd.ie/cityOntology/#Safety_and_Emergencies,http://www.surf.scss.tcd.ie/cityOntology/#Transport_and_Mobility,http://www.surf.scss.tcd.ie/cityOntology/#Government_and_Planning",
    "Request_118_118.json,http://www.surf.scss.tcd.ie/cityOntology/#Industry,http://www.surf.scss.tcd.ie/cityOntology/#Nature",
    "Request_8_9.json,http://www.surf.scss.tcd.ie/cityOntology/#Transport_and_Mobility",
    "Request_79_81.json,http://www.surf.scss.tcd.ie/cityOntology/#Touristic_Place,http://www.surf.scss.tcd.ie/cityOntology/#History",
    "Request_131_131.json,http://www.surf.scss.tcd.ie/cityOntology/#Technology",
    "Request_4_9.json,http://www.surf.scss.tcd.ie/cityOntology/#Transport_and_Mobility",
    "Request_69_70.json,http://www.surf.scss.tcd.ie/cityOntology/#Clothing",
    "Request_65_65.json,http://www.surf.scss.tcd.ie/cityOntology/#Educational",
    "Request_6_12.json,http://www.surf.scss.tcd.ie/cityOntology/#Transport_and_Mobility",
    "Request_10_12.json,http://www.surf.scss.tcd.ie/cityOntology/#Transport_and_Mobility",
    "Request_23_22.json,http://www.surf.scss.tcd.ie/cityOntology/#Safety_and_Emergencies",
    "Request_29_32.json,http://www.surf.scss.tcd.ie/cityOntology/#Safety_and_Emergencies",
    "Request_43_42.json,http://www.surf.scss.tcd.ie/cityOntology/#Safety_and_Emergencies,http://www.surf.scss.tcd.ie/cityOntology/#Construction",
    "Request_116_116.json,http://www.surf.scss.tcd.ie/cityOntology/#Safety_and_Emergencies,http://www.surf.scss.tcd.ie/cityOntology/#Finance",
    "Request_126_127.json,http://www.surf.scss.tcd.ie/cityOntology/#Government_and_Planning,http://www.surf.scss.tcd.ie/cityOntology/#Nature",
    "Request_127_127.json,http://www.surf.scss.tcd.ie/cityOntology/#Government_and_Planning,http://www.surf.scss.tcd.ie/cityOntology/#Nature",
    "Request_131_134.json,http://www.surf.scss.tcd.ie/cityOntology/#Technology,http://www.surf.scss.tcd.ie/cityOntology/#Food_and_Drinks,http://www.surf.scss.tcd.ie/cityOntology/#Clothing,http://www.surf.scss.tcd.ie/cityOntology/#Sport,http://www.surf.scss.tcd.ie/cityOntology/#Tools,http://www.surf.scss.tcd.ie/cityOntology/#Furniture_and_Housing",
    "Request_27_28.json,http://www.surf.scss.tcd.ie/cityOntology/#Safety_and_Emergencies",
    "Request_83_83.json,http://www.surf.scss.tcd.ie/cityOntology/#Accommodation",
    "Request_53_54.json,http://www.surf.scss.tcd.ie/cityOntology/#Educational",
    "Request_109_109.json,http://www.surf.scss.tcd.ie/cityOntology/#Energy",
    "Request_57_56.json,http://www.surf.scss.tcd.ie/cityOntology/#Educational,http://www.surf.scss.tcd.ie/cityOntology/#Research_and_Science",
    "Request_117_117.json,http://www.surf.scss.tcd.ie/cityOntology/#Safety_and_Emergencies,http://www.surf.scss.tcd.ie/cityOntology/#Finance",
    "Request_10_2.json,http://www.surf.scss.tcd.ie/cityOntology/#Transport_and_Mobility",
    "Request_122_121.json,http://www.surf.scss.tcd.ie/cityOntology/#Sport,http://www.surf.scss.tcd.ie/cityOntology/#Leisure",
    "Request_19_19.json,http://www.surf.scss.tcd.ie/cityOntology/#Safety_and_Emergencies",
    "Request_27_27.json,http://www.surf.scss.tcd.ie/cityOntology/#Safety_and_Emergencies",
    "Request_84_86.json,http://www.surf.scss.tcd.ie/cityOntology/#Accommodation",
    "Request_130_130.json,http://www.surf.scss.tcd.ie/cityOntology/#Sport",
    "Request_30_31.json,http://www.surf.scss.tcd.ie/cityOntology/#Safety_and_Emergencies",
    "Request_1_5.json,http://www.surf.scss.tcd.ie/cityOntology/#Transport_and_Mobility",
    "Request_65_66.json,http://www.surf.scss.tcd.ie/cityOntology/#Educational",
    "Request_40_44.json,http://www.surf.scss.tcd.ie/cityOntology/#Safety_and_Emergencies,http://www.surf.scss.tcd.ie/cityOntology/#Construction",
    "Request_23_25.json,http://www.surf.scss.tcd.ie/cityOntology/#Safety_and_Emergencies",
    "Request_33_34.json,http://www.surf.scss.tcd.ie/cityOntology/#Safety_and_Emergencies",
    "Request_14_15.json,http://www.surf.scss.tcd.ie/cityOntology/#Transport_and_Mobility",
    "Request_100_100.json,http://www.surf.scss.tcd.ie/cityOntology/#Logistic,http://www.surf.scss.tcd.ie/cityOntology/#Communications",
    "Request_55_59.json,http://www.surf.scss.tcd.ie/cityOntology/#Educational,http://www.surf.scss.tcd.ie/cityOntology/#Research_and_Science",
    "Request_32_32.json,http://www.surf.scss.tcd.ie/cityOntology/#Safety_and_Emergencies",
    "Request_22_28.json,http://www.surf.scss.tcd.ie/cityOntology/#Safety_and_Emergencies",
    "Request_51_51.json,http://www.surf.scss.tcd.ie/cityOntology/#Educational",
    "Request_8_12.json,http://www.surf.scss.tcd.ie/cityOntology/#Transport_and_Mobility",
    "Request_8_5.json,http://www.surf.scss.tcd.ie/cityOntology/#Transport_and_Mobility",
    "Request_41_43.json,http://www.surf.scss.tcd.ie/cityOntology/#Safety_and_Emergencies,http://www.surf.scss.tcd.ie/cityOntology/#Construction",
    "Request_89_89.json,http://www.surf.scss.tcd.ie/cityOntology/#Health",
    "Request_99_100.json,http://www.surf.scss.tcd.ie/cityOntology/#Logistic,http://www.surf.scss.tcd.ie/cityOntology/#Communications",
    "Request_8_7.json,http://www.surf.scss.tcd.ie/cityOntology/#Transport_and_Mobility",
    "Request_129_129.json,http://www.surf.scss.tcd.ie/cityOntology/#Nature",
    "Request_4_7.json,http://www.surf.scss.tcd.ie/cityOntology/#Transport_and_Mobility",
    "Request_13_13.json,http://www.surf.scss.tcd.ie/cityOntology/#Transport_and_Mobility",
    "Request_95_95.json,http://www.surf.scss.tcd.ie/cityOntology/#Communications,http://www.surf.scss.tcd.ie/cityOntology/#Transport_and_Mobility",
    "Request_85_86.json,http://www.surf.scss.tcd.ie/cityOntology/#Accommodation",
    "Request_21_22.json,http://www.surf.scss.tcd.ie/cityOntology/#Safety_and_Emergencies",
    "Request_108_108.json,http://www.surf.scss.tcd.ie/cityOntology/#Nature",
    "Request_96_96.json,http://www.surf.scss.tcd.ie/cityOntology/#Health,http://www.surf.scss.tcd.ie/cityOntology/#Safety_and_Emergencies",
    "Request_5_6.json,http://www.surf.scss.tcd.ie/cityOntology/#Transport_and_Mobility",
    "Request_53_52.json,http://www.surf.scss.tcd.ie/cityOntology/#Educational",
    "Request_125_125.json,http://www.surf.scss.tcd.ie/cityOntology/#Government_and_Planning",
    "Request_26_28.json,http://www.surf.scss.tcd.ie/cityOntology/#Safety_and_Emergencies",
    "Request_6_4.json,http://www.surf.scss.tcd.ie/cityOntology/#Transport_and_Mobility",
    "Request_57_59.json,http://www.surf.scss.tcd.ie/cityOntology/#Educational,http://www.surf.scss.tcd.ie/cityOntology/#Research_and_Science",
    "Request_5_12.json,http://www.surf.scss.tcd.ie/cityOntology/#Transport_and_Mobility",
    "Request_127_128.json,http://www.surf.scss.tcd.ie/cityOntology/#Government_and_Planning,http://www.surf.scss.tcd.ie/cityOntology/#Nature",
    "Request_4_11.json,http://www.surf.scss.tcd.ie/cityOntology/#Transport_and_Mobility",
    "Request_1_11.json,http://www.surf.scss.tcd.ie/cityOntology/#Transport_and_Mobility",
    "Request_52_53.json,http://www.surf.scss.tcd.ie/cityOntology/#Educational",
    "Request_119_121.json,http://www.surf.scss.tcd.ie/cityOntology/#Sport,http://www.surf.scss.tcd.ie/cityOntology/#Leisure",
    "Request_38_38.json,http://www.surf.scss.tcd.ie/cityOntology/#Safety_and_Emergencies,http://www.surf.scss.tcd.ie/cityOntology/#Buildings",
    "Request_11_3.json,http://www.surf.scss.tcd.ie/cityOntology/#Transport_and_Mobility",
    "Request_7_7.json,http://www.surf.scss.tcd.ie/cityOntology/#Transport_and_Mobility",
    "Request_26_26.json,http://www.surf.scss.tcd.ie/cityOntology/#Safety_and_Emergencies",
    "Request_18_18.json,http://www.surf.scss.tcd.ie/cityOntology/#Safety_and_Emergencies",
    "Request_2_9.json,http://www.surf.scss.tcd.ie/cityOntology/#Transport_and_Mobility",
    "Request_47_47.json,http://www.surf.scss.tcd.ie/cityOntology/#Educational",
    "Request_18_20.json,http://www.surf.scss.tcd.ie/cityOntology/#Safety_and_Emergencies",
    "Request_40_40.json,http://www.surf.scss.tcd.ie/cityOntology/#Safety_and_Emergencies,http://www.surf.scss.tcd.ie/cityOntology/#Construction",
    "Request_36_37.json,http://www.surf.scss.tcd.ie/cityOntology/#Safety_and_Emergencies,http://www.surf.scss.tcd.ie/cityOntology/#Buildings",
    "Request_98_100.json,http://www.surf.scss.tcd.ie/cityOntology/#Logistic,http://www.surf.scss.tcd.ie/cityOntology/#Communications",
    "Request_93_93.json,http://www.surf.scss.tcd.ie/cityOntology/#Health,http://www.surf.scss.tcd.ie/cityOntology/#Safety_and_Emergencies",
    "Request_65_67.json,http://www.surf.scss.tcd.ie/cityOntology/#Educational",
    "Request_102_102.json,http://www.surf.scss.tcd.ie/cityOntology/#Buildings",
    "Request_56_59.json,http://www.surf.scss.tcd.ie/cityOntology/#Educational,http://www.surf.scss.tcd.ie/cityOntology/#Research_and_Science",
    "Request_2_5.json,http://www.surf.scss.tcd.ie/cityOntology/#Transport_and_Mobility",
    "Request_92_96.json,http://www.surf.scss.tcd.ie/cityOntology/#Health,http://www.surf.scss.tcd.ie/cityOntology/#Safety_and_Emergencies",
    "Request_84_87.json,http://www.surf.scss.tcd.ie/cityOntology/#Accommodation",
    "Request_107_107.json,http://www.surf.scss.tcd.ie/cityOntology/#Waste",
    "Request_2_13.json,http://www.surf.scss.tcd.ie/cityOntology/#Transport_and_Mobility",
    "Request_47_50.json,http://www.surf.scss.tcd.ie/cityOntology/#Educational",
    "Request_11_2.json,http://www.surf.scss.tcd.ie/cityOntology/#Transport_and_Mobility",
    "Request_10_6.json,http://www.surf.scss.tcd.ie/cityOntology/#Transport_and_Mobility",
    "Request_63_66.json,http://www.surf.scss.tcd.ie/cityOntology/#Educational",
    "Request_6_11.json,http://www.surf.scss.tcd.ie/cityOntology/#Transport_and_Mobility",
    "Request_136_136.json,http://www.surf.scss.tcd.ie/cityOntology/#Food_and_Drinks,http://www.surf.scss.tcd.ie/cityOntology/#Sport,http://www.surf.scss.tcd.ie/cityOntology/#Tools,http://www.surf.scss.tcd.ie/cityOntology/#Furniture_and_Housing,http://www.surf.scss.tcd.ie/cityOntology/#Clothing,http://www.surf.scss.tcd.ie/cityOntology/#Technology"
  ]
}