{
  "outputs": [
    {
      "name": "_price",
      "type": "string",
      "desc": "Output of service CheapCar Price Report service"
    },
    {
      "name": "_report",
      "type": "string",
      "desc": "Output of service CheapCar Price Report service"
    }
  ],
  "provider": {
    "type": "wsdn"
  },
  "inputs": [
    {
      "name": "_cheapcar",
      "type": "string",
      "desc": "Input of service CheapCar Price Report service"
    }
  ],
  "name": "CheapCar Price Report service",
  "description": "This service returns not only price of a cheapcar, but also a short report about its recommendation.",
  "domains": [
    {
      "name": "Construction",
      "url": "http://www.surf.scss.tcd.ie/cityOntology/#Construction"
    }
  ],
  "id": "retail/cheapcar_pricereport_service",
  "state": true,
  "url": "http://surf.scss.tcd.ie/_provider_/retail/cheapcar_pricereport_service"
}