{
  "outputs": [
    {
      "name": "_diagnosticprocess",
      "type": "string",
      "desc": "Output of service DPA service"
    },
    {
      "name": "_cost",
      "type": "string",
      "desc": "Output of service DPA service"
    }
  ],
  "provider": {
    "type": "webservice"
  },
  "inputs": [
    {
      "name": "_hospital",
      "type": "string",
      "desc": "Input of service DPA service"
    }
  ],
  "name": "DPA service",
  "description": "DPA service returns certain type diagnostic process availablein the certain hospital, and its cost also.",
  "domains": [
    {
      "name": "Construction",
      "url": "http://www.surf.scss.tcd.ie/cityOntology/#Construction"
    }
  ],
  "id": "health/hospital_diagnosticprocesscost_service",
  "state": true,
  "url": "http://surf.scss.tcd.ie/_provider_/health/hospital_diagnosticprocesscost_service"
}