{
  "outputs": [
    {
      "name": "carStatus",
      "type": "json"
    }
  ],
  "provider": {
    "type": "asp"
  },
  "inputs": [
    {
      "name": "vehicleId",
      "type": "int"
    }
  ],
  "name": "vehicle_usage_monitoring",
  "description": "This is the service vehicle_usage_monitoring",
  "domains": [
    {
      "name": "Transport_and_Mobility",
      "url": "http://www.surf.scss.tcd.ie/cityOntology/#Transport_and_Mobility"
    }
  ],
  "id": "14/vehicle_usage_monitoring",
  "state": true,
  "url": "http://surf.scss.tcd.ie/_provider_/vehicle_usage_monitoring"
}