{
  "outputs": [
    {
      "name": "_diagnosticprocess",
      "type": "string",
      "desc": "Output of service MedicalClinic DiagnosticProcess Service"
    }
  ],
  "provider": {
    "type": "wsdn"
  },
  "inputs": [
    {
      "name": "_medicalclinic",
      "type": "string",
      "desc": "Input of service MedicalClinic DiagnosticProcess Service"
    }
  ],
  "name": "MedicalClinic DiagnosticProcess Service",
  "description": "This service returns certain type diagnostic process available in the certain medical clinic.",
  "domains": [
    {
      "name": "Food_and_Drinks",
      "url": "http://www.surf.scss.tcd.ie/cityOntology/#Food_and_Drinks"
    }
  ],
  "id": "health/medicalclinic_diagnosticprocess_service",
  "state": true,
  "url": "http://surf.scss.tcd.ie/_provider_/health/medicalclinic_diagnosticprocess_service"
}