{
  "outputs": [
    {
      "name": "historicContent",
      "type": "xml"
    }
  ],
  "qos": [],
  "inputs": [
    {
      "name": "touristicPath",
      "type": "json"
    },
    {
      "name": "suggestedActivities",
      "type": "json"
    },
    {
      "name": "relatedContent",
      "type": "xml"
    }
  ],
  "domains": [
    {
      "name": "Activity",
      "url": "http://www.surf.scss.tcd.ie/cityOntology/#Activity"
    },
    {
      "name": "Touristic_Place",
      "url": "http://www.surf.scss.tcd.ie/cityOntology/#Touristic_Place"
    },
    {
      "name": "History",
      "url": "http://www.surf.scss.tcd.ie/cityOntology/#History"
    }
  ],
  "location": {}
}