{
  "outputs": [
    {
      "name": "_recommendedprice",
      "type": "string",
      "desc": "Output of service Cheap Car Recommended Price service"
    }
  ],
  "provider": {
    "type": "webservice"
  },
  "inputs": [
    {
      "name": "_cheapcar",
      "type": "string",
      "desc": "Input of service Cheap Car Recommended Price service"
    },
    {
      "name": "_amount-of-money",
      "type": "string",
      "desc": "Input of service Cheap Car Recommended Price service"
    }
  ],
  "name": "Cheap Car Recommended Price service",
  "description": "This service tries to find the recommended price of a cheap car within given amount of money.",
  "domains": [
    {
      "name": "Foundations_and_Charity",
      "url": "http://www.surf.scss.tcd.ie/cityOntology/#Foundations_and_Charity"
    }
  ],
  "id": "retail/amount-of-moneycheapcar_recommendedprice_service",
  "state": true,
  "url": "http://surf.scss.tcd.ie/_provider_/retail/amount-of-moneycheapcar_recommendedprice_service"
}