{
  "outputs": [
    {
      "name": "stadiumMap",
      "type": "interactive"
    }
  ],
  "qos": [],
  "inputs": [
    {
      "name": "from",
      "type": "long"
    },
    {
      "name": "to",
      "type": "long"
    }
  ],
  "domains": [
    {
      "name": "Transport_and_Mobility",
      "url": "http://www.surf.scss.tcd.ie/cityOntology/#Transport_and_Mobility"
    },
    {
      "name": "Sport",
      "url": "http://www.surf.scss.tcd.ie/cityOntology/#Sport"
    },
    {
      "name": "Leisure",
      "url": "http://www.surf.scss.tcd.ie/cityOntology/#Leisure"
    }
  ],
  "location": {}
}