{
  "outputs": [
    {
      "name": "_year",
      "type": "string",
      "desc": "Output of service 4WheeledCar Year Price Service"
    },
    {
      "name": "_price",
      "type": "string",
      "desc": "Output of service 4WheeledCar Year Price Service"
    }
  ],
  "provider": "",
  "inputs": [
    {
      "name": "_4wheeledcar",
      "type": "string",
      "desc": "Input of service 4WheeledCar Year Price Service"
    }
  ],
  "latitude": 0.0,
  "name": "4WheeledCar Year Price Service",
  "description": "This service provides the and model year of a given 4wheeled car.",
  "domains": [
    {
      "name": "retail",
      "uri": "http://www.disit.org/km4city/schema#Retail"
    }
  ],
  "id": "retail/4wheeledcar_yearprice_service",
  "state": true,
  "type": "asp",
  "url": "http://surf.scss.tcd.ie/_provider_/retail/4wheeledcar_yearprice_service",
  "longitude": 0.0
}