{
  "outputs": [
    {
      "name": "courseStructure",
      "type": "json"
    }
  ],
  "provider": {
    "type": "ws"
  },
  "inputs": [
    {
      "name": "courseParameters",
      "type": "xml"
    }
  ],
  "name": "course_configuration",
  "description": "This is the service course_configuration",
  "domains": [
    {
      "name": "Educational",
      "url": "http://www.surf.scss.tcd.ie/cityOntology/#Educational"
    }
  ],
  "id": "46/course_configuration",
  "state": true,
  "url": "http://surf.scss.tcd.ie/_provider_/course_configuration"
}