{
  "plans": [
    {
      "outputs": [
        {
          "name": "gunshotAlert",
          "type": "alert"
        }
      ],
      "inputs": [
        {
          "name": "streetSurveillanceParameters",
          "type": "json"
        }
      ],
      "domains": [
        {
          "name": "Safety_and_Emergencies",
          "url": "http://www.surf.scss.tcd.ie/cityOntology/#Safety_and_Emergencies"
        }
      ],
      "state": 1,
      "steps": [
        {
          "outputs": [
            {
              "name": "gunshotAlert",
              "type": "alert"
            }
          ],
          "inputs": [
            {
              "name": "streetSurveillanceParameters",
              "type": "json"
            }
          ],
          "type": "SequentialStep",
          "steps": [
            {
              "outputs": [
                {
                  "name": "gunshotAlert",
                  "type": "alert"
                }
              ],
              "inputs": [
                {
                  "name": "cityZoneToMonitor",
                  "type": "json"
                }
              ],
              "serviceDescription": {
                "outputs": [
                  {
                    "name": "gunshotAlert",
                    "type": "alert"
                  }
                ],
                "provider": {
                  "type": "wsdn"
                },
                "inputs": [
                  {
                    "name": "cityZoneToMonitor",
                    "type": "json"
                  }
                ],
                "name": "gunshot_detection",
                "description": "This is the service gunshot_detection",
                "domains": [
                  {
                    "name": "Safety_and_Emergencies",
                    "url": "http://www.surf.scss.tcd.ie/cityOntology/#Safety_and_Emergencies"
                  }
                ],
                "id": "22/gunshot_detection",
                "state": true,
                "url": "http://surf.scss.tcd.ie/_provider_/gunshot_detection"
              },
              "type": "SimpleStep",
              "order": 0
            },
            {
              "outputs": [
                {
                  "name": "cityZoneToMonitor",
                  "type": "json"
                }
              ],
              "inputs": [
                {
                  "name": "streetSurveillanceParameters",
                  "type": "json"
                }
              ],
              "serviceDescription": {
                "outputs": [
                  {
                    "name": "cityZoneToMonitor",
                    "type": "json"
                  }
                ],
                "provider": {
                  "type": "ws"
                },
                "inputs": [
                  {
                    "name": "streetSurveillanceParameters",
                    "type": "json"
                  }
                ],
                "name": "street_surveillance_configurator",
                "description": "This is the service street_surveillance_configurator",
                "domains": [
                  {
                    "name": "Safety_and_Emergencies",
                    "url": "http://www.surf.scss.tcd.ie/cityOntology/#Safety_and_Emergencies"
                  }
                ],
                "id": "21/street_surveillance_configurator",
                "state": true,
                "url": "http://surf.scss.tcd.ie/_provider_/street_surveillance_configurator"
              },
              "type": "SimpleStep",
              "order": 1
            }
          ],
          "order": 0
        }
      ]
    }
  ]
}