{
  "plans": [
    {
      "outputs": [
        {
          "name": "bookAccommodation",
          "type": "xml"
        }
      ],
      "inputs": [
        {
          "name": "accommodationParameters",
          "type": "xml"
        }
      ],
      "domains": [
        {
          "name": "Accommodation",
          "url": "http://www.surf.scss.tcd.ie/cityOntology/#Accommodation"
        }
      ],
      "state": 1,
      "steps": [
        {
          "outputs": [
            {
              "name": "bookAccommodation",
              "type": "xml"
            }
          ],
          "inputs": [
            {
              "name": "accommodationParameters",
              "type": "xml"
            }
          ],
          "type": "SequentialStep",
          "steps": [
            {
              "outputs": [
                {
                  "name": "bookAccommodation",
                  "type": "xml"
                }
              ],
              "inputs": [
                {
                  "name": "accommodationConfirmation",
                  "type": "json"
                }
              ],
              "serviceDescription": {
                "outputs": [
                  {
                    "name": "bookAccommodation",
                    "type": "xml"
                  }
                ],
                "provider": {
                  "type": "asp"
                },
                "inputs": [
                  {
                    "name": "accommodationConfirmation",
                    "type": "json"
                  }
                ],
                "name": "book_accommodation",
                "description": "This is the service book_accommodation",
                "domains": [
                  {
                    "name": "Accommodation",
                    "url": "http://www.surf.scss.tcd.ie/cityOntology/#Accommodation"
                  }
                ],
                "id": "86/book_accommodation",
                "state": true,
                "url": "http://surf.scss.tcd.ie/_provider_/book_accommodation"
              },
              "type": "SimpleStep",
              "order": 0
            },
            {
              "outputs": [
                {
                  "name": "accommodationConfirmation",
                  "type": "json"
                }
              ],
              "inputs": [
                {
                  "name": "roomVideo",
                  "type": "stream"
                }
              ],
              "serviceDescription": {
                "outputs": [
                  {
                    "name": "accommodationConfirmation",
                    "type": "json"
                  }
                ],
                "provider": {
                  "type": "asp"
                },
                "inputs": [
                  {
                    "name": "roomVideo",
                    "type": "stream"
                  }
                ],
                "name": "accommodation_confirmation",
                "description": "This is the service accommodation_confirmation",
                "domains": [
                  {
                    "name": "Accommodation",
                    "url": "http://www.surf.scss.tcd.ie/cityOntology/#Accommodation"
                  }
                ],
                "id": "85/accommodation_confirmation",
                "state": true,
                "url": "http://surf.scss.tcd.ie/_provider_/accommodation_confirmation"
              },
              "type": "SimpleStep",
              "order": 1
            },
            {
              "outputs": [
                {
                  "name": "roomVideo",
                  "type": "stream"
                }
              ],
              "inputs": [
                {
                  "name": "selectedAccommodation",
                  "type": "json"
                }
              ],
              "serviceDescription": {
                "outputs": [
                  {
                    "name": "roomVideo",
                    "type": "stream"
                  }
                ],
                "provider": {
                  "type": "asp"
                },
                "inputs": [
                  {
                    "name": "selectedAccommodation",
                    "type": "json"
                  }
                ],
                "name": "activate_room_camera",
                "description": "This is the service activate_room_camera",
                "domains": [
                  {
                    "name": "Accommodation",
                    "url": "http://www.surf.scss.tcd.ie/cityOntology/#Accommodation"
                  }
                ],
                "id": "84/activate_room_camera",
                "state": true,
                "url": "http://surf.scss.tcd.ie/_provider_/activate_room_camera"
              },
              "type": "SimpleStep",
              "order": 2
            },
            {
              "outputs": [
                {
                  "name": "selectedAccommodation",
                  "type": "json"
                }
              ],
              "inputs": [
                {
                  "name": "accommodationList",
                  "type": "xml"
                }
              ],
              "serviceDescription": {
                "outputs": [
                  {
                    "name": "selectedAccommodation",
                    "type": "json"
                  }
                ],
                "provider": {
                  "type": "asp"
                },
                "inputs": [
                  {
                    "name": "accommodationList",
                    "type": "xml"
                  }
                ],
                "name": "accommodation_selection",
                "description": "This is the service accommodation_selection",
                "domains": [
                  {
                    "name": "Accommodation",
                    "url": "http://www.surf.scss.tcd.ie/cityOntology/#Accommodation"
                  }
                ],
                "id": "83/accommodation_selection",
                "state": true,
                "url": "http://surf.scss.tcd.ie/_provider_/accommodation_selection"
              },
              "type": "SimpleStep",
              "order": 3
            },
            {
              "outputs": [
                {
                  "name": "accommodationList",
                  "type": "xml"
                }
              ],
              "inputs": [
                {
                  "name": "accommodationParameters",
                  "type": "xml"
                }
              ],
              "serviceDescription": {
                "outputs": [
                  {
                    "name": "accommodationList",
                    "type": "xml"
                  }
                ],
                "provider": {
                  "type": "ws"
                },
                "inputs": [
                  {
                    "name": "accommodationParameters",
                    "type": "xml"
                  }
                ],
                "name": "search_accommodation",
                "description": "This is the service search_accommodation",
                "domains": [
                  {
                    "name": "Accommodation",
                    "url": "http://www.surf.scss.tcd.ie/cityOntology/#Accommodation"
                  }
                ],
                "id": "82/search_accommodation",
                "state": true,
                "url": "http://surf.scss.tcd.ie/_provider_/search_accommodation"
              },
              "type": "SimpleStep",
              "order": 4
            }
          ],
          "order": 0
        }
      ]
    }
  ]
}