{
  "plans": [
    {
      "outputs": [
        {
          "name": "alertNotification",
          "type": "alert"
        }
      ],
      "inputs": [
        {
          "name": "homeInformation",
          "type": "json"
        },
        {
          "name": "homeInformation",
          "type": "json"
        }
      ],
      "domains": [
        {
          "name": "Safety_and_Emergencies",
          "url": "http://www.surf.scss.tcd.ie/cityOntology/#Safety_and_Emergencies"
        },
        {
          "name": "Safety_and_Emergencies",
          "url": "http://www.surf.scss.tcd.ie/cityOntology/#Safety_and_Emergencies"
        }
      ],
      "state": 1,
      "steps": [
        {
          "outputs": [
            {
              "name": "alertNotification",
              "type": "alert"
            }
          ],
          "inputs": [
            {
              "name": "homeIntrusionAlert",
              "type": "alert"
            },
            {
              "name": "homeVideo",
              "type": "streaming"
            }
          ],
          "type": "SequentialStep",
          "steps": [
            {
              "outputs": [
                {
                  "name": "alertNotification",
                  "type": "alert"
                }
              ],
              "inputs": [
                {
                  "name": "homeIntrusionAlert",
                  "type": "alert"
                },
                {
                  "name": "homeVideo",
                  "type": "streaming"
                }
              ],
              "serviceDescription": {
                "outputs": [
                  {
                    "name": "alertNotification",
                    "type": "alert"
                  }
                ],
                "provider": {
                  "type": "ws"
                },
                "inputs": [
                  {
                    "name": "homeIntrusionAlert",
                    "type": "alert"
                  },
                  {
                    "name": "homeVideo",
                    "type": "streaming"
                  }
                ],
                "name": "home_anomaly_detection",
                "description": "This is the service home_anomaly_detection",
                "domains": [
                  {
                    "name": "Safety_and_Emergencies",
                    "url": "http://www.surf.scss.tcd.ie/cityOntology/#Safety_and_Emergencies"
                  }
                ],
                "id": "32/home_anomaly_detection",
                "state": true,
                "url": "http://surf.scss.tcd.ie/_provider_/home_anomaly_detection"
              },
              "type": "SimpleStep",
              "order": 0
            }
          ],
          "order": 0
        },
        {
          "outputs": [
            {
              "name": "homeIntrusionAlert",
              "type": "alert"
            }
          ],
          "inputs": [
            {
              "name": "homeInformation",
              "type": "json"
            },
            {
              "name": "homeInformation",
              "type": "json"
            }
          ],
          "type": "ParallelStep",
          "steps": [
            {
              "outputs": [
                {
                  "name": "homeIntrusionAlert",
                  "type": "alert"
                }
              ],
              "inputs": [
                {
                  "name": "homeInformation",
                  "type": "json"
                }
              ],
              "type": "SequentialStep",
              "steps": [
                {
                  "outputs": [
                    {
                      "name": "homeIntrusionAlert",
                      "type": "alert"
                    }
                  ],
                  "inputs": [
                    {
                      "name": "homeInformation",
                      "type": "json"
                    }
                  ],
                  "serviceDescription": {
                    "outputs": [
                      {
                        "name": "homeIntrusionAlert",
                        "type": "alert"
                      }
                    ],
                    "provider": {
                      "type": "wsdn"
                    },
                    "inputs": [
                      {
                        "name": "homeInformation",
                        "type": "json"
                      }
                    ],
                    "name": "home_intruder_detection",
                    "description": "This is the service home_intruder_detection",
                    "domains": [
                      {
                        "name": "Safety_and_Emergencies",
                        "url": "http://www.surf.scss.tcd.ie/cityOntology/#Safety_and_Emergencies"
                      }
                    ],
                    "id": "30/home_intruder_detection",
                    "state": true,
                    "url": "http://surf.scss.tcd.ie/_provider_/home_intruder_detection"
                  },
                  "type": "SimpleStep",
                  "order": 0
                }
              ],
              "order": 0
            },
            {
              "outputs": [
                {
                  "name": "homeVideo",
                  "type": "streaming"
                }
              ],
              "inputs": [
                {
                  "name": "homeInformation",
                  "type": "json"
                }
              ],
              "type": "SequentialStep",
              "steps": [
                {
                  "outputs": [
                    {
                      "name": "homeVideo",
                      "type": "streaming"
                    }
                  ],
                  "inputs": [
                    {
                      "name": "homeInformation",
                      "type": "json"
                    }
                  ],
                  "serviceDescription": {
                    "outputs": [
                      {
                        "name": "homeVideo",
                        "type": "streaming"
                      }
                    ],
                    "provider": {
                      "type": "wsdn"
                    },
                    "inputs": [
                      {
                        "name": "homeInformation",
                        "type": "json"
                      }
                    ],
                    "name": "home_video_camera",
                    "description": "This is the service home_video_camera",
                    "domains": [
                      {
                        "name": "Safety_and_Emergencies",
                        "url": "http://www.surf.scss.tcd.ie/cityOntology/#Safety_and_Emergencies"
                      }
                    ],
                    "id": "31/home_video_camera",
                    "state": true,
                    "url": "http://surf.scss.tcd.ie/_provider_/home_video_camera"
                  },
                  "type": "SimpleStep",
                  "order": 0
                }
              ],
              "order": 0
            }
          ],
          "order": 1
        }
      ]
    }
  ]
}