{
  "plans": [
    {
      "outputs": [
        {
          "name": "callTaxi",
          "type": "call"
        }
      ],
      "inputs": [
        {
          "name": "routeParameters",
          "type": "json"
        },
        {
          "name": "routeParameters",
          "type": "json"
        }
      ],
      "domains": [
        {
          "name": "Transport_and_Mobility",
          "url": "http://www.surf.scss.tcd.ie/cityOntology/#Transport_and_Mobility"
        },
        {
          "name": "Transport_and_Mobility",
          "url": "http://www.surf.scss.tcd.ie/cityOntology/#Transport_and_Mobility"
        }
      ],
      "state": 1,
      "steps": [
        {
          "outputs": [
            {
              "name": "callTaxi",
              "type": "call"
            }
          ],
          "inputs": [
            {
              "name": "taxiLocation",
              "type": "json"
            },
            {
              "name": "taxiAvailability",
              "type": "json"
            }
          ],
          "type": "SequentialStep",
          "steps": [
            {
              "outputs": [
                {
                  "name": "callTaxi",
                  "type": "call"
                }
              ],
              "inputs": [
                {
                  "name": "taxiLocation",
                  "type": "json"
                },
                {
                  "name": "taxiAvailability",
                  "type": "json"
                }
              ],
              "serviceDescription": {
                "outputs": [
                  {
                    "name": "callTaxi",
                    "type": "call"
                  }
                ],
                "provider": {
                  "type": "asp"
                },
                "inputs": [
                  {
                    "name": "taxiLocation",
                    "type": "json"
                  },
                  {
                    "name": "taxiAvailability",
                    "type": "json"
                  }
                ],
                "name": "call_taxi",
                "description": "This is the service call_taxi",
                "domains": [
                  {
                    "name": "Transport_and_Mobility",
                    "url": "http://www.surf.scss.tcd.ie/cityOntology/#Transport_and_Mobility"
                  }
                ],
                "id": "12/call_taxi",
                "state": true,
                "url": "http://surf.scss.tcd.ie/_provider_/call_taxi"
              },
              "type": "SimpleStep",
              "order": 0
            }
          ],
          "order": 0
        },
        {
          "outputs": [
            {
              "name": "taxiLocation",
              "type": "json"
            }
          ],
          "inputs": [
            {
              "name": "routeParameters",
              "type": "json"
            },
            {
              "name": "routeParameters",
              "type": "json"
            }
          ],
          "type": "ParallelStep",
          "steps": [
            {
              "outputs": [
                {
                  "name": "taxiLocation",
                  "type": "json"
                }
              ],
              "inputs": [
                {
                  "name": "routeParameters",
                  "type": "json"
                }
              ],
              "type": "SequentialStep",
              "steps": [
                {
                  "outputs": [
                    {
                      "name": "taxiLocation",
                      "type": "json"
                    }
                  ],
                  "inputs": [
                    {
                      "name": "routeParameters",
                      "type": "json"
                    }
                  ],
                  "serviceDescription": {
                    "outputs": [
                      {
                        "name": "taxiLocation",
                        "type": "json"
                      }
                    ],
                    "provider": {
                      "type": "wsdn"
                    },
                    "inputs": [
                      {
                        "name": "routeParameters",
                        "type": "json"
                      }
                    ],
                    "name": "taxi_location",
                    "description": "This is the service taxi_location",
                    "domains": [
                      {
                        "name": "Transport_and_Mobility",
                        "url": "http://www.surf.scss.tcd.ie/cityOntology/#Transport_and_Mobility"
                      }
                    ],
                    "id": "10/taxi_location",
                    "state": true,
                    "url": "http://surf.scss.tcd.ie/_provider_/taxi_location"
                  },
                  "type": "SimpleStep",
                  "order": 0
                }
              ],
              "order": 0
            },
            {
              "outputs": [
                {
                  "name": "taxiAvailability",
                  "type": "json"
                }
              ],
              "inputs": [
                {
                  "name": "routeParameters",
                  "type": "json"
                }
              ],
              "type": "SequentialStep",
              "steps": [
                {
                  "outputs": [
                    {
                      "name": "taxiAvailability",
                      "type": "json"
                    }
                  ],
                  "inputs": [
                    {
                      "name": "routeParameters",
                      "type": "json"
                    }
                  ],
                  "serviceDescription": {
                    "outputs": [
                      {
                        "name": "taxiAvailability",
                        "type": "json"
                      }
                    ],
                    "provider": {
                      "type": "asp"
                    },
                    "inputs": [
                      {
                        "name": "routeParameters",
                        "type": "json"
                      }
                    ],
                    "name": "taxi_availability",
                    "description": "This is the service taxi_availability",
                    "domains": [
                      {
                        "name": "Transport_and_Mobility",
                        "url": "http://www.surf.scss.tcd.ie/cityOntology/#Transport_and_Mobility"
                      }
                    ],
                    "id": "11/taxi_availability",
                    "state": true,
                    "url": "http://surf.scss.tcd.ie/_provider_/taxi_availability"
                  },
                  "type": "SimpleStep",
                  "order": 0
                }
              ],
              "order": 0
            }
          ],
          "order": 1
        }
      ]
    }
  ]
}