{
  "outputs": [
    {
      "name": "accommodationConfirmation",
      "type": "json"
    }
  ],
  "provider": {
    "type": "asp"
  },
  "inputs": [
    {
      "name": "roomVideo",
      "type": "stream"
    }
  ],
  "name": "accommodation_confirmation",
  "description": "This is the service accommodation_confirmation",
  "domains": [
    {
      "name": "Accommodation",
      "url": "http://www.surf.scss.tcd.ie/cityOntology/#Accommodation"
    }
  ],
  "id": "85/accommodation_confirmation",
  "state": true,
  "url": "http://surf.scss.tcd.ie/_provider_/accommodation_confirmation"
}