{
  "outputs": [
    {
      "name": "_recommendedpriceindollar",
      "type": "string",
      "desc": "Output of service Tizon RecommendedPriceService"
    }
  ],
  "provider": {
    "type": "wsdn"
  },
  "inputs": [
    {
      "name": "_book",
      "type": "string",
      "desc": "Input of service Tizon RecommendedPriceService"
    }
  ],
  "name": "Tizon RecommendedPriceService",
  "description": "Tizon is a rival US company of the book providers.It provides a web service to return recommended price of a book.",
  "domains": [
    {
      "name": "Construction",
      "url": "http://www.surf.scss.tcd.ie/cityOntology/#Construction"
    }
  ],
  "id": "retail/book_recommendedpriceindollar_service",
  "state": true,
  "url": "http://surf.scss.tcd.ie/_provider_/retail/book_recommendedpriceindollar_service"
}