{
  "outputs": [
    {
      "name": "_professor-in-academia",
      "type": "string",
      "desc": "Output of service UniversityProfessorService"
    }
  ],
  "provider": {
    "type": "asp"
  },
  "inputs": [
    {
      "name": "_university",
      "type": "string",
      "desc": "Input of service UniversityProfessorService"
    }
  ],
  "name": "UniversityProfessorService",
  "description": "This service returns professor of a university.",
  "domains": [
    {
      "name": "Clothing",
      "url": "http://www.surf.scss.tcd.ie/cityOntology/#Clothing"
    }
  ],
  "id": "educational/university_professor-in-academia_service",
  "state": true,
  "url": "http://surf.scss.tcd.ie/_provider_/educational/university_professor-in-academia_service"
}