{
  "outputs": [
    {
      "name": "_investigating",
      "type": "string",
      "desc": "Output of service MedInvestigating service"
    }
  ],
  "provider": {
    "type": "webservice"
  },
  "inputs": [
    {
      "name": "_medicalclinic",
      "type": "string",
      "desc": "Input of service MedInvestigating service"
    }
  ],
  "name": "MedInvestigating service",
  "description": "MedInvestigating provides a service to return a type of medical investigatingin a certain medical clinic.",
  "domains": [
    {
      "name": "Construction",
      "url": "http://www.surf.scss.tcd.ie/cityOntology/#Construction"
    }
  ],
  "id": "health/medicalclinic_investigating_service",
  "state": true,
  "url": "http://surf.scss.tcd.ie/_provider_/health/medicalclinic_investigating_service"
}