{
  "outputs": [
    {
      "name": "_taxedprice",
      "type": "string",
      "desc": "Output of service CheapCar TaxedPrice Report service"
    },
    {
      "name": "_report",
      "type": "string",
      "desc": "Output of service CheapCar TaxedPrice Report service"
    }
  ],
  "provider": {
    "type": "asp"
  },
  "inputs": [
    {
      "name": "_cheapcar",
      "type": "string",
      "desc": "Input of service CheapCar TaxedPrice Report service"
    }
  ],
  "name": "CheapCar TaxedPrice Report service",
  "description": "This service returns not only taxed price of a cheapcar, but also a short report about its recommendation.",
  "domains": [
    {
      "name": "Accommodation",
      "url": "http://www.surf.scss.tcd.ie/cityOntology/#Accommodation"
    }
  ],
  "id": "retail/cheapcar_taxedpricereport_service",
  "state": true,
  "url": "http://surf.scss.tcd.ie/_provider_/retail/cheapcar_taxedpricereport_service"
}