{
  "outputs": [
    {
      "name": "_maxprice",
      "type": "string",
      "desc": "Output of service PreparedFood MaxPrice Service"
    }
  ],
  "provider": {
    "type": "asp"
  },
  "inputs": [
    {
      "name": "_preparedfood",
      "type": "string",
      "desc": "Input of service PreparedFood MaxPrice Service"
    }
  ],
  "name": "PreparedFood MaxPrice Service",
  "description": "This service returns max price of certain prepared food.",
  "domains": [
    {
      "name": "Activity",
      "url": "http://www.surf.scss.tcd.ie/cityOntology/#Activity"
    }
  ],
  "id": "retail/preparedfood_maxprice_service",
  "state": true,
  "url": "http://surf.scss.tcd.ie/_provider_/retail/preparedfood_maxprice_service"
}