{
  "outputs": [
    {
      "name": "_book",
      "type": "string",
      "desc": "Output of service author_bookrecommendedprice_service"
    },
    {
      "name": "_recommendedprice",
      "type": "string",
      "desc": "Output of service author_bookrecommendedprice_service"
    }
  ],
  "provider": {
    "type": "asp"
  },
  "inputs": [
    {
      "name": "_author",
      "type": "string",
      "desc": "Input of service author_bookrecommendedprice_service"
    }
  ],
  "name": "author_bookrecommendedprice_service",
  "description": "This service is about retail",
  "domains": [
    {
      "name": "Activity",
      "url": "http://www.surf.scss.tcd.ie/cityOntology/#Activity"
    }
  ],
  "id": "retail/author_bookrecommendedprice_service",
  "state": true,
  "url": "http://surf.scss.tcd.ie/_provider_/retail/author_bookrecommendedprice_service"
}