{
  "outputs": [
    {
      "name": "_weatherfront",
      "type": "string",
      "desc": "Output of service Geopolitica-Entity WeatherFront Service"
    }
  ],
  "provider": {
    "type": "asp"
  },
  "inputs": [
    {
      "name": "_geopolitical-entity",
      "type": "string",
      "desc": "Input of service Geopolitica-Entity WeatherFront Service"
    }
  ],
  "name": "Geopolitica-Entity WeatherFront Service",
  "description": "This service informs about weatherfronts of a given geopolitical entity.",
  "domains": [
    {
      "name": "Government_and_Planning",
      "url": "http://www.surf.scss.tcd.ie/cityOntology/#Government_and_Planning"
    }
  ],
  "id": "environmental/geopolitical-entity_weatherfront_service",
  "state": true,
  "url": "http://surf.scss.tcd.ie/_provider_/environmental/geopolitical-entity_weatherfront_service"
}