{
  "outputs": [
    {
      "name": "transportInfo",
      "type": "json"
    }
  ],
  "provider": {
    "type": "asp"
  },
  "inputs": [
    {
      "name": "eventTicketsInfo",
      "type": "json"
    }
  ],
  "name": "shcedule_transport",
  "description": "This is the service shcedule_transport",
  "domains": [
    {
      "name": "Transport_and_Mobility",
      "url": "http://www.surf.scss.tcd.ie/cityOntology/#Transport_and_Mobility"
    }
  ],
  "id": "120/shcedule_transport",
  "state": true,
  "url": "http://surf.scss.tcd.ie/_provider_/shcedule_transport"
}