{
  "outputs": [
    {
      "name": "carStatus",
      "type": "json"
    }
  ],
  "qos": [],
  "inputs": [
    {
      "name": "streetsVideo",
      "type": "video"
    },
    {
      "name": "streetsTemperature",
      "type": "json"
    },
    {
      "name": "streetsWaterLevel",
      "type": "json"
    }
  ],
  "domains": [
    {
      "name": "Government_and_Planning",
      "url": "http://www.surf.scss.tcd.ie/cityOntology/#Government_and_Planning"
    },
    {
      "name": "Transport_and_Mobility",
      "url": "http://www.surf.scss.tcd.ie/cityOntology/#Transport_and_Mobility"
    }
  ],
  "location": {}
}