{
  "outputs": [
    {
      "name": "eventVisualisation",
      "type": "interactive"
    }
  ],
  "qos": [],
  "inputs": [
    {
      "name": "homeInformation",
      "type": "json"
    }
  ],
  "domains": [
    {
      "name": "Safety_and_Emergencies",
      "url": "http://www.surf.scss.tcd.ie/cityOntology/#Safety_and_Emergencies"
    },
    {
      "name": "Sport",
      "url": "http://www.surf.scss.tcd.ie/cityOntology/#Sport"
    }
  ],
  "location": {}
}