{
  "outputs": [
    {
      "name": "_lightning",
      "type": "string",
      "desc": "Output of service Country Lightning Service"
    }
  ],
  "provider": {
    "type": "wsdn"
  },
  "inputs": [
    {
      "name": "_country",
      "type": "string",
      "desc": "Input of service Country Lightning Service"
    }
  ],
  "name": "Country Lightning Service",
  "description": "This service informs about lightnings of a given country.",
  "domains": [
    {
      "name": "House_Sale_and_Rent",
      "url": "http://www.surf.scss.tcd.ie/cityOntology/#House_Sale_and_Rent"
    }
  ],
  "id": "environmental/country_lightning_service",
  "state": true,
  "url": "http://surf.scss.tcd.ie/_provider_/environmental/country_lightning_service"
}