{
  "plans": [
    {
      "outputs": [
        {
          "name": "alertNotification",
          "type": "alert"
        }
      ],
      "inputs": [
        {
          "name": "homeIntrusionAlert",
          "type": "alert"
        },
        {
          "name": "homeVideo",
          "type": "streaming"
        }
      ],
      "domains": [
        {
          "name": "Safety_and_Emergencies",
          "url": "http://www.surf.scss.tcd.ie/cityOntology/#Safety_and_Emergencies"
        }
      ],
      "state": 1,
      "steps": [
        {
          "outputs": [
            {
              "name": "alertNotification",
              "type": "alert"
            }
          ],
          "inputs": [
            {
              "name": "homeIntrusionAlert",
              "type": "alert"
            },
            {
              "name": "homeVideo",
              "type": "streaming"
            }
          ],
          "serviceDescription": {
            "outputs": [
              {
                "name": "alertNotification",
                "type": "alert"
              }
            ],
            "provider": {
              "type": "ws"
            },
            "inputs": [
              {
                "name": "homeIntrusionAlert",
                "type": "alert"
              },
              {
                "name": "homeVideo",
                "type": "streaming"
              }
            ],
            "name": "home_anomaly_detection",
            "description": "This is the service home_anomaly_detection",
            "domains": [
              {
                "name": "Safety_and_Emergencies",
                "url": "http://www.surf.scss.tcd.ie/cityOntology/#Safety_and_Emergencies"
              }
            ],
            "id": "32/home_anomaly_detection",
            "state": true,
            "url": "http://surf.scss.tcd.ie/_provider_/home_anomaly_detection"
          },
          "type": "SimpleStep",
          "order": 0
        }
      ]
    }
  ]
}