{
  "outputs": [
    {
      "name": "_destination",
      "type": "string",
      "desc": "Output of service HikingDestinationService"
    }
  ],
  "provider": {
    "type": "asp"
  },
  "inputs": [
    {
      "name": "_hiking",
      "type": "string",
      "desc": "Input of service HikingDestinationService"
    }
  ],
  "name": "HikingDestinationService",
  "description": "This service returns the best destination for hiking.",
  "domains": [
    {
      "name": "Waste",
      "url": "http://www.surf.scss.tcd.ie/cityOntology/#Waste"
    }
  ],
  "id": "tourism/hiking_destination_service",
  "state": true,
  "url": "http://surf.scss.tcd.ie/_provider_/tourism/hiking_destination_service"
}