{
  "outputs": [
    {
      "name": "packageMonitoringDisplay",
      "type": "interactive"
    }
  ],
  "qos": [],
  "inputs": [
    {
      "name": "alertNotification",
      "type": "alert"
    }
  ],
  "domains": [
    {
      "name": "Safety_and_Emergencies",
      "url": "http://www.surf.scss.tcd.ie/cityOntology/#Safety_and_Emergencies"
    },
    {
      "name": "Logistic",
      "url": "http://www.surf.scss.tcd.ie/cityOntology/#Logistic"
    },
    {
      "name": "Communications",
      "url": "http://www.surf.scss.tcd.ie/cityOntology/#Communications"
    }
  ],
  "location": {}
}