{
  "outputs": [
    {
      "name": "touristicPlan",
      "type": "interactive"
    }
  ],
  "qos": [],
  "inputs": [
    {
      "name": "gridId",
      "type": "long"
    }
  ],
  "domains": [
    {
      "name": "Energy",
      "url": "http://www.surf.scss.tcd.ie/cityOntology/#Energy"
    },
    {
      "name": "Activity",
      "url": "http://www.surf.scss.tcd.ie/cityOntology/#Activity"
    }
  ],
  "location": {}
}