{
  "outputs": [
    {
      "name": "_hotel",
      "type": "string",
      "desc": "Output of service GeopoliticalHotelService"
    }
  ],
  "provider": {
    "type": "wsdn"
  },
  "inputs": [
    {
      "name": "_geopolitical-entity",
      "type": "string",
      "desc": "Input of service GeopoliticalHotelService"
    }
  ],
  "name": "GeopoliticalHotelService",
  "description": "This service is the best service to know about the hotel in a geographical entity.",
  "domains": [
    {
      "name": "Professional_Services",
      "url": "http://www.surf.scss.tcd.ie/cityOntology/#Professional_Services"
    }
  ],
  "id": "tourism/geopolitical-entity_hotel_service",
  "state": true,
  "url": "http://surf.scss.tcd.ie/_provider_/tourism/geopolitical-entity_hotel_service"
}