{
  "outputs": [
    {
      "name": "prisionNotification",
      "type": "alert"
    }
  ],
  "provider": {
    "type": "ws"
  },
  "inputs": [
    {
      "name": "prisionerInfo",
      "type": "json"
    },
    {
      "name": "prisionVideo",
      "type": "video"
    }
  ],
  "name": "prision_anomaly_detection",
  "description": "This is the service prision_anomaly_detection",
  "domains": [
    {
      "name": "Safety_and_Emergencies",
      "url": "http://www.surf.scss.tcd.ie/cityOntology/#Safety_and_Emergencies"
    }
  ],
  "id": "20/prision_anomaly_detection",
  "state": true,
  "url": "http://surf.scss.tcd.ie/_provider_/prision_anomaly_detection"
}