{
  "outputs": [
    {
      "name": "_diagnosticprocess",
      "type": "string",
      "desc": "Output of service ODGService"
    }
  ],
  "provider": {
    "type": "wsdn"
  },
  "inputs": [
    {
      "name": "_organization",
      "type": "string",
      "desc": "Input of service ODGService"
    }
  ],
  "name": "ODGService",
  "description": "ODG service informs for diagnosting system available in the given organization, such like hospital.",
  "domains": [
    {
      "name": "Social_Security",
      "url": "http://www.surf.scss.tcd.ie/cityOntology/#Social_Security"
    }
  ],
  "id": "health/organization_diagnosticprocess_service",
  "state": true,
  "url": "http://surf.scss.tcd.ie/_provider_/health/organization_diagnosticprocess_service"
}