{
  "outputs": [
    {
      "name": "inventoryReport",
      "type": "pdf"
    }
  ],
  "qos": [],
  "inputs": [
    {
      "name": "binId",
      "type": "long"
    }
  ],
  "domains": [
    {
      "name": "Waste",
      "url": "http://www.surf.scss.tcd.ie/cityOntology/#Waste"
    },
    {
      "name": "Clothing",
      "url": "http://www.surf.scss.tcd.ie/cityOntology/#Clothing"
    }
  ],
  "location": {}
}