{
  "outputs": [
    {
      "name": "_town",
      "type": "string",
      "desc": "Output of service Sightseeing Town Service"
    }
  ],
  "provider": {
    "type": "wsdn"
  },
  "inputs": [
    {
      "name": "_sightseeing",
      "type": "string",
      "desc": "Input of service Sightseeing Town Service"
    }
  ],
  "name": "Sightseeing Town Service",
  "description": "This service returns town for sightseeing.",
  "domains": [
    {
      "name": "Safety_and_Emergencies",
      "url": "http://www.surf.scss.tcd.ie/cityOntology/#Safety_and_Emergencies"
    }
  ],
  "id": "tourism/sightseeing_town_service",
  "state": true,
  "url": "http://surf.scss.tcd.ie/_provider_/tourism/sightseeing_town_service"
}