{
  "outputs": [
    {
      "name": "atmDashboard",
      "type": "interactive"
    }
  ],
  "provider": {
    "type": "ws"
  },
  "inputs": [
    {
      "name": "atmStatus",
      "type": "json"
    },
    {
      "name": "atmVideo",
      "type": "video"
    }
  ],
  "name": "atm_dashboard",
  "description": "This is the service atm_dashboard",
  "domains": [
    {
      "name": "Safety_and_Emergencies",
      "url": "http://www.surf.scss.tcd.ie/cityOntology/#Safety_and_Emergencies"
    },
    {
      "name": "Finance",
      "url": "http://www.surf.scss.tcd.ie/cityOntology/#Finance"
    }
  ],
  "id": "117/atm_dashboard",
  "state": true,
  "url": "http://surf.scss.tcd.ie/_provider_/atm_dashboard"
}