{
  "outputs": [
    {
      "name": "patientPresentation",
      "type": "interactive"
    }
  ],
  "qos": [],
  "inputs": [
    {
      "name": "productsStatus",
      "type": "json"
    }
  ],
  "domains": [
    {
      "name": "Clothing",
      "url": "http://www.surf.scss.tcd.ie/cityOntology/#Clothing"
    },
    {
      "name": "Health",
      "url": "http://www.surf.scss.tcd.ie/cityOntology/#Health"
    }
  ],
  "location": {}
}