{
  "outputs": [
    {
      "name": "_map",
      "type": "string",
      "desc": "Output of service City2CityRouteFinderService"
    }
  ],
  "provider": {
    "type": "wsdn"
  },
  "inputs": [
    {
      "name": "_city",
      "type": "string",
      "desc": "Input of service City2CityRouteFinderService"
    },
    {
      "name": "_city",
      "type": "string",
      "desc": "Input of service City2CityRouteFinderService"
    }
  ],
  "name": "City2CityRouteFinderService",
  "description": "This service has an artificial intelligence power and able to returnan optimal path between two cities.",
  "domains": [
    {
      "name": "Foundations_and_Charity",
      "url": "http://www.surf.scss.tcd.ie/cityOntology/#Foundations_and_Charity"
    }
  ],
  "id": "mobility/citycity_map_service",
  "state": true,
  "url": "http://surf.scss.tcd.ie/_provider_/mobility/citycity_map_service"
}