{
  "outputs": [
    {
      "name": "_book",
      "type": "string",
      "desc": "Output of service ABN/ISBN Booksearch"
    }
  ],
  "provider": "",
  "inputs": [
    {
      "name": "_publication-number",
      "type": "string",
      "desc": "Input of service ABN/ISBN Booksearch"
    }
  ],
  "latitude": 0.0,
  "name": "ABN/ISBN Booksearch",
  "description": "Searches for a book if either the academic book number or the ISBN is avaible",
  "domains": [
    {
      "name": "educational",
      "uri": "http://www.disit.org/km4city/schema#Educational"
    }
  ],
  "id": "educational/publication-number_book_service",
  "state": true,
  "type": "webservice",
  "url": "http://surf.scss.tcd.ie/_provider_/educational/publication-number_book_service",
  "longitude": 0.0
}