{
  "outputs": [
    {
      "name": "_price",
      "type": "string",
      "desc": "Output of service 3wheeledcar year price service"
    }
  ],
  "provider": "",
  "inputs": [
    {
      "name": "_3wheeledcar",
      "type": "string",
      "desc": "Input of service 3wheeledcar year price service"
    },
    {
      "name": "_year",
      "type": "string",
      "desc": "Input of service 3wheeledcar year price service"
    }
  ],
  "latitude": 0.0,
  "name": "3wheeledcar year price service",
  "description": "You can inquire a price of a three wheeled car given the model year.",
  "domains": [
    {
      "name": "retail",
      "uri": "http://www.disit.org/km4city/schema#Retail"
    }
  ],
  "id": "retail/3wheeledcaryear_price_service",
  "state": true,
  "type": "webservice",
  "url": "http://surf.scss.tcd.ie/_provider_/retail/3wheeledcaryear_price_service",
  "longitude": 0.0
}