{
  "outputs": [
    {
      "name": "searchInfo",
      "type": "json"
    }
  ],
  "qos": [],
  "inputs": [
    {
      "name": "homeIntrusionAlert",
      "type": "alert"
    },
    {
      "name": "homeVideo",
      "type": "streaming"
    }
  ],
  "domains": [
    {
      "name": "Safety_and_Emergencies",
      "url": "http://www.surf.scss.tcd.ie/cityOntology/#Safety_and_Emergencies"
    },
    {
      "name": "Educational",
      "url": "http://www.surf.scss.tcd.ie/cityOntology/#Educational"
    }
  ],
  "location": {}
}