{
  "outputs": [
    {
      "name": "gasDetection",
      "type": "json"
    }
  ],
  "provider": {
    "type": "wsdn"
  },
  "inputs": [
    {
      "name": "constructionStatus",
      "type": "json"
    }
  ],
  "name": "hazardous_gases_detection",
  "description": "This is the service hazardous_gases_detection",
  "domains": [
    {
      "name": "Safety_and_Emergencies",
      "url": "http://www.surf.scss.tcd.ie/cityOntology/#Safety_and_Emergencies"
    },
    {
      "name": "Construction",
      "url": "http://www.surf.scss.tcd.ie/cityOntology/#Construction"
    }
  ],
  "id": "43/hazardous_gases_detection",
  "state": true,
  "url": "http://surf.scss.tcd.ie/_provider_/hazardous_gases_detection"
}