{
  "outputs": [
    {
      "name": "_weatherprocess",
      "type": "string",
      "desc": "Output of service GRWeatherProcessService"
    }
  ],
  "provider": {
    "type": "wsdn"
  },
  "inputs": [
    {
      "name": "_geographical-region",
      "type": "string",
      "desc": "Input of service GRWeatherProcessService"
    }
  ],
  "name": "GRWeatherProcessService",
  "description": "This service returns the weather condition in a given region.",
  "domains": [
    {
      "name": "Sports_Equipment",
      "url": "http://www.surf.scss.tcd.ie/cityOntology/#Sports_Equipment"
    }
  ],
  "id": "environmental/geographical-region_weatherprocess_service",
  "state": true,
  "url": "http://surf.scss.tcd.ie/_provider_/environmental/geographical-region_weatherprocess_service"
}