{
  "outputs": [
    {
      "name": "streetsInfo",
      "type": "json"
    }
  ],
  "provider": {
    "type": "ws"
  },
  "inputs": [
    {
      "name": "monitoringConfiguration",
      "type": "json"
    }
  ],
  "name": "check_streets",
  "description": "This is the service check_streets",
  "domains": [
    {
      "name": "Safety_and_Emergencies",
      "url": "http://www.surf.scss.tcd.ie/cityOntology/#Safety_and_Emergencies"
    },
    {
      "name": "Transport_and_Mobility",
      "url": "http://www.surf.scss.tcd.ie/cityOntology/#Transport_and_Mobility"
    },
    {
      "name": "Government_and_Planning",
      "url": "http://www.surf.scss.tcd.ie/cityOntology/#Government_and_Planning"
    }
  ],
  "id": "124/check_streets",
  "state": true,
  "url": "http://surf.scss.tcd.ie/_provider_/check_streets"
}