{
  "outputs": [
    {
      "name": "_urbanarea",
      "type": "string",
      "desc": "Output of service Adventure UrbanArea Service"
    }
  ],
  "provider": {
    "type": "wsdn"
  },
  "inputs": [
    {
      "name": "_adventure",
      "type": "string",
      "desc": "Input of service Adventure UrbanArea Service"
    }
  ],
  "name": "Adventure UrbanArea Service",
  "description": "This service returns urbanarea for adventure.",
  "domains": [
    {
      "name": "Foundations_and_Charity",
      "url": "http://www.surf.scss.tcd.ie/cityOntology/#Foundations_and_Charity"
    }
  ],
  "id": "tourism/adventure_urbanarea_service",
  "state": true,
  "url": "http://surf.scss.tcd.ie/_provider_/tourism/adventure_urbanarea_service"
}