{
  "outputs": [
    {
      "name": "_icon",
      "type": "string",
      "desc": "Output of service LocationLocationIcon Service"
    }
  ],
  "provider": {
    "type": "wsdn"
  },
  "inputs": [
    {
      "name": "_location",
      "type": "string",
      "desc": "Input of service LocationLocationIcon Service"
    },
    {
      "name": "_location",
      "type": "string",
      "desc": "Input of service LocationLocationIcon Service"
    }
  ],
  "name": "LocationLocationIcon Service",
  "description": "This service returns an icon to indicate roadway signs between two locations",
  "domains": [
    {
      "name": "Construction",
      "url": "http://www.surf.scss.tcd.ie/cityOntology/#Construction"
    }
  ],
  "id": "mobility/locationlocation_icon_service",
  "state": true,
  "url": "http://surf.scss.tcd.ie/_provider_/mobility/locationlocation_icon_service"
}