{
  "outputs": [
    {
      "name": "noiseInfo",
      "type": "json"
    }
  ],
  "provider": {
    "type": "asp"
  },
  "inputs": [
    {
      "name": "routeParameters",
      "type": "json"
    }
  ],
  "name": "route_noise_service",
  "description": "This is the service route_noise_service",
  "domains": [
    {
      "name": "Transport_and_Mobility",
      "url": "http://www.surf.scss.tcd.ie/cityOntology/#Transport_and_Mobility"
    }
  ],
  "id": "5/route_noise_service",
  "state": true,
  "url": "http://surf.scss.tcd.ie/_provider_/route_noise_service"
}