{
  "outputs": [
    {
      "name": "_bedandbreakfast",
      "type": "string",
      "desc": "Output of service City BedAndBreakfast Service"
    }
  ],
  "provider": {
    "type": "wsdn"
  },
  "inputs": [
    {
      "name": "_city",
      "type": "string",
      "desc": "Input of service City BedAndBreakfast Service"
    }
  ],
  "name": "City BedAndBreakfast Service",
  "description": "This service returns information of a bed-and-breakfast of a given city.",
  "domains": [
    {
      "name": "Health",
      "url": "http://www.surf.scss.tcd.ie/cityOntology/#Health"
    }
  ],
  "id": "tourism/city_bedandbreakfast_service",
  "state": true,
  "url": "http://surf.scss.tcd.ie/_provider_/tourism/city_bedandbreakfast_service"
}