{
  "outputs": [
    {
      "name": "sendNotification",
      "type": "mail"
    }
  ],
  "provider": {
    "type": "ws"
  },
  "inputs": [
    {
      "name": "vehicleConfigured",
      "type": "json"
    }
  ],
  "name": "notify_emergency",
  "description": "This is the service notify_emergency",
  "domains": [
    {
      "name": "Health",
      "url": "http://www.surf.scss.tcd.ie/cityOntology/#Health"
    },
    {
      "name": "Safety_and_Emergencies",
      "url": "http://www.surf.scss.tcd.ie/cityOntology/#Safety_and_Emergencies"
    }
  ],
  "id": "96/notify_emergency",
  "state": true,
  "url": "http://surf.scss.tcd.ie/_provider_/notify_emergency"
}