{
  "outputs": [
    {
      "name": "streetsDashboard",
      "type": "interactive"
    }
  ],
  "qos": [],
  "inputs": [
    {
      "name": "homeInformation",
      "type": "json"
    }
  ],
  "domains": [
    {
      "name": "Safety_and_Emergencies",
      "url": "http://www.surf.scss.tcd.ie/cityOntology/#Safety_and_Emergencies"
    },
    {
      "name": "Government_and_Planning",
      "url": "http://www.surf.scss.tcd.ie/cityOntology/#Government_and_Planning"
    }
  ],
  "location": {}
}