{
  "outputs": [
    {
      "name": "_recommendedprice",
      "type": "string",
      "desc": "Output of service Threewheeled Car Recommended Price service"
    }
  ],
  "provider": "",
  "inputs": [
    {
      "name": "_3wheeledcar",
      "type": "string",
      "desc": "Input of service Threewheeled Car Recommended Price service"
    },
    {
      "name": "_amount-of-money",
      "type": "string",
      "desc": "Input of service Threewheeled Car Recommended Price service"
    }
  ],
  "latitude": 0.0,
  "name": "Threewheeled Car Recommended Price service",
  "description": "This service tries to find the recommended price of a three wheeled car within given amount of money.",
  "domains": [
    {
      "name": "retail",
      "uri": "http://www.disit.org/km4city/schema#Retail"
    }
  ],
  "id": "retail/amount-of-money3wheeledcar_recommendedprice_service",
  "state": true,
  "type": "asp",
  "url": "http://surf.scss.tcd.ie/_provider_/retail/amount-of-money3wheeledcar_recommendedprice_service",
  "longitude": 0.0
}