{
  "outputs": [
    {
      "name": "parentNotification",
      "type": "mail"
    }
  ],
  "qos": [],
  "inputs": [
    {
      "name": "courseContent",
      "type": "rar"
    }
  ],
  "domains": [
    {
      "name": "Educational",
      "url": "http://www.surf.scss.tcd.ie/cityOntology/#Educational"
    }
  ],
  "location": {}
}