{
  "outputs": [
    {
      "name": "studentContent",
      "type": "json"
    }
  ],
  "qos": [],
  "inputs": [
    {
      "name": "fridgeData",
      "type": "xml"
    }
  ],
  "domains": [
    {
      "name": "Food_and_Drinks",
      "url": "http://www.surf.scss.tcd.ie/cityOntology/#Food_and_Drinks"
    },
    {
      "name": "Educational",
      "url": "http://www.surf.scss.tcd.ie/cityOntology/#Educational"
    }
  ],
  "location": {}
}