{
  "outputs": [
    {
      "name": "ligthStatus",
      "type": "int"
    }
  ],
  "provider": {
    "type": "wsdn"
  },
  "inputs": [
    {
      "name": "publicArea",
      "type": "json"
    },
    {
      "name": "ligthIntensity",
      "type": "int"
    }
  ],
  "name": "public_lighting",
  "description": "This is the service public_lighting",
  "domains": [
    {
      "name": "Transport_and_Mobility",
      "url": "http://www.surf.scss.tcd.ie/cityOntology/#Transport_and_Mobility"
    }
  ],
  "id": "105/public_lighting",
  "state": true,
  "url": "http://surf.scss.tcd.ie/_provider_/public_lighting"
}