{
  "outputs": [
    {
      "name": "_price",
      "type": "string",
      "desc": "Output of service Car Price service"
    }
  ],
  "provider": {
    "type": "wsdn"
  },
  "inputs": [
    {
      "name": "_4wheeledcar",
      "type": "string",
      "desc": "Input of service Car Price service"
    },
    {
      "name": "_amount-of-money",
      "type": "string",
      "desc": "Input of service Car Price service"
    }
  ],
  "name": "Car Price service",
  "description": "This service tries to find price of a four wheeled car within given amount of money.",
  "domains": [
    {
      "name": "Research_and_Science",
      "url": "http://www.surf.scss.tcd.ie/cityOntology/#Research_and_Science"
    }
  ],
  "id": "retail/amount-of-money4wheeledcar_price_service",
  "state": true,
  "url": "http://surf.scss.tcd.ie/_provider_/retail/amount-of-money4wheeledcar_price_service"
}