{
  "outputs": [
    {
      "name": "_nationalpark",
      "type": "string",
      "desc": "Output of service SportsNationalParkService"
    }
  ],
  "provider": "",
  "inputs": [
    {
      "name": "_sports",
      "type": "string",
      "desc": "Input of service SportsNationalParkService"
    }
  ],
  "latitude": 0.0,
  "name": "SportsNationalParkService",
  "description": "This is a recommended service to know aboutthe national park for the sports.",
  "domains": [],
  "id": "tourism/sports_nationalpark_service",
  "state": true,
  "type": "wsdn",
  "url": "http://surf.scss.tcd.ie/_provider_/tourism/sports_nationalpark_service",
  "longitude": 0.0
}