{
  "outputs": [
    {
      "name": "placeVideo",
      "type": "streaming"
    }
  ],
  "qos": [],
  "inputs": [
    {
      "name": "startAlarm",
      "type": "alarm"
    }
  ],
  "domains": [
    {
      "name": "Safety_and_Emergencies",
      "url": "http://www.surf.scss.tcd.ie/cityOntology/#Safety_and_Emergencies"
    }
  ],
  "location": {}
}