{
  "outputs": [
    {
      "name": "_postal-address",
      "type": "string",
      "desc": "Output of service HospitalInvestService"
    },
    {
      "name": "_investigating",
      "type": "string",
      "desc": "Output of service HospitalInvestService"
    }
  ],
  "provider": "",
  "inputs": [
    {
      "name": "_hospital",
      "type": "string",
      "desc": "Input of service HospitalInvestService"
    }
  ],
  "latitude": 0.0,
  "name": "HospitalInvestService",
  "description": "This service returns investigating facility in the given hospital and its postal address.",
  "domains": [
    {
      "name": "health",
      "uri": "http://www.disit.org/km4city/schema#Health"
    }
  ],
  "id": "health/hospital_postal-addressinvestigating_service",
  "state": true,
  "type": "webservice",
  "url": "http://surf.scss.tcd.ie/_provider_/health/hospital_postal-addressinvestigating_service",
  "longitude": 0.0
}