{
  "plans": [
    {
      "outputs": [
        {
          "name": "zoneIntrusionAlert",
          "type": "alert"
        }
      ],
      "inputs": [
        {
          "name": "cityZoneToMonitor",
          "type": "json"
        }
      ],
      "domains": [
        {
          "name": "Safety_and_Emergencies",
          "url": "http://www.surf.scss.tcd.ie/cityOntology/#Safety_and_Emergencies"
        }
      ],
      "state": 1,
      "steps": [
        {
          "outputs": [
            {
              "name": "zoneIntrusionAlert",
              "type": "alert"
            }
          ],
          "inputs": [
            {
              "name": "cityZoneToMonitor",
              "type": "json"
            }
          ],
          "serviceDescription": {
            "outputs": [
              {
                "name": "zoneIntrusionAlert",
                "type": "alert"
              }
            ],
            "provider": {
              "type": "wsdn"
            },
            "inputs": [
              {
                "name": "cityZoneToMonitor",
                "type": "json"
              }
            ],
            "name": "zone_intruder_detection",
            "description": "This is the service zone_intruder_detection",
            "domains": [
              {
                "name": "Safety_and_Emergencies",
                "url": "http://www.surf.scss.tcd.ie/cityOntology/#Safety_and_Emergencies"
              }
            ],
            "id": "23/zone_intruder_detection",
            "state": true,
            "url": "http://surf.scss.tcd.ie/_provider_/zone_intruder_detection"
          },
          "type": "SimpleStep",
          "order": 0
        }
      ]
    }
  ]
}