{
  "outputs": [
    {
      "name": "activateTracking",
      "type": "json"
    }
  ],
  "provider": {
    "type": "ws"
  },
  "inputs": [
    {
      "name": "packageInfo",
      "type": "xml"
    }
  ],
  "name": "package_configuration",
  "description": "This is the service package_configuration",
  "domains": [
    {
      "name": "Logistic",
      "url": "http://www.surf.scss.tcd.ie/cityOntology/#Logistic"
    },
    {
      "name": "Communications",
      "url": "http://www.surf.scss.tcd.ie/cityOntology/#Communications"
    }
  ],
  "id": "97/package_configuration",
  "state": true,
  "url": "http://surf.scss.tcd.ie/_provider_/package_configuration"
}