{
  "outputs": [
    {
      "name": "_address",
      "type": "string",
      "desc": "Output of service ResearchAssistant address  service"
    }
  ],
  "provider": {
    "type": "asp"
  },
  "inputs": [
    {
      "name": "_research-assistant-in-academia",
      "type": "string",
      "desc": "Input of service ResearchAssistant address  service"
    }
  ],
  "name": "ResearchAssistant address  service",
  "description": "This service returns an address of a research assistant.",
  "domains": [
    {
      "name": "Marketing",
      "url": "http://www.surf.scss.tcd.ie/cityOntology/#Marketing"
    }
  ],
  "id": "educational/research-assistant-in-academia_address_service",
  "state": true,
  "url": "http://surf.scss.tcd.ie/_provider_/educational/research-assistant-in-academia_address_service"
}