{
  "plans": [
    {
      "outputs": [
        {
          "name": "augmentedRealityResource",
          "type": "xml"
        }
      ],
      "inputs": [
        {
          "name": "resourceParameters",
          "type": "xml"
        }
      ],
      "domains": [
        {
          "name": "Educational",
          "url": "http://www.surf.scss.tcd.ie/cityOntology/#Educational"
        }
      ],
      "state": 1,
      "steps": [
        {
          "outputs": [
            {
              "name": "augmentedRealityResource",
              "type": "xml"
            }
          ],
          "inputs": [
            {
              "name": "resourceParameters",
              "type": "xml"
            }
          ],
          "serviceDescription": {
            "outputs": [
              {
                "name": "augmentedRealityResource",
                "type": "xml"
              }
            ],
            "provider": {
              "type": "ws"
            },
            "inputs": [
              {
                "name": "resourceParameters",
                "type": "xml"
              }
            ],
            "name": "search_augmented_reality_resource",
            "description": "This is the service search_augmented_reality_resource",
            "domains": [
              {
                "name": "Educational",
                "url": "http://www.surf.scss.tcd.ie/cityOntology/#Educational"
              }
            ],
            "id": "61/search_augmented_reality_resource",
            "state": true,
            "url": "http://surf.scss.tcd.ie/_provider_/search_augmented_reality_resource"
          },
          "type": "SimpleStep",
          "order": 0
        }
      ]
    }
  ]
}