{
  "outputs": [
    {
      "name": "_recommendedprice",
      "type": "string",
      "desc": "Output of service FastCar Recommended price service"
    }
  ],
  "provider": {
    "type": "wsdn"
  },
  "inputs": [
    {
      "name": "_fastcar",
      "type": "string",
      "desc": "Input of service FastCar Recommended price service"
    }
  ],
  "name": "FastCar Recommended price service",
  "description": "Why I buy a fast car? this service convince you to buy a fast carand provide its recommended price.",
  "domains": [
    {
      "name": "Sports_Equipment",
      "url": "http://www.surf.scss.tcd.ie/cityOntology/#Sports_Equipment"
    }
  ],
  "id": "retail/fastcar_recommendedprice_service",
  "state": true,
  "url": "http://surf.scss.tcd.ie/_provider_/retail/fastcar_recommendedprice_service"
}