{
  "outputs": [
    {
      "name": "patientPresentation",
      "type": "interactive"
    }
  ],
  "provider": {
    "type": "asp"
  },
  "inputs": [
    {
      "name": "patientReadings",
      "type": "json"
    },
    {
      "name": "patientVideo",
      "type": "video"
    }
  ],
  "name": "presentation_patient_status",
  "description": "This is the service presentation_patient_status",
  "domains": [
    {
      "name": "Health",
      "url": "http://www.surf.scss.tcd.ie/cityOntology/#Health"
    }
  ],
  "id": "91/presentation_patient_status",
  "state": true,
  "url": "http://surf.scss.tcd.ie/_provider_/presentation_patient_status"
}