{
  "outputs": [
    {
      "name": "_price",
      "type": "string",
      "desc": "Output of service SFNovelPrice Service"
    }
  ],
  "provider": "",
  "inputs": [
    {
      "name": "_science-fiction-novel",
      "type": "string",
      "desc": "Input of service SFNovelPrice Service"
    },
    {
      "name": "_user",
      "type": "string",
      "desc": "Input of service SFNovelPrice Service"
    }
  ],
  "latitude": 0.0,
  "name": "SFNovelPrice Service",
  "description": "It is the best service that returns price of a given science-fiction novel to the certain user.",
  "domains": [
    {
      "name": "retail",
      "uri": "http://www.disit.org/km4city/schema#Retail"
    }
  ],
  "id": "retail/userscience-fiction-novel_price_service",
  "state": true,
  "type": "webservice",
  "url": "http://surf.scss.tcd.ie/_provider_/retail/userscience-fiction-novel_price_service",
  "longitude": 0.0
}