{
  "outputs": [
    {
      "name": "studentContent",
      "type": "json"
    }
  ],
  "qos": [],
  "inputs": [
    {
      "name": "accommodationConfirmation",
      "type": "json"
    }
  ],
  "domains": [
    {
      "name": "Accommodation",
      "url": "http://www.surf.scss.tcd.ie/cityOntology/#Accommodation"
    },
    {
      "name": "Educational",
      "url": "http://www.surf.scss.tcd.ie/cityOntology/#Educational"
    }
  ],
  "location": {}
}