{
  "outputs": [
    {
      "name": "report",
      "type": "json"
    }
  ],
  "qos": [],
  "inputs": [
    {
      "name": "gunshotAlert",
      "type": "alert"
    },
    {
      "name": "zoneIntrusionAlert",
      "type": "alert"
    },
    {
      "name": "report",
      "type": "json"
    }
  ],
  "domains": [
    {
      "name": "Safety_and_Emergencies",
      "url": "http://www.surf.scss.tcd.ie/cityOntology/#Safety_and_Emergencies"
    }
  ],
  "location": {}
}