{
  "outputs": [
    {
      "name": "_city",
      "type": "string",
      "desc": "Output of service Sightseeing City Service"
    }
  ],
  "provider": {
    "type": "wsdn"
  },
  "inputs": [
    {
      "name": "_sightseeing",
      "type": "string",
      "desc": "Input of service Sightseeing City Service"
    }
  ],
  "name": "Sightseeing City Service",
  "description": "This service returns city for sightseeing.",
  "domains": [
    {
      "name": "Furniture_and_Housing",
      "url": "http://www.surf.scss.tcd.ie/cityOntology/#Furniture_and_Housing"
    }
  ],
  "id": "tourism/sightseeing_city_service",
  "state": true,
  "url": "http://surf.scss.tcd.ie/_provider_/tourism/sightseeing_city_service"
}