{
  "outputs": [
    {
      "name": "_recommendedprice",
      "type": "string",
      "desc": "Output of service AuthorisedPersonMonographPriceService"
    }
  ],
  "provider": "",
  "inputs": [
    {
      "name": "_creditcardaccount",
      "type": "string",
      "desc": "Input of service AuthorisedPersonMonographPriceService"
    },
    {
      "name": "_monograph",
      "type": "string",
      "desc": "Input of service AuthorisedPersonMonographPriceService"
    },
    {
      "name": "_person",
      "type": "string",
      "desc": "Input of service AuthorisedPersonMonographPriceService"
    }
  ],
  "latitude": 0.0,
  "name": "AuthorisedPersonMonographPriceService",
  "description": "This service varify account of an authorised person andreturns recommended price of a monograph.",
  "domains": [
    {
      "name": "retail",
      "uri": "http://www.disit.org/km4city/schema#Retail"
    }
  ],
  "id": "retail/personmonographcreditcardaccount_recommendedprice_service",
  "state": true,
  "type": "asp",
  "url": "http://surf.scss.tcd.ie/_provider_/retail/personmonographcreditcardaccount_recommendedprice_service",
  "longitude": 0.0
}