{
  "outputs": [
    {
      "name": "recognitionVideo",
      "type": "video"
    }
  ],
  "provider": {
    "type": "asp"
  },
  "inputs": [
    {
      "name": "cameraId",
      "type": "long"
    }
  ],
  "name": "facial_recognition_service",
  "description": "This is the service facial_recognition_service",
  "domains": [
    {
      "name": "Safety_and_Emergencies",
      "url": "http://www.surf.scss.tcd.ie/cityOntology/#Safety_and_Emergencies"
    }
  ],
  "id": "113/facial_recognition_service",
  "state": true,
  "url": "http://surf.scss.tcd.ie/_provider_/facial_recognition_service"
}