{
  "outputs": [
    {
      "name": "_map",
      "type": "string",
      "desc": "Output of service Route to Berlin Service"
    }
  ],
  "provider": "",
  "inputs": [
    {
      "name": "_geographical-region",
      "type": "string",
      "desc": "Input of service Route to Berlin Service"
    }
  ],
  "latitude": 0.0,
  "name": "Route to Berlin Service",
  "description": "If you want to travel to Berlin, the we provide a service to return a mapindicate all paths from your location to Berlin.",
  "domains": [
    {
      "name": "mobility",
      "uri": "http://www.disit.org/km4city/schema#Mobility"
    }
  ],
  "id": "mobility/geographical-region_map_service",
  "state": true,
  "type": "webservice",
  "url": "http://surf.scss.tcd.ie/_provider_/mobility/geographical-region_map_service",
  "longitude": 0.0
}