{
  "outputs": [
    {
      "name": "gunshotAlert",
      "type": "alert"
    }
  ],
  "qos": [],
  "inputs": [
    {
      "name": "monitoredArea",
      "type": "json"
    }
  ],
  "domains": [
    {
      "name": "Transport_and_Mobility",
      "url": "http://www.surf.scss.tcd.ie/cityOntology/#Transport_and_Mobility"
    },
    {
      "name": "Safety_and_Emergencies",
      "url": "http://www.surf.scss.tcd.ie/cityOntology/#Safety_and_Emergencies"
    }
  ],
  "location": {}
}