{
  "outputs": [
    {
      "name": "_monograph",
      "type": "string",
      "desc": "Output of service author_monographprice_service"
    },
    {
      "name": "_price",
      "type": "string",
      "desc": "Output of service author_monographprice_service"
    }
  ],
  "provider": {
    "type": "webservice"
  },
  "inputs": [
    {
      "name": "_author",
      "type": "string",
      "desc": "Input of service author_monographprice_service"
    }
  ],
  "name": "author_monographprice_service",
  "description": "This service is about retail",
  "domains": [
    {
      "name": "Finance",
      "url": "http://www.surf.scss.tcd.ie/cityOntology/#Finance"
    }
  ],
  "id": "retail/author_monographprice_service",
  "state": true,
  "url": "http://surf.scss.tcd.ie/_provider_/retail/author_monographprice_service"
}