{
  "outputs": [
    {
      "name": "_book",
      "type": "string",
      "desc": "Output of service author_booktaxfreeprice_service"
    },
    {
      "name": "_taxfreeprice",
      "type": "string",
      "desc": "Output of service author_booktaxfreeprice_service"
    }
  ],
  "provider": {
    "type": "asp"
  },
  "inputs": [
    {
      "name": "_author",
      "type": "string",
      "desc": "Input of service author_booktaxfreeprice_service"
    }
  ],
  "name": "author_booktaxfreeprice_service",
  "description": "This service is about retail",
  "domains": [
    {
      "name": "Social_Security",
      "url": "http://www.surf.scss.tcd.ie/cityOntology/#Social_Security"
    }
  ],
  "id": "retail/author_booktaxfreeprice_service",
  "state": true,
  "url": "http://surf.scss.tcd.ie/_provider_/retail/author_booktaxfreeprice_service"
}