{
  "outputs": [
    {
      "name": "_price",
      "type": "string",
      "desc": "Output of service PFP Service"
    },
    {
      "name": "_day",
      "type": "string",
      "desc": "Output of service PFP Service"
    }
  ],
  "provider": {
    "type": "asp"
  },
  "inputs": [
    {
      "name": "_preparedfood",
      "type": "string",
      "desc": "Input of service PFP Service"
    }
  ],
  "name": "PFP Service",
  "description": "PFP is a reknown service that returns not only price of a given preparedfood, but also its expirydate.",
  "domains": [
    {
      "name": "History",
      "url": "http://www.surf.scss.tcd.ie/cityOntology/#History"
    }
  ],
  "id": "retail/preparedfood_priceday_service",
  "state": true,
  "url": "http://surf.scss.tcd.ie/_provider_/retail/preparedfood_priceday_service"
}