{
  "outputs": [
    {
      "name": "presentOffers",
      "type": "interactive"
    }
  ],
  "qos": [],
  "inputs": [
    {
      "name": "atmStatus",
      "type": "json"
    },
    {
      "name": "atmVideo",
      "type": "video"
    }
  ],
  "domains": [
    {
      "name": "Safety_and_Emergencies",
      "url": "http://www.surf.scss.tcd.ie/cityOntology/#Safety_and_Emergencies"
    },
    {
      "name": "Finance",
      "url": "http://www.surf.scss.tcd.ie/cityOntology/#Finance"
    },
    {
      "name": "Clothing",
      "url": "http://www.surf.scss.tcd.ie/cityOntology/#Clothing"
    }
  ],
  "location": {}
}