{
  "outputs": [
    {
      "name": "_nationalpark",
      "type": "string",
      "desc": "Output of service Hiking NationalPark Service"
    }
  ],
  "provider": {
    "type": "webservice"
  },
  "inputs": [
    {
      "name": "_hiking",
      "type": "string",
      "desc": "Input of service Hiking NationalPark Service"
    }
  ],
  "name": "Hiking NationalPark Service",
  "description": "This service returns nationalpark for hiking.",
  "domains": [
    {
      "name": "Arts",
      "url": "http://www.surf.scss.tcd.ie/cityOntology/#Arts"
    }
  ],
  "id": "tourism/hiking_nationalpark_service",
  "state": true,
  "url": "http://surf.scss.tcd.ie/_provider_/tourism/hiking_nationalpark_service"
}