{
  "outputs": [
    {
      "name": "packageMonitoringDisplay",
      "type": "interactive"
    }
  ],
  "qos": [],
  "inputs": [
    {
      "name": "studentReport",
      "type": "json"
    }
  ],
  "domains": [
    {
      "name": "Educational",
      "url": "http://www.surf.scss.tcd.ie/cityOntology/#Educational"
    },
    {
      "name": "Logistic",
      "url": "http://www.surf.scss.tcd.ie/cityOntology/#Logistic"
    },
    {
      "name": "Communications",
      "url": "http://www.surf.scss.tcd.ie/cityOntology/#Communications"
    }
  ],
  "location": {}
}