{
  "outputs": [
    {
      "name": "_address",
      "type": "string",
      "desc": "Output of service Professor address  service"
    }
  ],
  "provider": {
    "type": "asp"
  },
  "inputs": [
    {
      "name": "_professor-in-academia",
      "type": "string",
      "desc": "Input of service Professor address  service"
    }
  ],
  "name": "Professor address  service",
  "description": "This service returns an address of a professor, professor is also a researcher.",
  "domains": [
    {
      "name": "Tools",
      "url": "http://www.surf.scss.tcd.ie/cityOntology/#Tools"
    }
  ],
  "id": "educational/professor-in-academia_address_service",
  "state": true,
  "url": "http://surf.scss.tcd.ie/_provider_/educational/professor-in-academia_address_service"
}