{
  "outputs": [
    {
      "name": "_book",
      "type": "string",
      "desc": "Output of service BookSearchingService"
    },
    {
      "name": "_author",
      "type": "string",
      "desc": "Output of service BookSearchingService"
    }
  ],
  "provider": "",
  "inputs": [
    {
      "name": "_publication-number",
      "type": "string",
      "desc": "Input of service BookSearchingService"
    }
  ],
  "latitude": 0.0,
  "name": "BookSearchingService",
  "description": "This service returns a book and its and authors, on the given publication number",
  "domains": [
    {
      "name": "educational",
      "uri": "http://www.disit.org/km4city/schema#Educational"
    }
  ],
  "id": "educational/publication-number_bookauthor_service",
  "state": true,
  "type": "wsdn",
  "url": "http://surf.scss.tcd.ie/_provider_/educational/publication-number_bookauthor_service",
  "longitude": 0.0
}