{
  "outputs": [
    {
      "name": "atmDashboard",
      "type": "interactive"
    }
  ],
  "qos": [],
  "inputs": [
    {
      "name": "from",
      "type": "long"
    },
    {
      "name": "to",
      "type": "long"
    }
  ],
  "domains": [
    {
      "name": "Transport_and_Mobility",
      "url": "http://www.surf.scss.tcd.ie/cityOntology/#Transport_and_Mobility"
    },
    {
      "name": "Safety_and_Emergencies",
      "url": "http://www.surf.scss.tcd.ie/cityOntology/#Safety_and_Emergencies"
    },
    {
      "name": "Finance",
      "url": "http://www.surf.scss.tcd.ie/cityOntology/#Finance"
    }
  ],
  "location": {}
}