{
  "outputs": [
    {
      "name": "gunshotAlert",
      "type": "alert"
    }
  ],
  "provider": {
    "type": "wsdn"
  },
  "inputs": [
    {
      "name": "cityZoneToMonitor",
      "type": "json"
    }
  ],
  "name": "gunshot_detection",
  "description": "This is the service gunshot_detection",
  "domains": [
    {
      "name": "Safety_and_Emergencies",
      "url": "http://www.surf.scss.tcd.ie/cityOntology/#Safety_and_Emergencies"
    }
  ],
  "id": "22/gunshot_detection",
  "state": true,
  "url": "http://surf.scss.tcd.ie/_provider_/gunshot_detection"
}