{
  "plans": [
    {
      "outputs": [
        {
          "name": "atmStatus",
          "type": "json"
        }
      ],
      "inputs": [
        {
          "name": "atmId",
          "type": "int"
        }
      ],
      "domains": [
        {
          "name": "Safety_and_Emergencies",
          "url": "http://www.surf.scss.tcd.ie/cityOntology/#Safety_and_Emergencies"
        },
        {
          "name": "Finance",
          "url": "http://www.surf.scss.tcd.ie/cityOntology/#Finance"
        }
      ],
      "state": 1,
      "steps": [
        {
          "outputs": [
            {
              "name": "atmStatus",
              "type": "json"
            }
          ],
          "inputs": [
            {
              "name": "atmId",
              "type": "int"
            }
          ],
          "serviceDescription": {
            "outputs": [
              {
                "name": "atmStatus",
                "type": "json"
              }
            ],
            "provider": {
              "type": "wsdn"
            },
            "inputs": [
              {
                "name": "atmId",
                "type": "int"
              }
            ],
            "name": "atm_intruder_service",
            "description": "This is the service atm_intruder_service",
            "domains": [
              {
                "name": "Safety_and_Emergencies",
                "url": "http://www.surf.scss.tcd.ie/cityOntology/#Safety_and_Emergencies"
              },
              {
                "name": "Finance",
                "url": "http://www.surf.scss.tcd.ie/cityOntology/#Finance"
              }
            ],
            "id": "116/atm_intruder_service",
            "state": true,
            "url": "http://surf.scss.tcd.ie/_provider_/atm_intruder_service"
          },
          "type": "SimpleStep",
          "order": 0
        }
      ]
    }
  ]
}