{
  "outputs": [
    {
      "name": "monitorLog",
      "type": "json"
    }
  ],
  "provider": {
    "type": "asp"
  },
  "inputs": [
    {
      "name": "bookedBook",
      "type": "xml"
    }
  ],
  "name": "book_monitoring",
  "description": "This is the service book_monitoring",
  "domains": [
    {
      "name": "Educational",
      "url": "http://www.surf.scss.tcd.ie/cityOntology/#Educational"
    },
    {
      "name": "Research_and_Science",
      "url": "http://www.surf.scss.tcd.ie/cityOntology/#Research_and_Science"
    }
  ],
  "id": "60/book_monitoring",
  "state": true,
  "url": "http://surf.scss.tcd.ie/_provider_/book_monitoring"
}