{
  "outputs": [
    {
      "name": "routeMap",
      "type": "interactive"
    }
  ],
  "provider": {
    "type": "asp"
  },
  "inputs": [
    {
      "name": "selectedRoute",
      "type": "json"
    }
  ],
  "name": "route_presentation",
  "description": "This is the service route_presentation",
  "domains": [
    {
      "name": "Transport_and_Mobility",
      "url": "http://www.surf.scss.tcd.ie/cityOntology/#Transport_and_Mobility"
    }
  ],
  "id": "13/route_presentation",
  "state": true,
  "url": "http://surf.scss.tcd.ie/_provider_/route_presentation"
}