{
  "outputs": [
    {
      "name": "_lecturer-in-academia",
      "type": "string",
      "desc": "Output of service EducationalOrganizationLecturer"
    }
  ],
  "provider": "",
  "inputs": [
    {
      "name": "_educational-organization",
      "type": "string",
      "desc": "Input of service EducationalOrganizationLecturer"
    }
  ],
  "latitude": 0.0,
  "name": "EducationalOrganizationLecturer",
  "description": "This service returns lecturer of the given educational organization.",
  "domains": [
    {
      "name": "educational",
      "uri": "http://www.disit.org/km4city/schema#Educational"
    }
  ],
  "id": "educational/educational-organization_lecturer-in-academia_service",
  "state": true,
  "type": "webservice",
  "url": "http://surf.scss.tcd.ie/_provider_/educational/educational-organization_lecturer-in-academia_service",
  "longitude": 0.0
}