{
  "outputs": [
    {
      "name": "roomInfo",
      "type": "xml"
    }
  ],
  "qos": [],
  "inputs": [
    {
      "name": "place",
      "type": "json"
    }
  ],
  "domains": [
    {
      "name": "Safety_and_Emergencies",
      "url": "http://www.surf.scss.tcd.ie/cityOntology/#Safety_and_Emergencies"
    },
    {
      "name": "Educational",
      "url": "http://www.surf.scss.tcd.ie/cityOntology/#Educational"
    }
  ],
  "location": {}
}