{
  "outputs": [
    {
      "name": "_nationalpark",
      "type": "string",
      "desc": "Output of service Activity Nationalpark Service"
    }
  ],
  "provider": {
    "type": "asp"
  },
  "inputs": [
    {
      "name": "_activity",
      "type": "string",
      "desc": "Input of service Activity Nationalpark Service"
    }
  ],
  "name": "Activity Nationalpark Service",
  "description": "This service returns nationalpark for a given activity.",
  "domains": [
    {
      "name": "Logistic",
      "url": "http://www.surf.scss.tcd.ie/cityOntology/#Logistic"
    }
  ],
  "id": "tourism/activity_nationalpark_service",
  "state": true,
  "url": "http://surf.scss.tcd.ie/_provider_/tourism/activity_nationalpark_service"
}