{
  "outputs": [
    {
      "name": "_accommodation",
      "type": "string",
      "desc": "Output of service City Accommodation Service"
    }
  ],
  "provider": "",
  "inputs": [
    {
      "name": "_city",
      "type": "string",
      "desc": "Input of service City Accommodation Service"
    }
  ],
  "latitude": 0.0,
  "name": "City Accommodation Service",
  "description": "This service returns information about accommodations on a given city.",
  "domains": [],
  "id": "tourism/city_accommodation_service",
  "state": true,
  "type": "wsdn",
  "url": "http://surf.scss.tcd.ie/_provider_/tourism/city_accommodation_service",
  "longitude": 0.0
}