{
  "outputs": [
    {
      "name": "_urbanarea",
      "type": "string",
      "desc": "Output of service Activity UrbanArea Service"
    }
  ],
  "provider": "",
  "inputs": [
    {
      "name": "_activity",
      "type": "string",
      "desc": "Input of service Activity UrbanArea Service"
    }
  ],
  "latitude": 0.0,
  "name": "Activity UrbanArea Service",
  "description": "This service returns urbanarea for a given activity.",
  "domains": [],
  "id": "tourism/activity_urbanarea_service",
  "state": true,
  "type": "webservice",
  "url": "http://surf.scss.tcd.ie/_provider_/tourism/activity_urbanarea_service",
  "longitude": 0.0
}