{
  "outputs": [
    {
      "name": "_summary",
      "type": "string",
      "desc": "Output of service HDP service"
    },
    {
      "name": "_diagnosticprocess",
      "type": "string",
      "desc": "Output of service HDP service"
    }
  ],
  "provider": {
    "type": "wsdn"
  },
  "inputs": [
    {
      "name": "_hospital",
      "type": "string",
      "desc": "Input of service HDP service"
    }
  ],
  "name": "HDP service",
  "description": "HDP is a reknown service to get to know about a certain diagnostic system avaialbe in a certainhospital, this service returns also summary of the output system.",
  "domains": [
    {
      "name": "Living",
      "url": "http://www.surf.scss.tcd.ie/cityOntology/#Living"
    }
  ],
  "id": "health/hospital_summarydiagnosticprocess_service",
  "state": true,
  "url": "http://surf.scss.tcd.ie/_provider_/health/hospital_summarydiagnosticprocess_service"
}