{
  "outputs": [
    {
      "name": "similarBooks",
      "type": "xml"
    }
  ],
  "qos": [],
  "inputs": [
    {
      "name": "trafficInfo",
      "type": "json"
    },
    {
      "name": "pollutionInfo",
      "type": "json"
    },
    {
      "name": "noiseInfo",
      "type": "json"
    },
    {
      "name": "floodingInfo",
      "type": "json"
    }
  ],
  "domains": [
    {
      "name": "Transport_and_Mobility",
      "url": "http://www.surf.scss.tcd.ie/cityOntology/#Transport_and_Mobility"
    },
    {
      "name": "Educational",
      "url": "http://www.surf.scss.tcd.ie/cityOntology/#Educational"
    },
    {
      "name": "Research_and_Science",
      "url": "http://www.surf.scss.tcd.ie/cityOntology/#Research_and_Science"
    }
  ],
  "location": {}
}