{
  "outputs": [
    {
      "name": "_diagnosticprocess",
      "type": "string",
      "desc": "Output of service DiagnosticProcessAvailability"
    }
  ],
  "provider": {
    "type": "webservice"
  },
  "inputs": [
    {
      "name": "_hospital",
      "type": "string",
      "desc": "Input of service DiagnosticProcessAvailability"
    }
  ],
  "name": "DiagnosticProcessAvailability",
  "description": "This service returns certain type diagnostic process available in the certain hospital.",
  "domains": [
    {
      "name": "Clothing",
      "url": "http://www.surf.scss.tcd.ie/cityOntology/#Clothing"
    }
  ],
  "id": "health/hospital_diagnosticprocess_service",
  "state": true,
  "url": "http://surf.scss.tcd.ie/_provider_/health/hospital_diagnosticprocess_service"
}