{
  "outputs": [
    {
      "name": "_weathersystem",
      "type": "string",
      "desc": "Output of service GRWF Service"
    }
  ],
  "provider": "",
  "inputs": [
    {
      "name": "_geographical-region",
      "type": "string",
      "desc": "Input of service GRWF Service"
    }
  ],
  "latitude": 0.0,
  "name": "GRWF Service",
  "description": "GRWF service is used to get weather system of a particular geogrphical region.",
  "domains": [
    {
      "name": "environmental",
      "uri": "http://www.disit.org/km4city/schema#Environmental"
    }
  ],
  "id": "environmental/geographical-region_weathersystem_service",
  "state": true,
  "type": "webservice",
  "url": "http://surf.scss.tcd.ie/_provider_/environmental/geographical-region_weathersystem_service",
  "longitude": 0.0
}