{
  "outputs": [
    {
      "name": "_author",
      "type": "string",
      "desc": "Output of service Science-Fiction-Novel Author MaxPrice Service"
    },
    {
      "name": "_maxprice",
      "type": "string",
      "desc": "Output of service Science-Fiction-Novel Author MaxPrice Service"
    }
  ],
  "provider": {
    "type": "asp"
  },
  "inputs": [
    {
      "name": "_science-fiction-novel",
      "type": "string",
      "desc": "Input of service Science-Fiction-Novel Author MaxPrice Service"
    }
  ],
  "name": "Science-Fiction-Novel Author MaxPrice Service",
  "description": "This service returns author and max price of a given science fiction novel.",
  "domains": [
    {
      "name": "Health",
      "url": "http://www.surf.scss.tcd.ie/cityOntology/#Health"
    }
  ],
  "id": "retail/science-fiction-novel_authormaxprice_service",
  "state": true,
  "url": "http://surf.scss.tcd.ie/_provider_/retail/science-fiction-novel_authormaxprice_service"
}