{
  "outputs": [
    {
      "name": "constructionStatus",
      "type": "json"
    }
  ],
  "qos": [],
  "inputs": [
    {
      "name": "transportInfo",
      "type": "json"
    },
    {
      "name": "stadiumMap",
      "type": "interactive"
    },
    {
      "name": "similarResults",
      "type": "json"
    }
  ],
  "domains": [
    {
      "name": "Sport",
      "url": "http://www.surf.scss.tcd.ie/cityOntology/#Sport"
    },
    {
      "name": "Safety_and_Emergencies",
      "url": "http://www.surf.scss.tcd.ie/cityOntology/#Safety_and_Emergencies"
    },
    {
      "name": "Construction",
      "url": "http://www.surf.scss.tcd.ie/cityOntology/#Construction"
    }
  ],
  "location": {}
}