{
  "outputs": [
    {
      "name": "_destination",
      "type": "string",
      "desc": "Output of service SportsDestinationService"
    }
  ],
  "provider": {
    "type": "asp"
  },
  "inputs": [
    {
      "name": "_sports",
      "type": "string",
      "desc": "Input of service SportsDestinationService"
    }
  ],
  "name": "SportsDestinationService",
  "description": "This is a recommended service to know aboutthe best destination of the sports.",
  "domains": [
    {
      "name": "Activity",
      "url": "http://www.surf.scss.tcd.ie/cityOntology/#Activity"
    }
  ],
  "id": "tourism/sports_destination_service",
  "state": true,
  "url": "http://surf.scss.tcd.ie/_provider_/tourism/sports_destination_service"
}