{
  "outputs": [
    {
      "name": "prisionNotification",
      "type": "alert"
    }
  ],
  "qos": [],
  "inputs": [
    {
      "name": "productData",
      "type": "xml"
    }
  ],
  "domains": [
    {
      "name": "Furniture_and_Housing",
      "url": "http://www.surf.scss.tcd.ie/cityOntology/#Furniture_and_Housing"
    },
    {
      "name": "Safety_and_Emergencies",
      "url": "http://www.surf.scss.tcd.ie/cityOntology/#Safety_and_Emergencies"
    }
  ],
  "location": {}
}