{
  "outputs": [
    {
      "name": "_price",
      "type": "string",
      "desc": "Output of service Car Price service"
    }
  ],
  "provider": {
    "type": "webservice"
  },
  "inputs": [
    {
      "name": "_expensivecar",
      "type": "string",
      "desc": "Input of service Car Price service"
    },
    {
      "name": "_amount-of-money",
      "type": "string",
      "desc": "Input of service Car Price service"
    }
  ],
  "name": "Car Price service",
  "description": "This service tries to find price of a expensive car within given amount of money.",
  "domains": [
    {
      "name": "Energy",
      "url": "http://www.surf.scss.tcd.ie/cityOntology/#Energy"
    }
  ],
  "id": "retail/amount-of-moneyexpensivecar_price_service",
  "state": true,
  "url": "http://surf.scss.tcd.ie/_provider_/retail/amount-of-moneyexpensivecar_price_service"
}