{
  "outputs": [
    {
      "name": "_year",
      "type": "string",
      "desc": "Output of service FastCar Year Price Service"
    },
    {
      "name": "_price",
      "type": "string",
      "desc": "Output of service FastCar Year Price Service"
    }
  ],
  "provider": {
    "type": "webservice"
  },
  "inputs": [
    {
      "name": "_fastcar",
      "type": "string",
      "desc": "Input of service FastCar Year Price Service"
    }
  ],
  "name": "FastCar Year Price Service",
  "description": "This service provides the and model year of a given fast car.",
  "domains": [
    {
      "name": "Food_and_Drinks",
      "url": "http://www.surf.scss.tcd.ie/cityOntology/#Food_and_Drinks"
    }
  ],
  "id": "retail/fastcar_yearprice_service",
  "state": true,
  "url": "http://surf.scss.tcd.ie/_provider_/retail/fastcar_yearprice_service"
}