{
  "outputs": [
    {
      "name": "bookNotification",
      "type": "mail"
    }
  ],
  "qos": [],
  "inputs": [
    {
      "name": "roomVideo",
      "type": "stream"
    }
  ],
  "domains": [
    {
      "name": "Accommodation",
      "url": "http://www.surf.scss.tcd.ie/cityOntology/#Accommodation"
    }
  ],
  "location": {}
}