{
  "outputs": [
    {
      "name": "updatedRoomCalendar",
      "type": "json"
    }
  ],
  "qos": [],
  "inputs": [
    {
      "name": "touristicPath",
      "type": "json"
    },
    {
      "name": "suggestedActivities",
      "type": "json"
    },
    {
      "name": "relatedContent",
      "type": "xml"
    }
  ],
  "domains": [
    {
      "name": "Activity",
      "url": "http://www.surf.scss.tcd.ie/cityOntology/#Activity"
    },
    {
      "name": "Educational",
      "url": "http://www.surf.scss.tcd.ie/cityOntology/#Educational"
    }
  ],
  "location": {}
}