{
  "plans": [
    {
      "outputs": [
        {
          "name": "selectedRoute",
          "type": "json"
        }
      ],
      "inputs": [
        {
          "name": "routeParameters",
          "type": "json"
        },
        {
          "name": "routeParameters",
          "type": "json"
        },
        {
          "name": "routeParameters",
          "type": "json"
        },
        {
          "name": "routeParameters",
          "type": "json"
        }
      ],
      "domains": [
        {
          "name": "Transport_and_Mobility",
          "url": "http://www.surf.scss.tcd.ie/cityOntology/#Transport_and_Mobility"
        },
        {
          "name": "Transport_and_Mobility",
          "url": "http://www.surf.scss.tcd.ie/cityOntology/#Transport_and_Mobility"
        },
        {
          "name": "Transport_and_Mobility",
          "url": "http://www.surf.scss.tcd.ie/cityOntology/#Transport_and_Mobility"
        },
        {
          "name": "Transport_and_Mobility",
          "url": "http://www.surf.scss.tcd.ie/cityOntology/#Transport_and_Mobility"
        }
      ],
      "state": 1,
      "steps": [
        {
          "outputs": [
            {
              "name": "selectedRoute",
              "type": "json"
            }
          ],
          "inputs": [
            {
              "name": "trafficInfo",
              "type": "json"
            },
            {
              "name": "pollutionInfo",
              "type": "json"
            },
            {
              "name": "noiseInfo",
              "type": "json"
            },
            {
              "name": "floodingInfo",
              "type": "json"
            }
          ],
          "type": "SequentialStep",
          "steps": [
            {
              "outputs": [
                {
                  "name": "selectedRoute",
                  "type": "json"
                }
              ],
              "inputs": [
                {
                  "name": "trafficInfo",
                  "type": "json"
                },
                {
                  "name": "pollutionInfo",
                  "type": "json"
                },
                {
                  "name": "noiseInfo",
                  "type": "json"
                },
                {
                  "name": "floodingInfo",
                  "type": "json"
                }
              ],
              "serviceDescription": {
                "outputs": [
                  {
                    "name": "selectedRoute",
                    "type": "json"
                  }
                ],
                "provider": {
                  "type": "ws"
                },
                "inputs": [
                  {
                    "name": "trafficInfo",
                    "type": "json"
                  },
                  {
                    "name": "pollutionInfo",
                    "type": "json"
                  },
                  {
                    "name": "noiseInfo",
                    "type": "json"
                  },
                  {
                    "name": "floodingInfo",
                    "type": "json"
                  }
                ],
                "name": "route_selector",
                "description": "This is the service route_selector",
                "domains": [
                  {
                    "name": "Transport_and_Mobility",
                    "url": "http://www.surf.scss.tcd.ie/cityOntology/#Transport_and_Mobility"
                  }
                ],
                "id": "3/route_selector",
                "state": true,
                "url": "http://surf.scss.tcd.ie/_provider_/route_selector"
              },
              "type": "SimpleStep",
              "order": 0
            }
          ],
          "order": 0
        },
        {
          "outputs": [
            {
              "name": "floodingInfo",
              "type": "json"
            },
            {
              "name": "trafficInfo",
              "type": "json"
            },
            {
              "name": "pollutionInfo",
              "type": "json"
            }
          ],
          "inputs": [
            {
              "name": "routeParameters",
              "type": "json"
            },
            {
              "name": "routeParameters",
              "type": "json"
            },
            {
              "name": "routeParameters",
              "type": "json"
            },
            {
              "name": "routeParameters",
              "type": "json"
            }
          ],
          "type": "ParallelStep",
          "steps": [
            {
              "outputs": [
                {
                  "name": "floodingInfo",
                  "type": "json"
                }
              ],
              "inputs": [
                {
                  "name": "routeParameters",
                  "type": "json"
                }
              ],
              "type": "SequentialStep",
              "steps": [
                {
                  "outputs": [
                    {
                      "name": "floodingInfo",
                      "type": "json"
                    }
                  ],
                  "inputs": [
                    {
                      "name": "routeParameters",
                      "type": "json"
                    }
                  ],
                  "serviceDescription": {
                    "outputs": [
                      {
                        "name": "floodingInfo",
                        "type": "json"
                      }
                    ],
                    "provider": {
                      "type": "wsdn"
                    },
                    "inputs": [
                      {
                        "name": "routeParameters",
                        "type": "json"
                      }
                    ],
                    "name": "route_water_level",
                    "description": "This is the service route_water_level",
                    "domains": [
                      {
                        "name": "Transport_and_Mobility",
                        "url": "http://www.surf.scss.tcd.ie/cityOntology/#Transport_and_Mobility"
                      }
                    ],
                    "id": "6/route_water_level",
                    "state": true,
                    "url": "http://surf.scss.tcd.ie/_provider_/route_water_level"
                  },
                  "type": "SimpleStep",
                  "order": 0
                }
              ],
              "order": 0
            },
            {
              "outputs": [
                {
                  "name": "trafficInfo",
                  "type": "json"
                }
              ],
              "inputs": [
                {
                  "name": "routeParameters",
                  "type": "json"
                }
              ],
              "type": "SequentialStep",
              "steps": [
                {
                  "outputs": [
                    {
                      "name": "trafficInfo",
                      "type": "json"
                    }
                  ],
                  "inputs": [
                    {
                      "name": "routeParameters",
                      "type": "json"
                    }
                  ],
                  "serviceDescription": {
                    "outputs": [
                      {
                        "name": "trafficInfo",
                        "type": "json"
                      }
                    ],
                    "provider": {
                      "type": "asp"
                    },
                    "inputs": [
                      {
                        "name": "routeParameters",
                        "type": "json"
                      }
                    ],
                    "name": "traffic_detection",
                    "description": "This is the service traffic_detection",
                    "domains": [
                      {
                        "name": "Transport_and_Mobility",
                        "url": "http://www.surf.scss.tcd.ie/cityOntology/#Transport_and_Mobility"
                      }
                    ],
                    "id": "2/traffic_detection",
                    "state": true,
                    "url": "http://surf.scss.tcd.ie/_provider_/traffic_detection"
                  },
                  "type": "SimpleStep",
                  "order": 0
                }
              ],
              "order": 1
            },
            {
              "outputs": [
                {
                  "name": "pollutionInfo",
                  "type": "json"
                }
              ],
              "inputs": [
                {
                  "name": "routeParameters",
                  "type": "json"
                }
              ],
              "type": "SequentialStep",
              "steps": [
                {
                  "outputs": [
                    {
                      "name": "pollutionInfo",
                      "type": "json"
                    }
                  ],
                  "inputs": [
                    {
                      "name": "routeParameters",
                      "type": "json"
                    }
                  ],
                  "serviceDescription": {
                    "outputs": [
                      {
                        "name": "pollutionInfo",
                        "type": "json"
                      }
                    ],
                    "provider": {
                      "type": "wsdn"
                    },
                    "inputs": [
                      {
                        "name": "routeParameters",
                        "type": "json"
                      }
                    ],
                    "name": "route_air_pollution",
                    "description": "This is the service route_air_pollution",
                    "domains": [
                      {
                        "name": "Transport_and_Mobility",
                        "url": "http://www.surf.scss.tcd.ie/cityOntology/#Transport_and_Mobility"
                      }
                    ],
                    "id": "4/route_air_pollution",
                    "state": true,
                    "url": "http://surf.scss.tcd.ie/_provider_/route_air_pollution"
                  },
                  "type": "SimpleStep",
                  "order": 0
                }
              ],
              "order": 2
            },
            {
              "outputs": [
                {
                  "name": "noiseInfo",
                  "type": "json"
                }
              ],
              "inputs": [
                {
                  "name": "routeParameters",
                  "type": "json"
                }
              ],
              "type": "SequentialStep",
              "steps": [
                {
                  "outputs": [
                    {
                      "name": "noiseInfo",
                      "type": "json"
                    }
                  ],
                  "inputs": [
                    {
                      "name": "routeParameters",
                      "type": "json"
                    }
                  ],
                  "serviceDescription": {
                    "outputs": [
                      {
                        "name": "noiseInfo",
                        "type": "json"
                      }
                    ],
                    "provider": {
                      "type": "asp"
                    },
                    "inputs": [
                      {
                        "name": "routeParameters",
                        "type": "json"
                      }
                    ],
                    "name": "route_noise_service",
                    "description": "This is the service route_noise_service",
                    "domains": [
                      {
                        "name": "Transport_and_Mobility",
                        "url": "http://www.surf.scss.tcd.ie/cityOntology/#Transport_and_Mobility"
                      }
                    ],
                    "id": "5/route_noise_service",
                    "state": true,
                    "url": "http://surf.scss.tcd.ie/_provider_/route_noise_service"
                  },
                  "type": "SimpleStep",
                  "order": 0
                }
              ],
              "order": 0
            }
          ],
          "order": 1
        }
      ]
    }
  ]
}