{
  "outputs": [
    {
      "name": "_book",
      "type": "string",
      "desc": "Output of service BookProviderService"
    }
  ],
  "provider": {
    "type": "wsdn"
  },
  "inputs": [
    {
      "name": "_isbn",
      "type": "string",
      "desc": "Input of service BookProviderService"
    }
  ],
  "name": "BookProviderService",
  "description": "This service provides a book on the given ISBN.",
  "domains": [
    {
      "name": "Logistic",
      "url": "http://www.surf.scss.tcd.ie/cityOntology/#Logistic"
    }
  ],
  "id": "educational/isbn_book_service",
  "state": true,
  "url": "http://surf.scss.tcd.ie/_provider_/educational/isbn_book_service"
}