{
  "outputs": [
    {
      "name": "report",
      "type": "json"
    }
  ],
  "qos": [],
  "inputs": [
    {
      "name": "binId",
      "type": "long"
    }
  ],
  "domains": [
    {
      "name": "Waste",
      "url": "http://www.surf.scss.tcd.ie/cityOntology/#Waste"
    },
    {
      "name": "Safety_and_Emergencies",
      "url": "http://www.surf.scss.tcd.ie/cityOntology/#Safety_and_Emergencies"
    }
  ],
  "location": {}
}