{
  "outputs": [
    {
      "name": "_academic-support-staff",
      "type": "string",
      "desc": "Output of service UniversityAcademicSupportStaffService"
    }
  ],
  "provider": {
    "type": "wsdn"
  },
  "inputs": [
    {
      "name": "_university",
      "type": "string",
      "desc": "Input of service UniversityAcademicSupportStaffService"
    }
  ],
  "name": "UniversityAcademicSupportStaffService",
  "description": "This service returns Academic Support Staff of the university.",
  "domains": [
    {
      "name": "Safety_and_Emergencies",
      "url": "http://www.surf.scss.tcd.ie/cityOntology/#Safety_and_Emergencies"
    }
  ],
  "id": "educational/university_academic-support-staff_service",
  "state": true,
  "url": "http://surf.scss.tcd.ie/_provider_/educational/university_academic-support-staff_service"
}