{
  "outputs": [
    {
      "name": "homeVideo",
      "type": "streaming"
    }
  ],
  "qos": [],
  "inputs": [
    {
      "name": "zone",
      "type": "json"
    }
  ],
  "domains": [
    {
      "name": "Nature",
      "url": "http://www.surf.scss.tcd.ie/cityOntology/#Nature"
    },
    {
      "name": "Safety_and_Emergencies",
      "url": "http://www.surf.scss.tcd.ie/cityOntology/#Safety_and_Emergencies"
    }
  ],
  "location": {}
}