{
  "plans": [
    {
      "outputs": [
        {
          "name": "eventTicketsInfo",
          "type": "json"
        }
      ],
      "inputs": [
        {
          "name": "eventParameters",
          "type": "xml"
        }
      ],
      "domains": [
        {
          "name": "Sport",
          "url": "http://www.surf.scss.tcd.ie/cityOntology/#Sport"
        },
        {
          "name": "Leisure",
          "url": "http://www.surf.scss.tcd.ie/cityOntology/#Leisure"
        }
      ],
      "state": 1,
      "steps": [
        {
          "outputs": [
            {
              "name": "eventTicketsInfo",
              "type": "json"
            }
          ],
          "inputs": [
            {
              "name": "eventParameters",
              "type": "xml"
            }
          ],
          "serviceDescription": {
            "outputs": [
              {
                "name": "eventTicketsInfo",
                "type": "json"
              }
            ],
            "provider": {
              "type": "ws"
            },
            "inputs": [
              {
                "name": "eventParameters",
                "type": "xml"
              }
            ],
            "name": "buy_football_tickets",
            "description": "This is the service buy_football_tickets",
            "domains": [
              {
                "name": "Sport",
                "url": "http://www.surf.scss.tcd.ie/cityOntology/#Sport"
              },
              {
                "name": "Leisure",
                "url": "http://www.surf.scss.tcd.ie/cityOntology/#Leisure"
              }
            ],
            "id": "119/buy_football_tickets",
            "state": true,
            "url": "http://surf.scss.tcd.ie/_provider_/buy_football_tickets"
          },
          "type": "SimpleStep",
          "order": 0
        }
      ]
    }
  ]
}