{
  "outputs": [
    {
      "name": "sendNotification",
      "type": "mail"
    }
  ],
  "qos": [],
  "inputs": [
    {
      "name": "patientReadings",
      "type": "json"
    },
    {
      "name": "patientVideo",
      "type": "video"
    }
  ],
  "domains": [
    {
      "name": "Health",
      "url": "http://www.surf.scss.tcd.ie/cityOntology/#Health"
    },
    {
      "name": "Safety_and_Emergencies",
      "url": "http://www.surf.scss.tcd.ie/cityOntology/#Safety_and_Emergencies"
    }
  ],
  "location": {}
}