{
  "outputs": [
    {
      "name": "_investigating",
      "type": "string",
      "desc": "Output of service InvestigatingFinding"
    }
  ],
  "provider": "",
  "inputs": [
    {
      "name": "_hospital",
      "type": "string",
      "desc": "Input of service InvestigatingFinding"
    }
  ],
  "latitude": 0.0,
  "name": "InvestigatingFinding",
  "description": "This service the certain type investigating facility available in the certain hospital.",
  "domains": [
    {
      "name": "health",
      "uri": "http://www.disit.org/km4city/schema#Health"
    }
  ],
  "id": "health/hospital_investigating_service",
  "state": true,
  "type": "asp",
  "url": "http://surf.scss.tcd.ie/_provider_/health/hospital_investigating_service",
  "longitude": 0.0
}