{
  "outputs": [
    {
      "name": "sensedData",
      "type": "json"
    }
  ],
  "qos": [],
  "inputs": [
    {
      "name": "bookStatus",
      "type": "boolean"
    },
    {
      "name": "similarBooks",
      "type": "xml"
    }
  ],
  "domains": [
    {
      "name": "Educational",
      "url": "http://www.surf.scss.tcd.ie/cityOntology/#Educational"
    }
  ],
  "location": {}
}