{
  "outputs": [
    {
      "name": "augmentedRealityResourcePresentation",
      "type": "multimedia"
    }
  ],
  "qos": [],
  "inputs": [
    {
      "name": "patientProfile",
      "type": "json"
    }
  ],
  "domains": [
    {
      "name": "Health",
      "url": "http://www.surf.scss.tcd.ie/cityOntology/#Health"
    },
    {
      "name": "Educational",
      "url": "http://www.surf.scss.tcd.ie/cityOntology/#Educational"
    }
  ],
  "location": {}
}