{
  "outputs": [
    {
      "name": "_destination",
      "type": "string",
      "desc": "Output of service CityCountaryInfoService"
    },
    {
      "name": "_hotel",
      "type": "string",
      "desc": "Output of service CityCountaryInfoService"
    }
  ],
  "provider": {
    "type": "webservice"
  },
  "inputs": [
    {
      "name": "_country",
      "type": "string",
      "desc": "Input of service CityCountaryInfoService"
    },
    {
      "name": "_city",
      "type": "string",
      "desc": "Input of service CityCountaryInfoService"
    }
  ],
  "name": "CityCountaryInfoService",
  "description": "This service returns hotel of the capital city of the country, the countryis an optional input, and it returns the destination of the city also.",
  "domains": [
    {
      "name": "Activity",
      "url": "http://www.surf.scss.tcd.ie/cityOntology/#Activity"
    }
  ],
  "id": "tourism/citycountry_destinationhotel_service",
  "state": true,
  "url": "http://surf.scss.tcd.ie/_provider_/tourism/citycountry_destinationhotel_service"
}