{
  "plans": [
    {
      "outputs": [
        {
          "name": "monitorLog",
          "type": "json"
        }
      ],
      "inputs": [
        {
          "name": "searchKeywords",
          "type": "xml"
        }
      ],
      "domains": [
        {
          "name": "Educational",
          "url": "http://www.surf.scss.tcd.ie/cityOntology/#Educational"
        },
        {
          "name": "Research_and_Science",
          "url": "http://www.surf.scss.tcd.ie/cityOntology/#Research_and_Science"
        },
        {
          "name": "Educational",
          "url": "http://www.surf.scss.tcd.ie/cityOntology/#Educational"
        },
        {
          "name": "Research_and_Science",
          "url": "http://www.surf.scss.tcd.ie/cityOntology/#Research_and_Science"
        },
        {
          "name": "Educational",
          "url": "http://www.surf.scss.tcd.ie/cityOntology/#Educational"
        },
        {
          "name": "Research_and_Science",
          "url": "http://www.surf.scss.tcd.ie/cityOntology/#Research_and_Science"
        }
      ],
      "state": 1,
      "steps": [
        {
          "outputs": [
            {
              "name": "monitorLog",
              "type": "json"
            }
          ],
          "inputs": [
            {
              "name": "bookStatus",
              "type": "boolean"
            },
            {
              "name": "similarBooks",
              "type": "xml"
            }
          ],
          "type": "SequentialStep",
          "steps": [
            {
              "outputs": [
                {
                  "name": "monitorLog",
                  "type": "json"
                }
              ],
              "inputs": [
                {
                  "name": "bookedBook",
                  "type": "xml"
                }
              ],
              "serviceDescription": {
                "outputs": [
                  {
                    "name": "monitorLog",
                    "type": "json"
                  }
                ],
                "provider": {
                  "type": "asp"
                },
                "inputs": [
                  {
                    "name": "bookedBook",
                    "type": "xml"
                  }
                ],
                "name": "book_monitoring",
                "description": "This is the service book_monitoring",
                "domains": [
                  {
                    "name": "Educational",
                    "url": "http://www.surf.scss.tcd.ie/cityOntology/#Educational"
                  },
                  {
                    "name": "Research_and_Science",
                    "url": "http://www.surf.scss.tcd.ie/cityOntology/#Research_and_Science"
                  }
                ],
                "id": "60/book_monitoring",
                "state": true,
                "url": "http://surf.scss.tcd.ie/_provider_/book_monitoring"
              },
              "type": "SimpleStep",
              "order": 0
            },
            {
              "outputs": [
                {
                  "name": "bookedBook",
                  "type": "xml"
                }
              ],
              "inputs": [
                {
                  "name": "searchInfo",
                  "type": "json"
                }
              ],
              "serviceDescription": {
                "outputs": [
                  {
                    "name": "bookedBook",
                    "type": "xml"
                  }
                ],
                "provider": {
                  "type": "ws"
                },
                "inputs": [
                  {
                    "name": "searchInfo",
                    "type": "json"
                  }
                ],
                "name": "book_booking",
                "description": "This is the service book_booking",
                "domains": [
                  {
                    "name": "Educational",
                    "url": "http://www.surf.scss.tcd.ie/cityOntology/#Educational"
                  },
                  {
                    "name": "Research_and_Science",
                    "url": "http://www.surf.scss.tcd.ie/cityOntology/#Research_and_Science"
                  }
                ],
                "id": "59/book_booking",
                "state": true,
                "url": "http://surf.scss.tcd.ie/_provider_/book_booking"
              },
              "type": "SimpleStep",
              "order": 1
            },
            {
              "outputs": [
                {
                  "name": "searchInfo",
                  "type": "json"
                }
              ],
              "inputs": [
                {
                  "name": "bookStatus",
                  "type": "boolean"
                },
                {
                  "name": "similarBooks",
                  "type": "xml"
                }
              ],
              "serviceDescription": {
                "outputs": [
                  {
                    "name": "searchInfo",
                    "type": "json"
                  }
                ],
                "provider": {
                  "type": "asp"
                },
                "inputs": [
                  {
                    "name": "bookStatus",
                    "type": "boolean"
                  },
                  {
                    "name": "similarBooks",
                    "type": "xml"
                  }
                ],
                "name": "book_search_presentation,Research_and_Science",
                "description": "This is the service book_search_presentation,research_and_science",
                "domains": [
                  {
                    "name": "Educational",
                    "url": "http://www.surf.scss.tcd.ie/cityOntology/#Educational"
                  }
                ],
                "id": "58/book_search_presentation,Research_and_Science",
                "state": true,
                "url": "http://surf.scss.tcd.ie/_provider_/book_search_presentation,research_and_science"
              },
              "type": "SimpleStep",
              "order": 2
            }
          ],
          "order": 0
        },
        {
          "outputs": [
            {
              "name": "similarBooks",
              "type": "xml"
            }
          ],
          "inputs": [
            {
              "name": "booksInformation",
              "type": "xml"
            },
            {
              "name": "booksInformation",
              "type": "xml"
            }
          ],
          "type": "ParallelStep",
          "steps": [
            {
              "outputs": [
                {
                  "name": "similarBooks",
                  "type": "xml"
                }
              ],
              "inputs": [
                {
                  "name": "booksInformation",
                  "type": "xml"
                }
              ],
              "type": "SequentialStep",
              "steps": [
                {
                  "outputs": [
                    {
                      "name": "similarBooks",
                      "type": "xml"
                    }
                  ],
                  "inputs": [
                    {
                      "name": "booksInformation",
                      "type": "xml"
                    }
                  ],
                  "serviceDescription": {
                    "outputs": [
                      {
                        "name": "similarBooks",
                        "type": "xml"
                      }
                    ],
                    "provider": {
                      "type": "ws"
                    },
                    "inputs": [
                      {
                        "name": "booksInformation",
                        "type": "xml"
                      }
                    ],
                    "name": "similar_books",
                    "description": "This is the service similar_books",
                    "domains": [
                      {
                        "name": "Educational",
                        "url": "http://www.surf.scss.tcd.ie/cityOntology/#Educational"
                      },
                      {
                        "name": "Research_and_Science",
                        "url": "http://www.surf.scss.tcd.ie/cityOntology/#Research_and_Science"
                      }
                    ],
                    "id": "57/similar_books",
                    "state": true,
                    "url": "http://surf.scss.tcd.ie/_provider_/similar_books"
                  },
                  "type": "SimpleStep",
                  "order": 0
                }
              ],
              "order": 0
            },
            {
              "outputs": [
                {
                  "name": "bookStatus",
                  "type": "boolean"
                }
              ],
              "inputs": [
                {
                  "name": "booksInformation",
                  "type": "xml"
                }
              ],
              "type": "SequentialStep",
              "steps": [
                {
                  "outputs": [
                    {
                      "name": "bookStatus",
                      "type": "boolean"
                    }
                  ],
                  "inputs": [
                    {
                      "name": "booksInformation",
                      "type": "xml"
                    }
                  ],
                  "serviceDescription": {
                    "outputs": [
                      {
                        "name": "bookStatus",
                        "type": "boolean"
                      }
                    ],
                    "provider": {
                      "type": "wsdn"
                    },
                    "inputs": [
                      {
                        "name": "booksInformation",
                        "type": "xml"
                      }
                    ],
                    "name": "book_status",
                    "description": "This is the service book_status",
                    "domains": [
                      {
                        "name": "Educational",
                        "url": "http://www.surf.scss.tcd.ie/cityOntology/#Educational"
                      },
                      {
                        "name": "Research_and_Science",
                        "url": "http://www.surf.scss.tcd.ie/cityOntology/#Research_and_Science"
                      }
                    ],
                    "id": "56/book_status",
                    "state": true,
                    "url": "http://surf.scss.tcd.ie/_provider_/book_status"
                  },
                  "type": "SimpleStep",
                  "order": 0
                }
              ],
              "order": 0
            }
          ],
          "order": 1
        },
        {
          "outputs": [
            {
              "name": "booksInformation",
              "type": "xml"
            }
          ],
          "inputs": [
            {
              "name": "searchKeywords",
              "type": "xml"
            }
          ],
          "type": "SequentialStep",
          "steps": [
            {
              "outputs": [
                {
                  "name": "booksInformation",
                  "type": "xml"
                }
              ],
              "inputs": [
                {
                  "name": "searchKeywords",
                  "type": "xml"
                }
              ],
              "serviceDescription": {
                "outputs": [
                  {
                    "name": "booksInformation",
                    "type": "xml"
                  }
                ],
                "provider": {
                  "type": "ws"
                },
                "inputs": [
                  {
                    "name": "searchKeywords",
                    "type": "xml"
                  }
                ],
                "name": "search_book",
                "description": "This is the service search_book",
                "domains": [
                  {
                    "name": "Educational",
                    "url": "http://www.surf.scss.tcd.ie/cityOntology/#Educational"
                  },
                  {
                    "name": "Research_and_Science",
                    "url": "http://www.surf.scss.tcd.ie/cityOntology/#Research_and_Science"
                  }
                ],
                "id": "55/search_book",
                "state": true,
                "url": "http://surf.scss.tcd.ie/_provider_/search_book"
              },
              "type": "SimpleStep",
              "order": 0
            }
          ],
          "order": 2
        }
      ]
    }
  ]
}