{
  "outputs": [
    {
      "name": "bookNotification",
      "type": "mail"
    }
  ],
  "qos": [],
  "inputs": [
    {
      "name": "studentActivityInfo",
      "type": "json"
    },
    {
      "name": "attendanceInfo",
      "type": "json"
    }
  ],
  "domains": [
    {
      "name": "Educational",
      "url": "http://www.surf.scss.tcd.ie/cityOntology/#Educational"
    },
    {
      "name": "Accommodation",
      "url": "http://www.surf.scss.tcd.ie/cityOntology/#Accommodation"
    }
  ],
  "location": {}
}