{
  "plans": [
    {
      "outputs": [
        {
          "name": "productsDeliveryPlan",
          "type": "json"
        }
      ],
      "inputs": [
        {
          "name": "productData",
          "type": "xml"
        }
      ],
      "domains": [
        {
          "name": "Food_and_Drinks",
          "url": "http://www.surf.scss.tcd.ie/cityOntology/#Food_and_Drinks"
        },
        {
          "name": "Sport",
          "url": "http://www.surf.scss.tcd.ie/cityOntology/#Sport"
        },
        {
          "name": "Tools",
          "url": "http://www.surf.scss.tcd.ie/cityOntology/#Tools"
        },
        {
          "name": "Furniture_and_Housing",
          "url": "http://www.surf.scss.tcd.ie/cityOntology/#Furniture_and_Housing"
        },
        {
          "name": "Clothing",
          "url": "http://www.surf.scss.tcd.ie/cityOntology/#Clothing"
        },
        {
          "name": "Technology",
          "url": "http://www.surf.scss.tcd.ie/cityOntology/#Technology"
        }
      ],
      "state": 1,
      "steps": [
        {
          "outputs": [
            {
              "name": "productsDeliveryPlan",
              "type": "json"
            }
          ],
          "inputs": [
            {
              "name": "productData",
              "type": "xml"
            }
          ],
          "type": "SequentialStep",
          "steps": [
            {
              "outputs": [
                {
                  "name": "productsDeliveryPlan",
                  "type": "json"
                }
              ],
              "inputs": [
                {
                  "name": "paymentInfo",
                  "type": "xml"
                }
              ],
              "serviceDescription": {
                "outputs": [
                  {
                    "name": "productsDeliveryPlan",
                    "type": "json"
                  }
                ],
                "provider": {
                  "type": "asp"
                },
                "inputs": [
                  {
                    "name": "paymentInfo",
                    "type": "xml"
                  }
                ],
                "name": "products_delivery",
                "description": "This is the service products_delivery",
                "domains": [
                  {
                    "name": "Food_and_Drinks",
                    "url": "http://www.surf.scss.tcd.ie/cityOntology/#Food_and_Drinks"
                  },
                  {
                    "name": "Sport",
                    "url": "http://www.surf.scss.tcd.ie/cityOntology/#Sport"
                  },
                  {
                    "name": "Tools",
                    "url": "http://www.surf.scss.tcd.ie/cityOntology/#Tools"
                  },
                  {
                    "name": "Furniture_and_Housing",
                    "url": "http://www.surf.scss.tcd.ie/cityOntology/#Furniture_and_Housing"
                  },
                  {
                    "name": "Clothing",
                    "url": "http://www.surf.scss.tcd.ie/cityOntology/#Clothing"
                  },
                  {
                    "name": "Technology",
                    "url": "http://www.surf.scss.tcd.ie/cityOntology/#Technology"
                  }
                ],
                "id": "136/products_delivery",
                "state": true,
                "url": "http://surf.scss.tcd.ie/_provider_/products_delivery"
              },
              "type": "SimpleStep",
              "order": 0
            },
            {
              "outputs": [
                {
                  "name": "paymentInfo",
                  "type": "xml"
                }
              ],
              "inputs": [
                {
                  "name": "purchaseOrder",
                  "type": "json"
                }
              ],
              "serviceDescription": {
                "outputs": [
                  {
                    "name": "paymentInfo",
                    "type": "xml"
                  }
                ],
                "provider": {
                  "type": "ws"
                },
                "inputs": [
                  {
                    "name": "purchaseOrder",
                    "type": "json"
                  }
                ],
                "name": "pay_order",
                "description": "This is the service pay_order",
                "domains": [
                  {
                    "name": "Food_and_Drinks",
                    "url": "http://www.surf.scss.tcd.ie/cityOntology/#Food_and_Drinks"
                  },
                  {
                    "name": "Clothing",
                    "url": "http://www.surf.scss.tcd.ie/cityOntology/#Clothing"
                  },
                  {
                    "name": "Sport",
                    "url": "http://www.surf.scss.tcd.ie/cityOntology/#Sport"
                  },
                  {
                    "name": "Tools",
                    "url": "http://www.surf.scss.tcd.ie/cityOntology/#Tools"
                  },
                  {
                    "name": "Furniture_and_Housing",
                    "url": "http://www.surf.scss.tcd.ie/cityOntology/#Furniture_and_Housing"
                  },
                  {
                    "name": "Technology",
                    "url": "http://www.surf.scss.tcd.ie/cityOntology/#Technology"
                  }
                ],
                "id": "135/pay_order",
                "state": true,
                "url": "http://surf.scss.tcd.ie/_provider_/pay_order"
              },
              "type": "SimpleStep",
              "order": 1
            },
            {
              "outputs": [
                {
                  "name": "purchaseOrder",
                  "type": "json"
                }
              ],
              "inputs": [
                {
                  "name": "products",
                  "type": "json"
                }
              ],
              "serviceDescription": {
                "outputs": [
                  {
                    "name": "purchaseOrder",
                    "type": "json"
                  }
                ],
                "provider": {
                  "type": "ws"
                },
                "inputs": [
                  {
                    "name": "products",
                    "type": "json"
                  }
                ],
                "name": "shopping_order",
                "description": "This is the service shopping_order",
                "domains": [
                  {
                    "name": "Food_and_Drinks",
                    "url": "http://www.surf.scss.tcd.ie/cityOntology/#Food_and_Drinks"
                  },
                  {
                    "name": "Clothing",
                    "url": "http://www.surf.scss.tcd.ie/cityOntology/#Clothing"
                  },
                  {
                    "name": "Sport",
                    "url": "http://www.surf.scss.tcd.ie/cityOntology/#Sport"
                  },
                  {
                    "name": "Tools",
                    "url": "http://www.surf.scss.tcd.ie/cityOntology/#Tools"
                  },
                  {
                    "name": "Furniture_and_Housing",
                    "url": "http://www.surf.scss.tcd.ie/cityOntology/#Furniture_and_Housing"
                  },
                  {
                    "name": "Technology",
                    "url": "http://www.surf.scss.tcd.ie/cityOntology/#Technology"
                  }
                ],
                "id": "134/shopping_order",
                "state": true,
                "url": "http://surf.scss.tcd.ie/_provider_/shopping_order"
              },
              "type": "SimpleStep",
              "order": 2
            },
            {
              "outputs": [
                {
                  "name": "products",
                  "type": "json"
                }
              ],
              "inputs": [
                {
                  "name": "productData",
                  "type": "xml"
                }
              ],
              "serviceDescription": {
                "outputs": [
                  {
                    "name": "products",
                    "type": "json"
                  }
                ],
                "provider": {
                  "type": "wsdn"
                },
                "inputs": [
                  {
                    "name": "productData",
                    "type": "xml"
                  }
                ],
                "name": "buy_tools_products",
                "description": "This is the service buy_tools_products",
                "domains": [
                  {
                    "name": "Tools",
                    "url": "http://www.surf.scss.tcd.ie/cityOntology/#Tools"
                  }
                ],
                "id": "132/buy_tools_products",
                "state": true,
                "url": "http://surf.scss.tcd.ie/_provider_/buy_tools_products"
              },
              "type": "SimpleStep",
              "order": 3
            }
          ],
          "order": 0
        }
      ]
    },
    {
      "outputs": [
        {
          "name": "productsDeliveryPlan",
          "type": "json"
        }
      ],
      "inputs": [
        {
          "name": "productData",
          "type": "xml"
        }
      ],
      "domains": [
        {
          "name": "Food_and_Drinks",
          "url": "http://www.surf.scss.tcd.ie/cityOntology/#Food_and_Drinks"
        },
        {
          "name": "Sport",
          "url": "http://www.surf.scss.tcd.ie/cityOntology/#Sport"
        },
        {
          "name": "Tools",
          "url": "http://www.surf.scss.tcd.ie/cityOntology/#Tools"
        },
        {
          "name": "Furniture_and_Housing",
          "url": "http://www.surf.scss.tcd.ie/cityOntology/#Furniture_and_Housing"
        },
        {
          "name": "Clothing",
          "url": "http://www.surf.scss.tcd.ie/cityOntology/#Clothing"
        },
        {
          "name": "Technology",
          "url": "http://www.surf.scss.tcd.ie/cityOntology/#Technology"
        }
      ],
      "state": 1,
      "steps": [
        {
          "outputs": [
            {
              "name": "productsDeliveryPlan",
              "type": "json"
            }
          ],
          "inputs": [
            {
              "name": "productData",
              "type": "xml"
            }
          ],
          "type": "SequentialStep",
          "steps": [
            {
              "outputs": [
                {
                  "name": "productsDeliveryPlan",
                  "type": "json"
                }
              ],
              "inputs": [
                {
                  "name": "paymentInfo",
                  "type": "xml"
                }
              ],
              "serviceDescription": {
                "outputs": [
                  {
                    "name": "productsDeliveryPlan",
                    "type": "json"
                  }
                ],
                "provider": {
                  "type": "asp"
                },
                "inputs": [
                  {
                    "name": "paymentInfo",
                    "type": "xml"
                  }
                ],
                "name": "products_delivery",
                "description": "This is the service products_delivery",
                "domains": [
                  {
                    "name": "Food_and_Drinks",
                    "url": "http://www.surf.scss.tcd.ie/cityOntology/#Food_and_Drinks"
                  },
                  {
                    "name": "Sport",
                    "url": "http://www.surf.scss.tcd.ie/cityOntology/#Sport"
                  },
                  {
                    "name": "Tools",
                    "url": "http://www.surf.scss.tcd.ie/cityOntology/#Tools"
                  },
                  {
                    "name": "Furniture_and_Housing",
                    "url": "http://www.surf.scss.tcd.ie/cityOntology/#Furniture_and_Housing"
                  },
                  {
                    "name": "Clothing",
                    "url": "http://www.surf.scss.tcd.ie/cityOntology/#Clothing"
                  },
                  {
                    "name": "Technology",
                    "url": "http://www.surf.scss.tcd.ie/cityOntology/#Technology"
                  }
                ],
                "id": "136/products_delivery",
                "state": true,
                "url": "http://surf.scss.tcd.ie/_provider_/products_delivery"
              },
              "type": "SimpleStep",
              "order": 0
            },
            {
              "outputs": [
                {
                  "name": "paymentInfo",
                  "type": "xml"
                }
              ],
              "inputs": [
                {
                  "name": "purchaseOrder",
                  "type": "json"
                }
              ],
              "serviceDescription": {
                "outputs": [
                  {
                    "name": "paymentInfo",
                    "type": "xml"
                  }
                ],
                "provider": {
                  "type": "ws"
                },
                "inputs": [
                  {
                    "name": "purchaseOrder",
                    "type": "json"
                  }
                ],
                "name": "pay_order",
                "description": "This is the service pay_order",
                "domains": [
                  {
                    "name": "Food_and_Drinks",
                    "url": "http://www.surf.scss.tcd.ie/cityOntology/#Food_and_Drinks"
                  },
                  {
                    "name": "Clothing",
                    "url": "http://www.surf.scss.tcd.ie/cityOntology/#Clothing"
                  },
                  {
                    "name": "Sport",
                    "url": "http://www.surf.scss.tcd.ie/cityOntology/#Sport"
                  },
                  {
                    "name": "Tools",
                    "url": "http://www.surf.scss.tcd.ie/cityOntology/#Tools"
                  },
                  {
                    "name": "Furniture_and_Housing",
                    "url": "http://www.surf.scss.tcd.ie/cityOntology/#Furniture_and_Housing"
                  },
                  {
                    "name": "Technology",
                    "url": "http://www.surf.scss.tcd.ie/cityOntology/#Technology"
                  }
                ],
                "id": "135/pay_order",
                "state": true,
                "url": "http://surf.scss.tcd.ie/_provider_/pay_order"
              },
              "type": "SimpleStep",
              "order": 1
            },
            {
              "outputs": [
                {
                  "name": "purchaseOrder",
                  "type": "json"
                }
              ],
              "inputs": [
                {
                  "name": "products",
                  "type": "json"
                }
              ],
              "serviceDescription": {
                "outputs": [
                  {
                    "name": "purchaseOrder",
                    "type": "json"
                  }
                ],
                "provider": {
                  "type": "ws"
                },
                "inputs": [
                  {
                    "name": "products",
                    "type": "json"
                  }
                ],
                "name": "shopping_order",
                "description": "This is the service shopping_order",
                "domains": [
                  {
                    "name": "Food_and_Drinks",
                    "url": "http://www.surf.scss.tcd.ie/cityOntology/#Food_and_Drinks"
                  },
                  {
                    "name": "Clothing",
                    "url": "http://www.surf.scss.tcd.ie/cityOntology/#Clothing"
                  },
                  {
                    "name": "Sport",
                    "url": "http://www.surf.scss.tcd.ie/cityOntology/#Sport"
                  },
                  {
                    "name": "Tools",
                    "url": "http://www.surf.scss.tcd.ie/cityOntology/#Tools"
                  },
                  {
                    "name": "Furniture_and_Housing",
                    "url": "http://www.surf.scss.tcd.ie/cityOntology/#Furniture_and_Housing"
                  },
                  {
                    "name": "Technology",
                    "url": "http://www.surf.scss.tcd.ie/cityOntology/#Technology"
                  }
                ],
                "id": "134/shopping_order",
                "state": true,
                "url": "http://surf.scss.tcd.ie/_provider_/shopping_order"
              },
              "type": "SimpleStep",
              "order": 2
            },
            {
              "outputs": [
                {
                  "name": "products",
                  "type": "json"
                }
              ],
              "inputs": [
                {
                  "name": "productData",
                  "type": "xml"
                }
              ],
              "serviceDescription": {
                "outputs": [
                  {
                    "name": "products",
                    "type": "json"
                  }
                ],
                "provider": {
                  "type": "wsdn"
                },
                "inputs": [
                  {
                    "name": "productData",
                    "type": "xml"
                  }
                ],
                "name": "buy_technology_products",
                "description": "This is the service buy_technology_products",
                "domains": [
                  {
                    "name": "Technology",
                    "url": "http://www.surf.scss.tcd.ie/cityOntology/#Technology"
                  }
                ],
                "id": "131/buy_technology_products",
                "state": true,
                "url": "http://surf.scss.tcd.ie/_provider_/buy_technology_products"
              },
              "type": "SimpleStep",
              "order": 3
            }
          ],
          "order": 0
        }
      ]
    },
    {
      "outputs": [
        {
          "name": "productsDeliveryPlan",
          "type": "json"
        }
      ],
      "inputs": [
        {
          "name": "productData",
          "type": "xml"
        }
      ],
      "domains": [
        {
          "name": "Food_and_Drinks",
          "url": "http://www.surf.scss.tcd.ie/cityOntology/#Food_and_Drinks"
        },
        {
          "name": "Sport",
          "url": "http://www.surf.scss.tcd.ie/cityOntology/#Sport"
        },
        {
          "name": "Tools",
          "url": "http://www.surf.scss.tcd.ie/cityOntology/#Tools"
        },
        {
          "name": "Furniture_and_Housing",
          "url": "http://www.surf.scss.tcd.ie/cityOntology/#Furniture_and_Housing"
        },
        {
          "name": "Clothing",
          "url": "http://www.surf.scss.tcd.ie/cityOntology/#Clothing"
        },
        {
          "name": "Technology",
          "url": "http://www.surf.scss.tcd.ie/cityOntology/#Technology"
        }
      ],
      "state": 1,
      "steps": [
        {
          "outputs": [
            {
              "name": "productsDeliveryPlan",
              "type": "json"
            }
          ],
          "inputs": [
            {
              "name": "productData",
              "type": "xml"
            }
          ],
          "type": "SequentialStep",
          "steps": [
            {
              "outputs": [
                {
                  "name": "productsDeliveryPlan",
                  "type": "json"
                }
              ],
              "inputs": [
                {
                  "name": "paymentInfo",
                  "type": "xml"
                }
              ],
              "serviceDescription": {
                "outputs": [
                  {
                    "name": "productsDeliveryPlan",
                    "type": "json"
                  }
                ],
                "provider": {
                  "type": "asp"
                },
                "inputs": [
                  {
                    "name": "paymentInfo",
                    "type": "xml"
                  }
                ],
                "name": "products_delivery",
                "description": "This is the service products_delivery",
                "domains": [
                  {
                    "name": "Food_and_Drinks",
                    "url": "http://www.surf.scss.tcd.ie/cityOntology/#Food_and_Drinks"
                  },
                  {
                    "name": "Sport",
                    "url": "http://www.surf.scss.tcd.ie/cityOntology/#Sport"
                  },
                  {
                    "name": "Tools",
                    "url": "http://www.surf.scss.tcd.ie/cityOntology/#Tools"
                  },
                  {
                    "name": "Furniture_and_Housing",
                    "url": "http://www.surf.scss.tcd.ie/cityOntology/#Furniture_and_Housing"
                  },
                  {
                    "name": "Clothing",
                    "url": "http://www.surf.scss.tcd.ie/cityOntology/#Clothing"
                  },
                  {
                    "name": "Technology",
                    "url": "http://www.surf.scss.tcd.ie/cityOntology/#Technology"
                  }
                ],
                "id": "136/products_delivery",
                "state": true,
                "url": "http://surf.scss.tcd.ie/_provider_/products_delivery"
              },
              "type": "SimpleStep",
              "order": 0
            },
            {
              "outputs": [
                {
                  "name": "paymentInfo",
                  "type": "xml"
                }
              ],
              "inputs": [
                {
                  "name": "purchaseOrder",
                  "type": "json"
                }
              ],
              "serviceDescription": {
                "outputs": [
                  {
                    "name": "paymentInfo",
                    "type": "xml"
                  }
                ],
                "provider": {
                  "type": "ws"
                },
                "inputs": [
                  {
                    "name": "purchaseOrder",
                    "type": "json"
                  }
                ],
                "name": "pay_order",
                "description": "This is the service pay_order",
                "domains": [
                  {
                    "name": "Food_and_Drinks",
                    "url": "http://www.surf.scss.tcd.ie/cityOntology/#Food_and_Drinks"
                  },
                  {
                    "name": "Clothing",
                    "url": "http://www.surf.scss.tcd.ie/cityOntology/#Clothing"
                  },
                  {
                    "name": "Sport",
                    "url": "http://www.surf.scss.tcd.ie/cityOntology/#Sport"
                  },
                  {
                    "name": "Tools",
                    "url": "http://www.surf.scss.tcd.ie/cityOntology/#Tools"
                  },
                  {
                    "name": "Furniture_and_Housing",
                    "url": "http://www.surf.scss.tcd.ie/cityOntology/#Furniture_and_Housing"
                  },
                  {
                    "name": "Technology",
                    "url": "http://www.surf.scss.tcd.ie/cityOntology/#Technology"
                  }
                ],
                "id": "135/pay_order",
                "state": true,
                "url": "http://surf.scss.tcd.ie/_provider_/pay_order"
              },
              "type": "SimpleStep",
              "order": 1
            },
            {
              "outputs": [
                {
                  "name": "purchaseOrder",
                  "type": "json"
                }
              ],
              "inputs": [
                {
                  "name": "products",
                  "type": "json"
                }
              ],
              "serviceDescription": {
                "outputs": [
                  {
                    "name": "purchaseOrder",
                    "type": "json"
                  }
                ],
                "provider": {
                  "type": "ws"
                },
                "inputs": [
                  {
                    "name": "products",
                    "type": "json"
                  }
                ],
                "name": "shopping_order",
                "description": "This is the service shopping_order",
                "domains": [
                  {
                    "name": "Food_and_Drinks",
                    "url": "http://www.surf.scss.tcd.ie/cityOntology/#Food_and_Drinks"
                  },
                  {
                    "name": "Clothing",
                    "url": "http://www.surf.scss.tcd.ie/cityOntology/#Clothing"
                  },
                  {
                    "name": "Sport",
                    "url": "http://www.surf.scss.tcd.ie/cityOntology/#Sport"
                  },
                  {
                    "name": "Tools",
                    "url": "http://www.surf.scss.tcd.ie/cityOntology/#Tools"
                  },
                  {
                    "name": "Furniture_and_Housing",
                    "url": "http://www.surf.scss.tcd.ie/cityOntology/#Furniture_and_Housing"
                  },
                  {
                    "name": "Technology",
                    "url": "http://www.surf.scss.tcd.ie/cityOntology/#Technology"
                  }
                ],
                "id": "134/shopping_order",
                "state": true,
                "url": "http://surf.scss.tcd.ie/_provider_/shopping_order"
              },
              "type": "SimpleStep",
              "order": 2
            },
            {
              "outputs": [
                {
                  "name": "products",
                  "type": "json"
                }
              ],
              "inputs": [
                {
                  "name": "productData",
                  "type": "xml"
                }
              ],
              "serviceDescription": {
                "outputs": [
                  {
                    "name": "products",
                    "type": "json"
                  }
                ],
                "provider": {
                  "type": "wsdn"
                },
                "inputs": [
                  {
                    "name": "productData",
                    "type": "xml"
                  }
                ],
                "name": "buy_furniture_products",
                "description": "This is the service buy_furniture_products",
                "domains": [
                  {
                    "name": "Furniture_and_Housing",
                    "url": "http://www.surf.scss.tcd.ie/cityOntology/#Furniture_and_Housing"
                  }
                ],
                "id": "133/buy_furniture_products",
                "state": true,
                "url": "http://surf.scss.tcd.ie/_provider_/buy_furniture_products"
              },
              "type": "SimpleStep",
              "order": 3
            }
          ],
          "order": 0
        }
      ]
    },
    {
      "outputs": [
        {
          "name": "productsDeliveryPlan",
          "type": "json"
        }
      ],
      "inputs": [
        {
          "name": "productData",
          "type": "xml"
        }
      ],
      "domains": [
        {
          "name": "Food_and_Drinks",
          "url": "http://www.surf.scss.tcd.ie/cityOntology/#Food_and_Drinks"
        },
        {
          "name": "Sport",
          "url": "http://www.surf.scss.tcd.ie/cityOntology/#Sport"
        },
        {
          "name": "Tools",
          "url": "http://www.surf.scss.tcd.ie/cityOntology/#Tools"
        },
        {
          "name": "Furniture_and_Housing",
          "url": "http://www.surf.scss.tcd.ie/cityOntology/#Furniture_and_Housing"
        },
        {
          "name": "Clothing",
          "url": "http://www.surf.scss.tcd.ie/cityOntology/#Clothing"
        },
        {
          "name": "Technology",
          "url": "http://www.surf.scss.tcd.ie/cityOntology/#Technology"
        }
      ],
      "state": 1,
      "steps": [
        {
          "outputs": [
            {
              "name": "productsDeliveryPlan",
              "type": "json"
            }
          ],
          "inputs": [
            {
              "name": "productData",
              "type": "xml"
            }
          ],
          "type": "SequentialStep",
          "steps": [
            {
              "outputs": [
                {
                  "name": "productsDeliveryPlan",
                  "type": "json"
                }
              ],
              "inputs": [
                {
                  "name": "paymentInfo",
                  "type": "xml"
                }
              ],
              "serviceDescription": {
                "outputs": [
                  {
                    "name": "productsDeliveryPlan",
                    "type": "json"
                  }
                ],
                "provider": {
                  "type": "asp"
                },
                "inputs": [
                  {
                    "name": "paymentInfo",
                    "type": "xml"
                  }
                ],
                "name": "products_delivery",
                "description": "This is the service products_delivery",
                "domains": [
                  {
                    "name": "Food_and_Drinks",
                    "url": "http://www.surf.scss.tcd.ie/cityOntology/#Food_and_Drinks"
                  },
                  {
                    "name": "Sport",
                    "url": "http://www.surf.scss.tcd.ie/cityOntology/#Sport"
                  },
                  {
                    "name": "Tools",
                    "url": "http://www.surf.scss.tcd.ie/cityOntology/#Tools"
                  },
                  {
                    "name": "Furniture_and_Housing",
                    "url": "http://www.surf.scss.tcd.ie/cityOntology/#Furniture_and_Housing"
                  },
                  {
                    "name": "Clothing",
                    "url": "http://www.surf.scss.tcd.ie/cityOntology/#Clothing"
                  },
                  {
                    "name": "Technology",
                    "url": "http://www.surf.scss.tcd.ie/cityOntology/#Technology"
                  }
                ],
                "id": "136/products_delivery",
                "state": true,
                "url": "http://surf.scss.tcd.ie/_provider_/products_delivery"
              },
              "type": "SimpleStep",
              "order": 0
            },
            {
              "outputs": [
                {
                  "name": "paymentInfo",
                  "type": "xml"
                }
              ],
              "inputs": [
                {
                  "name": "purchaseOrder",
                  "type": "json"
                }
              ],
              "serviceDescription": {
                "outputs": [
                  {
                    "name": "paymentInfo",
                    "type": "xml"
                  }
                ],
                "provider": {
                  "type": "ws"
                },
                "inputs": [
                  {
                    "name": "purchaseOrder",
                    "type": "json"
                  }
                ],
                "name": "pay_order",
                "description": "This is the service pay_order",
                "domains": [
                  {
                    "name": "Food_and_Drinks",
                    "url": "http://www.surf.scss.tcd.ie/cityOntology/#Food_and_Drinks"
                  },
                  {
                    "name": "Clothing",
                    "url": "http://www.surf.scss.tcd.ie/cityOntology/#Clothing"
                  },
                  {
                    "name": "Sport",
                    "url": "http://www.surf.scss.tcd.ie/cityOntology/#Sport"
                  },
                  {
                    "name": "Tools",
                    "url": "http://www.surf.scss.tcd.ie/cityOntology/#Tools"
                  },
                  {
                    "name": "Furniture_and_Housing",
                    "url": "http://www.surf.scss.tcd.ie/cityOntology/#Furniture_and_Housing"
                  },
                  {
                    "name": "Technology",
                    "url": "http://www.surf.scss.tcd.ie/cityOntology/#Technology"
                  }
                ],
                "id": "135/pay_order",
                "state": true,
                "url": "http://surf.scss.tcd.ie/_provider_/pay_order"
              },
              "type": "SimpleStep",
              "order": 1
            },
            {
              "outputs": [
                {
                  "name": "purchaseOrder",
                  "type": "json"
                }
              ],
              "inputs": [
                {
                  "name": "products",
                  "type": "json"
                }
              ],
              "serviceDescription": {
                "outputs": [
                  {
                    "name": "purchaseOrder",
                    "type": "json"
                  }
                ],
                "provider": {
                  "type": "ws"
                },
                "inputs": [
                  {
                    "name": "products",
                    "type": "json"
                  }
                ],
                "name": "shopping_order",
                "description": "This is the service shopping_order",
                "domains": [
                  {
                    "name": "Food_and_Drinks",
                    "url": "http://www.surf.scss.tcd.ie/cityOntology/#Food_and_Drinks"
                  },
                  {
                    "name": "Clothing",
                    "url": "http://www.surf.scss.tcd.ie/cityOntology/#Clothing"
                  },
                  {
                    "name": "Sport",
                    "url": "http://www.surf.scss.tcd.ie/cityOntology/#Sport"
                  },
                  {
                    "name": "Tools",
                    "url": "http://www.surf.scss.tcd.ie/cityOntology/#Tools"
                  },
                  {
                    "name": "Furniture_and_Housing",
                    "url": "http://www.surf.scss.tcd.ie/cityOntology/#Furniture_and_Housing"
                  },
                  {
                    "name": "Technology",
                    "url": "http://www.surf.scss.tcd.ie/cityOntology/#Technology"
                  }
                ],
                "id": "134/shopping_order",
                "state": true,
                "url": "http://surf.scss.tcd.ie/_provider_/shopping_order"
              },
              "type": "SimpleStep",
              "order": 2
            },
            {
              "outputs": [
                {
                  "name": "products",
                  "type": "json"
                }
              ],
              "inputs": [
                {
                  "name": "productData",
                  "type": "xml"
                }
              ],
              "serviceDescription": {
                "outputs": [
                  {
                    "name": "products",
                    "type": "json"
                  }
                ],
                "provider": {
                  "type": "wsdn"
                },
                "inputs": [
                  {
                    "name": "productData",
                    "type": "xml"
                  }
                ],
                "name": "buy_sport_products",
                "description": "This is the service buy_sport_products",
                "domains": [
                  {
                    "name": "Sport",
                    "url": "http://www.surf.scss.tcd.ie/cityOntology/#Sport"
                  }
                ],
                "id": "130/buy_sport_products",
                "state": true,
                "url": "http://surf.scss.tcd.ie/_provider_/buy_sport_products"
              },
              "type": "SimpleStep",
              "order": 3
            }
          ],
          "order": 0
        }
      ]
    }
  ]
}