{
  "outputs": [
    {
      "name": "gpsPackageInfo",
      "type": "json"
    }
  ],
  "qos": [],
  "inputs": [
    {
      "name": "patientProfile",
      "type": "json"
    }
  ],
  "domains": [
    {
      "name": "Health",
      "url": "http://www.surf.scss.tcd.ie/cityOntology/#Health"
    },
    {
      "name": "Logistic",
      "url": "http://www.surf.scss.tcd.ie/cityOntology/#Logistic"
    },
    {
      "name": "Communications",
      "url": "http://www.surf.scss.tcd.ie/cityOntology/#Communications"
    }
  ],
  "location": {}
}