{
  "outputs": [
    {
      "name": "startAlarm",
      "type": "alarm"
    }
  ],
  "provider": {
    "type": "wsdn"
  },
  "inputs": [
    {
      "name": "alertNotification",
      "type": "alert"
    }
  ],
  "name": "notify_police",
  "description": "This is the service notify_police",
  "domains": [
    {
      "name": "Safety_and_Emergencies",
      "url": "http://www.surf.scss.tcd.ie/cityOntology/#Safety_and_Emergencies"
    }
  ],
  "id": "33/notify_police",
  "state": true,
  "url": "http://surf.scss.tcd.ie/_provider_/notify_police"
}