{
  "outputs": [
    {
      "name": "industryInfo",
      "type": "json"
    }
  ],
  "qos": [],
  "inputs": [
    {
      "name": "packageInfo",
      "type": "xml"
    }
  ],
  "domains": [
    {
      "name": "Logistic",
      "url": "http://www.surf.scss.tcd.ie/cityOntology/#Logistic"
    },
    {
      "name": "Communications",
      "url": "http://www.surf.scss.tcd.ie/cityOntology/#Communications"
    },
    {
      "name": "Industry",
      "url": "http://www.surf.scss.tcd.ie/cityOntology/#Industry"
    },
    {
      "name": "Nature",
      "url": "http://www.surf.scss.tcd.ie/cityOntology/#Nature"
    }
  ],
  "location": {}
}