{
  "outputs": [
    {
      "name": "_book",
      "type": "string",
      "desc": "Output of service author_booktaxedprice_service"
    },
    {
      "name": "_taxedprice",
      "type": "string",
      "desc": "Output of service author_booktaxedprice_service"
    }
  ],
  "provider": {
    "type": "asp"
  },
  "inputs": [
    {
      "name": "_author",
      "type": "string",
      "desc": "Input of service author_booktaxedprice_service"
    }
  ],
  "name": "author_booktaxedprice_service",
  "description": "This service is about retail",
  "domains": [
    {
      "name": "Logistic",
      "url": "http://www.surf.scss.tcd.ie/cityOntology/#Logistic"
    }
  ],
  "id": "retail/author_booktaxedprice_service",
  "state": true,
  "url": "http://surf.scss.tcd.ie/_provider_/retail/author_booktaxedprice_service"
}