{
  "outputs": [
    {
      "name": "_price",
      "type": "string",
      "desc": "Output of service Car Price service"
    },
    {
      "name": "_company",
      "type": "string",
      "desc": "Output of service Car Price service"
    }
  ],
  "provider": {
    "type": "asp"
  },
  "inputs": [
    {
      "name": "_car",
      "type": "string",
      "desc": "Input of service Car Price service"
    },
    {
      "name": "_amount-of-money",
      "type": "string",
      "desc": "Input of service Car Price service"
    }
  ],
  "name": "Car Price service",
  "description": "This service facilitate a client to find a company which offer thesame car within range of given amount of money.",
  "domains": [
    {
      "name": "Logistic",
      "url": "http://www.surf.scss.tcd.ie/cityOntology/#Logistic"
    }
  ],
  "id": "retail/amount-of-moneycar_pricecompany_service",
  "state": true,
  "url": "http://surf.scss.tcd.ie/_provider_/retail/amount-of-moneycar_pricecompany_service"
}