{
  "outputs": [
    {
      "name": "eventVisualisation",
      "type": "interactive"
    }
  ],
  "qos": [],
  "inputs": [
    {
      "name": "activityParameters",
      "type": "xml"
    }
  ],
  "domains": [
    {
      "name": "Activity",
      "url": "http://www.surf.scss.tcd.ie/cityOntology/#Activity"
    },
    {
      "name": "Sport",
      "url": "http://www.surf.scss.tcd.ie/cityOntology/#Sport"
    }
  ],
  "location": {}
}