{
  "plans": [
    {
      "outputs": [
        {
          "name": "selectedAccommodation",
          "type": "json"
        }
      ],
      "inputs": [
        {
          "name": "accommodationParameters",
          "type": "xml"
        }
      ],
      "domains": [
        {
          "name": "Accommodation",
          "url": "http://www.surf.scss.tcd.ie/cityOntology/#Accommodation"
        }
      ],
      "state": 1,
      "steps": [
        {
          "outputs": [
            {
              "name": "selectedAccommodation",
              "type": "json"
            }
          ],
          "inputs": [
            {
              "name": "accommodationParameters",
              "type": "xml"
            }
          ],
          "type": "SequentialStep",
          "steps": [
            {
              "outputs": [
                {
                  "name": "selectedAccommodation",
                  "type": "json"
                }
              ],
              "inputs": [
                {
                  "name": "accommodationList",
                  "type": "xml"
                }
              ],
              "serviceDescription": {
                "outputs": [
                  {
                    "name": "selectedAccommodation",
                    "type": "json"
                  }
                ],
                "provider": {
                  "type": "asp"
                },
                "inputs": [
                  {
                    "name": "accommodationList",
                    "type": "xml"
                  }
                ],
                "name": "accommodation_selection",
                "description": "This is the service accommodation_selection",
                "domains": [
                  {
                    "name": "Accommodation",
                    "url": "http://www.surf.scss.tcd.ie/cityOntology/#Accommodation"
                  }
                ],
                "id": "83/accommodation_selection",
                "state": true,
                "url": "http://surf.scss.tcd.ie/_provider_/accommodation_selection"
              },
              "type": "SimpleStep",
              "order": 0
            },
            {
              "outputs": [
                {
                  "name": "accommodationList",
                  "type": "xml"
                }
              ],
              "inputs": [
                {
                  "name": "accommodationParameters",
                  "type": "xml"
                }
              ],
              "serviceDescription": {
                "outputs": [
                  {
                    "name": "accommodationList",
                    "type": "xml"
                  }
                ],
                "provider": {
                  "type": "ws"
                },
                "inputs": [
                  {
                    "name": "accommodationParameters",
                    "type": "xml"
                  }
                ],
                "name": "search_accommodation",
                "description": "This is the service search_accommodation",
                "domains": [
                  {
                    "name": "Accommodation",
                    "url": "http://www.surf.scss.tcd.ie/cityOntology/#Accommodation"
                  }
                ],
                "id": "82/search_accommodation",
                "state": true,
                "url": "http://surf.scss.tcd.ie/_provider_/search_accommodation"
              },
              "type": "SimpleStep",
              "order": 1
            }
          ],
          "order": 0
        }
      ]
    }
  ]
}