{
  "plans": [
    {
      "outputs": [
        {
          "name": "placeVideo",
          "type": "streaming"
        }
      ],
      "inputs": [
        {
          "name": "gunshotAlert",
          "type": "alert"
        },
        {
          "name": "zoneIntrusionAlert",
          "type": "alert"
        },
        {
          "name": "report",
          "type": "json"
        }
      ],
      "domains": [
        {
          "name": "Safety_and_Emergencies",
          "url": "http://www.surf.scss.tcd.ie/cityOntology/#Safety_and_Emergencies"
        }
      ],
      "state": 1,
      "steps": [
        {
          "outputs": [
            {
              "name": "placeVideo",
              "type": "streaming"
            }
          ],
          "inputs": [
            {
              "name": "gunshotAlert",
              "type": "alert"
            },
            {
              "name": "zoneIntrusionAlert",
              "type": "alert"
            },
            {
              "name": "report",
              "type": "json"
            }
          ],
          "type": "SequentialStep",
          "steps": [
            {
              "outputs": [
                {
                  "name": "placeVideo",
                  "type": "streaming"
                }
              ],
              "inputs": [
                {
                  "name": "place",
                  "type": "json"
                }
              ],
              "serviceDescription": {
                "outputs": [
                  {
                    "name": "placeVideo",
                    "type": "streaming"
                  }
                ],
                "provider": {
                  "type": "wsdn"
                },
                "inputs": [
                  {
                    "name": "place",
                    "type": "json"
                  }
                ],
                "name": "city_video_camera",
                "description": "This is the service city_video_camera",
                "domains": [
                  {
                    "name": "Safety_and_Emergencies",
                    "url": "http://www.surf.scss.tcd.ie/cityOntology/#Safety_and_Emergencies"
                  }
                ],
                "id": "26/city_video_camera",
                "state": true,
                "url": "http://surf.scss.tcd.ie/_provider_/city_video_camera"
              },
              "type": "SimpleStep",
              "order": 0
            },
            {
              "outputs": [
                {
                  "name": "place",
                  "type": "json"
                }
              ],
              "inputs": [
                {
                  "name": "gunshotAlert",
                  "type": "alert"
                },
                {
                  "name": "zoneIntrusionAlert",
                  "type": "alert"
                },
                {
                  "name": "report",
                  "type": "json"
                }
              ],
              "serviceDescription": {
                "outputs": [
                  {
                    "name": "place",
                    "type": "json"
                  }
                ],
                "provider": {
                  "type": "ws"
                },
                "inputs": [
                  {
                    "name": "gunshotAlert",
                    "type": "alert"
                  },
                  {
                    "name": "zoneIntrusionAlert",
                    "type": "alert"
                  },
                  {
                    "name": "report",
                    "type": "json"
                  }
                ],
                "name": "street_anomaly_detection",
                "description": "This is the service street_anomaly_detection",
                "domains": [
                  {
                    "name": "Safety_and_Emergencies",
                    "url": "http://www.surf.scss.tcd.ie/cityOntology/#Safety_and_Emergencies"
                  }
                ],
                "id": "25/street_anomaly_detection",
                "state": true,
                "url": "http://surf.scss.tcd.ie/_provider_/street_anomaly_detection"
              },
              "type": "SimpleStep",
              "order": 1
            }
          ],
          "order": 0
        }
      ]
    }
  ]
}