{
  "outputs": [
    {
      "name": "_taxedprice",
      "type": "string",
      "desc": "Output of service car price service"
    },
    {
      "name": "_price",
      "type": "string",
      "desc": "Output of service car price service"
    }
  ],
  "provider": "",
  "inputs": [
    {
      "name": "_car",
      "type": "string",
      "desc": "Input of service car price service"
    }
  ],
  "latitude": 0.0,
  "name": "car price service",
  "description": "This service return not only price of a car, but alsotell how much tax its price includes.",
  "domains": [
    {
      "name": "retail",
      "uri": "http://www.disit.org/km4city/schema#Retail"
    }
  ],
  "id": "retail/car_taxedpriceprice_service",
  "state": true,
  "type": "asp",
  "url": "http://surf.scss.tcd.ie/_provider_/retail/car_taxedpriceprice_service",
  "longitude": 0.0
}