{
  "outputs": [
    {
      "name": "place",
      "type": "json"
    }
  ],
  "provider": {
    "type": "ws"
  },
  "inputs": [
    {
      "name": "gunshotAlert",
      "type": "alert"
    },
    {
      "name": "zoneIntrusionAlert",
      "type": "alert"
    },
    {
      "name": "report",
      "type": "json"
    }
  ],
  "name": "street_anomaly_detection",
  "description": "This is the service street_anomaly_detection",
  "domains": [
    {
      "name": "Safety_and_Emergencies",
      "url": "http://www.surf.scss.tcd.ie/cityOntology/#Safety_and_Emergencies"
    }
  ],
  "id": "25/street_anomaly_detection",
  "state": true,
  "url": "http://surf.scss.tcd.ie/_provider_/street_anomaly_detection"
}