{
  "outputs": [
    {
      "name": "_recommendedprice",
      "type": "string",
      "desc": "Output of service AuthorisedPersonMonographPriceService"
    }
  ],
  "provider": {
    "type": "webservice"
  },
  "inputs": [
    {
      "name": "_creditcardaccount",
      "type": "string",
      "desc": "Input of service AuthorisedPersonMonographPriceService"
    },
    {
      "name": "_monograph",
      "type": "string",
      "desc": "Input of service AuthorisedPersonMonographPriceService"
    },
    {
      "name": "_person",
      "type": "string",
      "desc": "Input of service AuthorisedPersonMonographPriceService"
    }
  ],
  "name": "AuthorisedPersonMonographPriceService",
  "description": "This service varify account of an authorised person andreturns recommended price of a monograph.",
  "domains": [
    {
      "name": "Logistic",
      "url": "http://www.surf.scss.tcd.ie/cityOntology/#Logistic"
    }
  ],
  "id": "retail/personmonographcreditcardaccount_recommendedprice_service",
  "state": true,
  "url": "http://surf.scss.tcd.ie/_provider_/retail/personmonographcreditcardaccount_recommendedprice_service"
}