{
  "outputs": [
    {
      "name": "_weatherfront",
      "type": "string",
      "desc": "Output of service GRWF Service"
    }
  ],
  "provider": {
    "type": "asp"
  },
  "inputs": [
    {
      "name": "_geographical-region",
      "type": "string",
      "desc": "Input of service GRWF Service"
    }
  ],
  "name": "GRWF Service",
  "description": "GRWF service is used to get weatherfront of a particular geogrphical region.",
  "domains": [
    {
      "name": "Furniture_and_Housing",
      "url": "http://www.surf.scss.tcd.ie/cityOntology/#Furniture_and_Housing"
    }
  ],
  "id": "environmental/geographical-region_weatherfront_service",
  "state": true,
  "url": "http://surf.scss.tcd.ie/_provider_/environmental/geographical-region_weatherfront_service"
}