{
  "outputs": [
    {
      "name": "_diet",
      "type": "string",
      "desc": "Output of service MerkelD Service"
    },
    {
      "name": "_price",
      "type": "string",
      "desc": "Output of service MerkelD Service"
    }
  ],
  "provider": "",
  "inputs": [
    {
      "name": "_preparedfood",
      "type": "string",
      "desc": "Input of service MerkelD Service"
    }
  ],
  "latitude": 0.0,
  "name": "MerkelD Service",
  "description": "MerkelD is a german firm and presents a service that returns not only price of a givenpreparedfood, but also informs the usage of the food in certain type of diet.",
  "domains": [
    {
      "name": "retail",
      "uri": "http://www.disit.org/km4city/schema#Retail"
    }
  ],
  "id": "retail/preparedfood_dietprice_service",
  "state": true,
  "type": "asp",
  "url": "http://surf.scss.tcd.ie/_provider_/retail/preparedfood_dietprice_service",
  "longitude": 0.0
}