{
  "outputs": [
    {
      "name": "_price",
      "type": "string",
      "desc": "Output of service BreakFastPriceService"
    }
  ],
  "provider": {
    "type": "asp"
  },
  "inputs": [
    {
      "name": "_sandwich",
      "type": "string",
      "desc": "Input of service BreakFastPriceService"
    },
    {
      "name": "_coffee",
      "type": "string",
      "desc": "Input of service BreakFastPriceService"
    }
  ],
  "name": "BreakFastPriceService",
  "description": "This service provides the price of breakfast, specific coffee and Sadwich.",
  "domains": [
    {
      "name": "Marketing",
      "url": "http://www.surf.scss.tcd.ie/cityOntology/#Marketing"
    }
  ],
  "id": "retail/coffeesandwich_price_service",
  "state": true,
  "url": "http://surf.scss.tcd.ie/_provider_/retail/coffeesandwich_price_service"
}