{
  "outputs": [
    {
      "name": "_intentionalpsychologicalprocess",
      "type": "string",
      "desc": "Output of service Historical IPP service"
    },
    {
      "name": "_summary",
      "type": "string",
      "desc": "Output of service Historical IPP service"
    }
  ],
  "provider": {
    "type": "asp"
  },
  "inputs": [
    {
      "name": "_hospital",
      "type": "string",
      "desc": "Input of service Historical IPP service"
    }
  ],
  "name": "Historical IPP service",
  "description": "IPP service returns intentional psychological process offered in a given hospital.The summary of the output is also obtained, in concise words the intentional psychological processan intentional process that can be realized entirely within the mind or brain of an Organism.",
  "domains": [
    {
      "name": "Tools",
      "url": "http://www.surf.scss.tcd.ie/cityOntology/#Tools"
    }
  ],
  "id": "health/hospital_intentionalpsychologicalprocesssummary_service",
  "state": true,
  "url": "http://surf.scss.tcd.ie/_provider_/health/hospital_intentionalpsychologicalprocesssummary_service"
}