{
  "outputs": [
    {
      "name": "_author",
      "type": "string",
      "desc": "Output of service Novel Author Price Service"
    },
    {
      "name": "_price",
      "type": "string",
      "desc": "Output of service Novel Author Price Service"
    }
  ],
  "provider": {
    "type": "wsdn"
  },
  "inputs": [
    {
      "name": "_novel",
      "type": "string",
      "desc": "Input of service Novel Author Price Service"
    }
  ],
  "name": "Novel Author Price Service",
  "description": "This service returns author and price of a given novel.",
  "domains": [
    {
      "name": "Social_Security",
      "url": "http://www.surf.scss.tcd.ie/cityOntology/#Social_Security"
    }
  ],
  "id": "retail/novel_authorprice_service",
  "state": true,
  "url": "http://surf.scss.tcd.ie/_provider_/retail/novel_authorprice_service"
}