{
  "outputs": [
    {
      "name": "eventVisualisation",
      "type": "interactive"
    }
  ],
  "qos": [],
  "inputs": [
    {
      "name": "buildingId",
      "type": "long"
    }
  ],
  "domains": [
    {
      "name": "Buildings",
      "url": "http://www.surf.scss.tcd.ie/cityOntology/#Buildings"
    },
    {
      "name": "Sport",
      "url": "http://www.surf.scss.tcd.ie/cityOntology/#Sport"
    }
  ],
  "location": {}
}