{
  "outputs": [
    {
      "name": "studentsInfo",
      "type": "json"
    }
  ],
  "qos": [],
  "inputs": [
    {
      "name": "zone",
      "type": "json"
    }
  ],
  "domains": [
    {
      "name": "Nature",
      "url": "http://www.surf.scss.tcd.ie/cityOntology/#Nature"
    },
    {
      "name": "Educational",
      "url": "http://www.surf.scss.tcd.ie/cityOntology/#Educational"
    }
  ],
  "location": {}
}