{
  "outputs": [
    {
      "name": "_taxedfreeprice",
      "type": "string",
      "desc": "Output of service AuthorisedPersonBookPrice"
    }
  ],
  "provider": {
    "type": "webservice"
  },
  "inputs": [
    {
      "name": "_creditcardaccount",
      "type": "string",
      "desc": "Input of service AuthorisedPersonBookPrice"
    },
    {
      "name": "_book",
      "type": "string",
      "desc": "Input of service AuthorisedPersonBookPrice"
    },
    {
      "name": "_person",
      "type": "string",
      "desc": "Input of service AuthorisedPersonBookPrice"
    }
  ],
  "name": "AuthorisedPersonBookPrice",
  "description": "This service varify account of an authorised person andreturns tax free price of the book.",
  "domains": [
    {
      "name": "Touristic_Place",
      "url": "http://www.surf.scss.tcd.ie/cityOntology/#Touristic_Place"
    }
  ],
  "id": "retail/personbookcreditcardaccount_taxedfreeprice_service",
  "state": true,
  "url": "http://surf.scss.tcd.ie/_provider_/retail/personbookcreditcardaccount_taxedfreeprice_service"
}