{
  "outputs": [
    {
      "name": "callTaxi",
      "type": "call"
    }
  ],
  "qos": [],
  "inputs": [
    {
      "name": "riverConfig",
      "type": "json"
    }
  ],
  "domains": [
    {
      "name": "Nature",
      "url": "http://www.surf.scss.tcd.ie/cityOntology/#Nature"
    },
    {
      "name": "Transport_and_Mobility",
      "url": "http://www.surf.scss.tcd.ie/cityOntology/#Transport_and_Mobility"
    }
  ],
  "location": {}
}