{
  "outputs": [
    {
      "name": "_price",
      "type": "string",
      "desc": "Output of service 2personbicycle4wheeledcar_price_service"
    }
  ],
  "provider": {
    "type": "webservice"
  },
  "inputs": [
    {
      "name": "_4wheeledcar",
      "type": "string",
      "desc": "Input of service 2personbicycle4wheeledcar_price_service"
    },
    {
      "name": "_2personbicycle",
      "type": "string",
      "desc": "Input of service 2personbicycle4wheeledcar_price_service"
    }
  ],
  "name": "2personbicycle4wheeledcar_price_service",
  "description": "This service is about retail",
  "domains": [
    {
      "name": "Living",
      "url": "http://www.surf.scss.tcd.ie/cityOntology/#Living"
    }
  ],
  "id": "retail/2personbicycle4wheeledcar_price_service",
  "state": true,
  "url": "http://surf.scss.tcd.ie/_provider_/retail/2personbicycle4wheeledcar_price_service"
}