{
  "outputs": [
    {
      "name": "_familydestination",
      "type": "string",
      "desc": "Output of service Activity FamilyDestination Service"
    }
  ],
  "provider": {
    "type": "asp"
  },
  "inputs": [
    {
      "name": "_activity",
      "type": "string",
      "desc": "Input of service Activity FamilyDestination Service"
    }
  ],
  "name": "Activity FamilyDestination Service",
  "description": "This service returns familydestination for a given activity.",
  "domains": [
    {
      "name": "Beauty_Products",
      "url": "http://www.surf.scss.tcd.ie/cityOntology/#Beauty_Products"
    }
  ],
  "id": "tourism/activity_familydestination_service",
  "state": true,
  "url": "http://surf.scss.tcd.ie/_provider_/tourism/activity_familydestination_service"
}