{
  "outputs": [
    {
      "name": "cityZoneToMonitor",
      "type": "json"
    }
  ],
  "provider": {
    "type": "ws"
  },
  "inputs": [
    {
      "name": "streetSurveillanceParameters",
      "type": "json"
    }
  ],
  "name": "street_surveillance_configurator",
  "description": "This is the service street_surveillance_configurator",
  "domains": [
    {
      "name": "Safety_and_Emergencies",
      "url": "http://www.surf.scss.tcd.ie/cityOntology/#Safety_and_Emergencies"
    }
  ],
  "id": "21/street_surveillance_configurator",
  "state": true,
  "url": "http://surf.scss.tcd.ie/_provider_/street_surveillance_configurator"
}