{
  "outputs": [
    {
      "name": "_price",
      "type": "string",
      "desc": "Output of service Cheapest Book Service"
    }
  ],
  "provider": {
    "type": "asp"
  },
  "inputs": [
    {
      "name": "_book",
      "type": "string",
      "desc": "Input of service Cheapest Book Service"
    }
  ],
  "name": "Cheapest Book Service",
  "description": "A Service that searchest the cheapest Price for a book",
  "domains": [
    {
      "name": "Transport_and_Mobility",
      "url": "http://www.surf.scss.tcd.ie/cityOntology/#Transport_and_Mobility"
    }
  ],
  "id": "retail/book_price_service",
  "state": true,
  "url": "http://surf.scss.tcd.ie/_provider_/retail/book_price_service"
}