{
  "outputs": [
    {
      "name": "productsStatus",
      "type": "json"
    }
  ],
  "provider": {
    "type": "wsdn"
  },
  "inputs": [
    {
      "name": "inventoryConfig",
      "type": "json"
    }
  ],
  "name": "products_monitoring",
  "description": "This is the service products_monitoring",
  "domains": [
    {
      "name": "Clothing",
      "url": "http://www.surf.scss.tcd.ie/cityOntology/#Clothing"
    }
  ],
  "id": "72/products_monitoring",
  "state": true,
  "url": "http://surf.scss.tcd.ie/_provider_/products_monitoring"
}