{
  "outputs": [
    {
      "name": "_ruralarea",
      "type": "string",
      "desc": "Output of service Hiking RuralArea Service"
    }
  ],
  "provider": {
    "type": "asp"
  },
  "inputs": [
    {
      "name": "_hiking",
      "type": "string",
      "desc": "Input of service Hiking RuralArea Service"
    }
  ],
  "name": "Hiking RuralArea Service",
  "description": "This service returns ruralarea for hiking.",
  "domains": [
    {
      "name": "Arts",
      "url": "http://www.surf.scss.tcd.ie/cityOntology/#Arts"
    }
  ],
  "id": "tourism/hiking_ruralarea_service",
  "state": true,
  "url": "http://surf.scss.tcd.ie/_provider_/tourism/hiking_ruralarea_service"
}