{
  "outputs": [
    {
      "name": "suggestedActivities",
      "type": "json"
    }
  ],
  "provider": {
    "type": "ws"
  },
  "inputs": [
    {
      "name": "activityInfo",
      "type": "xml"
    }
  ],
  "name": "recommended_activities",
  "description": "This is the service recommended_activities",
  "domains": [
    {
      "name": "Activity",
      "url": "http://www.surf.scss.tcd.ie/cityOntology/#Activity"
    }
  ],
  "id": "76/recommended_activities",
  "state": true,
  "url": "http://surf.scss.tcd.ie/_provider_/recommended_activities"
}