{
  "outputs": [
    {
      "name": "touristicPlan",
      "type": "interactive"
    }
  ],
  "qos": [],
  "inputs": [
    {
      "name": "binId",
      "type": "long"
    }
  ],
  "domains": [
    {
      "name": "Waste",
      "url": "http://www.surf.scss.tcd.ie/cityOntology/#Waste"
    },
    {
      "name": "Activity",
      "url": "http://www.surf.scss.tcd.ie/cityOntology/#Activity"
    }
  ],
  "location": {}
}