{
  "outputs": [
    {
      "name": "_price",
      "type": "string",
      "desc": "Output of service SFNovelPrice Service"
    }
  ],
  "provider": {
    "type": "wsdn"
  },
  "inputs": [
    {
      "name": "_science-fiction-novel",
      "type": "string",
      "desc": "Input of service SFNovelPrice Service"
    },
    {
      "name": "_user",
      "type": "string",
      "desc": "Input of service SFNovelPrice Service"
    }
  ],
  "name": "SFNovelPrice Service",
  "description": "This service informs a certain user  price of a given science-fiction novel.",
  "domains": [
    {
      "name": "Medicines",
      "url": "http://www.surf.scss.tcd.ie/cityOntology/#Medicines"
    }
  ],
  "id": "retail/userscience-fiction-novel_price_service",
  "state": true,
  "url": "http://surf.scss.tcd.ie/_provider_/retail/userscience-fiction-novel_price_service"
}