{
  "outputs": [
    {
      "name": "_monograph",
      "type": "string",
      "desc": "Output of service author_monographtaxedprice_service"
    },
    {
      "name": "_taxedprice",
      "type": "string",
      "desc": "Output of service author_monographtaxedprice_service"
    }
  ],
  "provider": {
    "type": "wsdn"
  },
  "inputs": [
    {
      "name": "_author",
      "type": "string",
      "desc": "Input of service author_monographtaxedprice_service"
    }
  ],
  "name": "author_monographtaxedprice_service",
  "description": "This service is about retail",
  "domains": [
    {
      "name": "Industry",
      "url": "http://www.surf.scss.tcd.ie/cityOntology/#Industry"
    }
  ],
  "id": "retail/author_monographtaxedprice_service",
  "state": true,
  "url": "http://surf.scss.tcd.ie/_provider_/retail/author_monographtaxedprice_service"
}