{
  "outputs": [
    {
      "name": "_monograph",
      "type": "string",
      "desc": "Output of service "
    },
    {
      "name": "_taxfreeprice",
      "type": "string",
      "desc": "Output of service "
    }
  ],
  "provider": "",
  "inputs": [
    {
      "name": "_author",
      "type": "string",
      "desc": "Input of service "
    }
  ],
  "latitude": 0.0,
  "name": "",
  "description": "",
  "domains": [
    {
      "name": "retail",
      "uri": "http://www.disit.org/km4city/schema#Retail"
    }
  ],
  "id": "retail/author_monographtaxfreeprice_service",
  "state": true,
  "type": "webservice",
  "url": "http://surf.scss.tcd.ie/_provider_/retail/author_monographtaxfreeprice_service",
  "longitude": 0.0
}