{
  "outputs": [
    {
      "name": "_price",
      "type": "string",
      "desc": "Output of service FastCar Price Report service"
    },
    {
      "name": "_report",
      "type": "string",
      "desc": "Output of service FastCar Price Report service"
    }
  ],
  "provider": "",
  "inputs": [
    {
      "name": "_fastcar",
      "type": "string",
      "desc": "Input of service FastCar Price Report service"
    }
  ],
  "latitude": 0.0,
  "name": "FastCar Price Report service",
  "description": "This service returns not only price of a fastcar, but also a short report about its recommendation.",
  "domains": [
    {
      "name": "retail",
      "uri": "http://www.disit.org/km4city/schema#Retail"
    }
  ],
  "id": "retail/fastcar_pricereport_service",
  "state": true,
  "type": "wsdn",
  "url": "http://surf.scss.tcd.ie/_provider_/retail/fastcar_pricereport_service",
  "longitude": 0.0
}