{
  "outputs": [
    {
      "name": "_book",
      "type": "string",
      "desc": "Output of service AcademicBookNumberOrISBNSearch"
    }
  ],
  "provider": {
    "type": "asp"
  },
  "inputs": [
    {
      "name": "_publication-number",
      "type": "string",
      "desc": "Input of service AcademicBookNumberOrISBNSearch"
    }
  ],
  "name": "AcademicBookNumberOrISBNSearch",
  "description": "Searches for a book if either the academic book number or the ISBN is avaible",
  "domains": [
    {
      "name": "Vehicle_Sale_and_Rent",
      "url": "http://www.surf.scss.tcd.ie/cityOntology/#Vehicle_Sale_and_Rent"
    }
  ],
  "id": "educational/publication-number_book_service",
  "state": true,
  "url": "http://surf.scss.tcd.ie/_provider_/educational/publication-number_book_service"
}