{
  "outputs": [
    {
      "name": "_summary",
      "type": "string",
      "desc": "Output of service HDP service"
    },
    {
      "name": "_diagnosticprocess",
      "type": "string",
      "desc": "Output of service HDP service"
    }
  ],
  "provider": "",
  "inputs": [
    {
      "name": "_hospital",
      "type": "string",
      "desc": "Input of service HDP service"
    }
  ],
  "latitude": 0.0,
  "name": "HDP service",
  "description": "HDP is a reknown service to get to know about a certain diagnostic system avaialbe in a certainhospital, this service returns also summary of the output system.",
  "domains": [
    {
      "name": "health",
      "uri": "http://www.disit.org/km4city/schema#Health"
    }
  ],
  "id": "health/hospital_summarydiagnosticprocess_service",
  "state": true,
  "type": "wsdn",
  "url": "http://surf.scss.tcd.ie/_provider_/health/hospital_summarydiagnosticprocess_service",
  "longitude": 0.0
}