{
  "plans": [
    {
      "outputs": [
        {
          "name": "studentContent",
          "type": "json"
        }
      ],
      "inputs": [
        {
          "name": "subjectsList",
          "type": "json"
        }
      ],
      "domains": [
        {
          "name": "Educational",
          "url": "http://www.surf.scss.tcd.ie/cityOntology/#Educational"
        }
      ],
      "state": 1,
      "steps": [
        {
          "outputs": [
            {
              "name": "studentContent",
              "type": "json"
            }
          ],
          "inputs": [
            {
              "name": "subjectsList",
              "type": "json"
            }
          ],
          "type": "SequentialStep",
          "steps": [
            {
              "outputs": [
                {
                  "name": "studentContent",
                  "type": "json"
                }
              ],
              "inputs": [
                {
                  "name": "studyPlan",
                  "type": "json"
                }
              ],
              "serviceDescription": {
                "outputs": [
                  {
                    "name": "studentContent",
                    "type": "json"
                  }
                ],
                "provider": {
                  "type": "asp"
                },
                "inputs": [
                  {
                    "name": "studyPlan",
                    "type": "json"
                  }
                ],
                "name": "course_content_delivery",
                "description": "This is the service course_content_delivery",
                "domains": [
                  {
                    "name": "Educational",
                    "url": "http://www.surf.scss.tcd.ie/cityOntology/#Educational"
                  }
                ],
                "id": "50/course_content_delivery",
                "state": true,
                "url": "http://surf.scss.tcd.ie/_provider_/course_content_delivery"
              },
              "type": "SimpleStep",
              "order": 0
            },
            {
              "outputs": [
                {
                  "name": "studyPlan",
                  "type": "json"
                }
              ],
              "inputs": [
                {
                  "name": "courseContent",
                  "type": "rar"
                }
              ],
              "serviceDescription": {
                "outputs": [
                  {
                    "name": "studyPlan",
                    "type": "json"
                  }
                ],
                "provider": {
                  "type": "ws"
                },
                "inputs": [
                  {
                    "name": "courseContent",
                    "type": "rar"
                  }
                ],
                "name": "personalised_study_plan",
                "description": "This is the service personalised_study_plan",
                "domains": [
                  {
                    "name": "Educational",
                    "url": "http://www.surf.scss.tcd.ie/cityOntology/#Educational"
                  }
                ],
                "id": "49/personalised_study_plan",
                "state": true,
                "url": "http://surf.scss.tcd.ie/_provider_/personalised_study_plan"
              },
              "type": "SimpleStep",
              "order": 1
            },
            {
              "outputs": [
                {
                  "name": "courseContent",
                  "type": "rar"
                }
              ],
              "inputs": [
                {
                  "name": "subjectsList",
                  "type": "json"
                }
              ],
              "serviceDescription": {
                "outputs": [
                  {
                    "name": "courseContent",
                    "type": "rar"
                  }
                ],
                "provider": {
                  "type": "ws"
                },
                "inputs": [
                  {
                    "name": "subjectsList",
                    "type": "json"
                  }
                ],
                "name": "learning_object_search",
                "description": "This is the service learning_object_search",
                "domains": [
                  {
                    "name": "Educational",
                    "url": "http://www.surf.scss.tcd.ie/cityOntology/#Educational"
                  }
                ],
                "id": "48/learning_object_search",
                "state": true,
                "url": "http://surf.scss.tcd.ie/_provider_/learning_object_search"
              },
              "type": "SimpleStep",
              "order": 2
            }
          ],
          "order": 0
        }
      ]
    }
  ]
}