{
  "outputs": [
    {
      "name": "accommodationList",
      "type": "xml"
    }
  ],
  "qos": [],
  "inputs": [
    {
      "name": "prisionerInfo",
      "type": "json"
    },
    {
      "name": "prisionVideo",
      "type": "video"
    }
  ],
  "domains": [
    {
      "name": "Safety_and_Emergencies",
      "url": "http://www.surf.scss.tcd.ie/cityOntology/#Safety_and_Emergencies"
    },
    {
      "name": "Accommodation",
      "url": "http://www.surf.scss.tcd.ie/cityOntology/#Accommodation"
    }
  ],
  "location": {}
}