{
  "outputs": [
    {
      "name": "paymentInfo",
      "type": "xml"
    }
  ],
  "qos": [],
  "inputs": [
    {
      "name": "gridId",
      "type": "long"
    }
  ],
  "domains": [
    {
      "name": "Energy",
      "url": "http://www.surf.scss.tcd.ie/cityOntology/#Energy"
    },
    {
      "name": "Food_and_Drinks",
      "url": "http://www.surf.scss.tcd.ie/cityOntology/#Food_and_Drinks"
    },
    {
      "name": "Clothing",
      "url": "http://www.surf.scss.tcd.ie/cityOntology/#Clothing"
    },
    {
      "name": "Sport",
      "url": "http://www.surf.scss.tcd.ie/cityOntology/#Sport"
    },
    {
      "name": "Tools",
      "url": "http://www.surf.scss.tcd.ie/cityOntology/#Tools"
    },
    {
      "name": "Furniture_and_Housing",
      "url": "http://www.surf.scss.tcd.ie/cityOntology/#Furniture_and_Housing"
    },
    {
      "name": "Technology",
      "url": "http://www.surf.scss.tcd.ie/cityOntology/#Technology"
    }
  ],
  "location": {}
}