{
  "plans": [
    {
      "outputs": [
        {
          "name": "floodingInfo",
          "type": "json"
        }
      ],
      "inputs": [
        {
          "name": "routeParameters",
          "type": "json"
        }
      ],
      "domains": [
        {
          "name": "Transport_and_Mobility",
          "url": "http://www.surf.scss.tcd.ie/cityOntology/#Transport_and_Mobility"
        }
      ],
      "state": 1,
      "steps": [
        {
          "outputs": [
            {
              "name": "floodingInfo",
              "type": "json"
            }
          ],
          "inputs": [
            {
              "name": "routeParameters",
              "type": "json"
            }
          ],
          "serviceDescription": {
            "outputs": [
              {
                "name": "floodingInfo",
                "type": "json"
              }
            ],
            "provider": {
              "type": "wsdn"
            },
            "inputs": [
              {
                "name": "routeParameters",
                "type": "json"
              }
            ],
            "name": "route_water_level",
            "description": "This is the service route_water_level",
            "domains": [
              {
                "name": "Transport_and_Mobility",
                "url": "http://www.surf.scss.tcd.ie/cityOntology/#Transport_and_Mobility"
              }
            ],
            "id": "6/route_water_level",
            "state": true,
            "url": "http://surf.scss.tcd.ie/_provider_/route_water_level"
          },
          "type": "SimpleStep",
          "order": 0
        }
      ]
    }
  ]
}