{
  "outputs": [
    {
      "name": "_year",
      "type": "string",
      "desc": "Output of service Car Year Price Service"
    },
    {
      "name": "_price",
      "type": "string",
      "desc": "Output of service Car Year Price Service"
    }
  ],
  "provider": {
    "type": "asp"
  },
  "inputs": [
    {
      "name": "_car",
      "type": "string",
      "desc": "Input of service Car Year Price Service"
    }
  ],
  "name": "Car Year Price Service",
  "description": "This service provides the and model year of a given car.",
  "domains": [
    {
      "name": "Sports_Equipment",
      "url": "http://www.surf.scss.tcd.ie/cityOntology/#Sports_Equipment"
    }
  ],
  "id": "retail/car_yearprice_service",
  "state": true,
  "url": "http://surf.scss.tcd.ie/_provider_/retail/car_yearprice_service"
}