{
  "plans": [
    {
      "outputs": [
        {
          "name": "touristicPath",
          "type": "json"
        }
      ],
      "inputs": [
        {
          "name": "activityInfo",
          "type": "xml"
        }
      ],
      "domains": [
        {
          "name": "Activity",
          "url": "http://www.surf.scss.tcd.ie/cityOntology/#Activity"
        }
      ],
      "state": 1,
      "steps": [
        {
          "outputs": [
            {
              "name": "touristicPath",
              "type": "json"
            }
          ],
          "inputs": [
            {
              "name": "activityInfo",
              "type": "xml"
            }
          ],
          "serviceDescription": {
            "outputs": [
              {
                "name": "touristicPath",
                "type": "json"
              }
            ],
            "provider": {
              "type": "ws"
            },
            "inputs": [
              {
                "name": "activityInfo",
                "type": "xml"
              }
            ],
            "name": "touristic_path_calculator",
            "description": "This is the service touristic_path_calculator",
            "domains": [
              {
                "name": "Activity",
                "url": "http://www.surf.scss.tcd.ie/cityOntology/#Activity"
              }
            ],
            "id": "75/touristic_path_calculator",
            "state": true,
            "url": "http://surf.scss.tcd.ie/_provider_/touristic_path_calculator"
          },
          "type": "SimpleStep",
          "order": 0
        }
      ]
    }
  ]
}