{
  "outputs": [
    {
      "name": "_ruralarea",
      "type": "string",
      "desc": "Output of service SportsRuralAreaService"
    }
  ],
  "provider": "",
  "inputs": [
    {
      "name": "_sports",
      "type": "string",
      "desc": "Input of service SportsRuralAreaService"
    }
  ],
  "latitude": 0.0,
  "name": "SportsRuralAreaService",
  "description": "This is a nice service to know aboutthe rural area where you can the sports especially hiking and surfing.",
  "domains": [],
  "id": "tourism/sports_ruralarea_service",
  "state": true,
  "type": "asp",
  "url": "http://surf.scss.tcd.ie/_provider_/tourism/sports_ruralarea_service",
  "longitude": 0.0
}