{
  "outputs": [
    {
      "name": "zoneInfo",
      "type": "json"
    }
  ],
  "provider": {
    "type": "asp"
  },
  "inputs": [
    {
      "name": "zoneToMonitor",
      "type": "json"
    }
  ],
  "name": "crowd_areas",
  "description": "This is the service crowd_areas",
  "domains": [
    {
      "name": "Transport_and_Mobility",
      "url": "http://www.surf.scss.tcd.ie/cityOntology/#Transport_and_Mobility"
    }
  ],
  "id": "104/crowd_areas",
  "state": true,
  "url": "http://surf.scss.tcd.ie/_provider_/crowd_areas"
}