{
  "outputs": [
    {
      "name": "bookedRoom",
      "type": "xml"
    }
  ],
  "qos": [],
  "inputs": [
    {
      "name": "productData",
      "type": "xml"
    }
  ],
  "domains": [
    {
      "name": "Tools",
      "url": "http://www.surf.scss.tcd.ie/cityOntology/#Tools"
    },
    {
      "name": "Educational",
      "url": "http://www.surf.scss.tcd.ie/cityOntology/#Educational"
    }
  ],
  "location": {}
}