{
  "outputs": [
    {
      "name": "_price",
      "type": "string",
      "desc": "Output of service AuthorisedPersonPrintedMaterialPriceService"
    }
  ],
  "provider": {
    "type": "asp"
  },
  "inputs": [
    {
      "name": "_person",
      "type": "string",
      "desc": "Input of service AuthorisedPersonPrintedMaterialPriceService"
    },
    {
      "name": "_printedmaterial",
      "type": "string",
      "desc": "Input of service AuthorisedPersonPrintedMaterialPriceService"
    },
    {
      "name": "_creditcardaccount",
      "type": "string",
      "desc": "Input of service AuthorisedPersonPrintedMaterialPriceService"
    }
  ],
  "name": "AuthorisedPersonPrintedMaterialPriceService",
  "description": "This service varify account of an authorised person andreturns recommended price of a printed materail.",
  "domains": [
    {
      "name": "Educational",
      "url": "http://www.surf.scss.tcd.ie/cityOntology/#Educational"
    }
  ],
  "id": "retail/creditcardaccountprintedmaterialperson_price_service",
  "state": true,
  "url": "http://surf.scss.tcd.ie/_provider_/retail/creditcardaccountprintedmaterialperson_price_service"
}