{
  "plans": [
    {
      "outputs": [
        {
          "name": "parentNotification",
          "type": "mail"
        }
      ],
      "inputs": [
        {
          "name": "studentsInfo",
          "type": "json"
        },
        {
          "name": "studentsInfo",
          "type": "json"
        }
      ],
      "domains": [
        {
          "name": "Educational",
          "url": "http://www.surf.scss.tcd.ie/cityOntology/#Educational"
        },
        {
          "name": "Educational",
          "url": "http://www.surf.scss.tcd.ie/cityOntology/#Educational"
        }
      ],
      "state": 1,
      "steps": [
        {
          "outputs": [
            {
              "name": "parentNotification",
              "type": "mail"
            }
          ],
          "inputs": [
            {
              "name": "studentActivityInfo",
              "type": "json"
            },
            {
              "name": "attendanceInfo",
              "type": "json"
            }
          ],
          "type": "SequentialStep",
          "steps": [
            {
              "outputs": [
                {
                  "name": "parentNotification",
                  "type": "mail"
                }
              ],
              "inputs": [
                {
                  "name": "studentActivityInfo",
                  "type": "json"
                },
                {
                  "name": "attendanceInfo",
                  "type": "json"
                }
              ],
              "serviceDescription": {
                "outputs": [
                  {
                    "name": "parentNotification",
                    "type": "mail"
                  }
                ],
                "provider": {
                  "type": "ws"
                },
                "inputs": [
                  {
                    "name": "studentActivityInfo",
                    "type": "json"
                  },
                  {
                    "name": "attendanceInfo",
                    "type": "json"
                  }
                ],
                "name": "parent_notification",
                "description": "This is the service parent_notification",
                "domains": [
                  {
                    "name": "Educational",
                    "url": "http://www.surf.scss.tcd.ie/cityOntology/#Educational"
                  }
                ],
                "id": "54/parent_notification",
                "state": true,
                "url": "http://surf.scss.tcd.ie/_provider_/parent_notification"
              },
              "type": "SimpleStep",
              "order": 0
            }
          ],
          "order": 0
        },
        {
          "outputs": [
            {
              "name": "attendanceInfo",
              "type": "json"
            }
          ],
          "inputs": [
            {
              "name": "studentsInfo",
              "type": "json"
            },
            {
              "name": "studentsInfo",
              "type": "json"
            }
          ],
          "type": "ParallelStep",
          "steps": [
            {
              "outputs": [
                {
                  "name": "attendanceInfo",
                  "type": "json"
                }
              ],
              "inputs": [
                {
                  "name": "studentsInfo",
                  "type": "json"
                }
              ],
              "type": "SequentialStep",
              "steps": [
                {
                  "outputs": [
                    {
                      "name": "attendanceInfo",
                      "type": "json"
                    }
                  ],
                  "inputs": [
                    {
                      "name": "studentsInfo",
                      "type": "json"
                    }
                  ],
                  "serviceDescription": {
                    "outputs": [
                      {
                        "name": "attendanceInfo",
                        "type": "json"
                      }
                    ],
                    "provider": {
                      "type": "wsdn"
                    },
                    "inputs": [
                      {
                        "name": "studentsInfo",
                        "type": "json"
                      }
                    ],
                    "name": "attendance_control",
                    "description": "This is the service attendance_control",
                    "domains": [
                      {
                        "name": "Educational",
                        "url": "http://www.surf.scss.tcd.ie/cityOntology/#Educational"
                      }
                    ],
                    "id": "52/attendance_control",
                    "state": true,
                    "url": "http://surf.scss.tcd.ie/_provider_/attendance_control"
                  },
                  "type": "SimpleStep",
                  "order": 0
                }
              ],
              "order": 0
            },
            {
              "outputs": [
                {
                  "name": "studentActivityInfo",
                  "type": "json"
                }
              ],
              "inputs": [
                {
                  "name": "studentsInfo",
                  "type": "json"
                }
              ],
              "type": "SequentialStep",
              "steps": [
                {
                  "outputs": [
                    {
                      "name": "studentActivityInfo",
                      "type": "json"
                    }
                  ],
                  "inputs": [
                    {
                      "name": "studentsInfo",
                      "type": "json"
                    }
                  ],
                  "serviceDescription": {
                    "outputs": [
                      {
                        "name": "studentActivityInfo",
                        "type": "json"
                      }
                    ],
                    "provider": {
                      "type": "asp"
                    },
                    "inputs": [
                      {
                        "name": "studentsInfo",
                        "type": "json"
                      }
                    ],
                    "name": "student_activity_monitoring",
                    "description": "This is the service student_activity_monitoring",
                    "domains": [
                      {
                        "name": "Educational",
                        "url": "http://www.surf.scss.tcd.ie/cityOntology/#Educational"
                      }
                    ],
                    "id": "53/student_activity_monitoring",
                    "state": true,
                    "url": "http://surf.scss.tcd.ie/_provider_/student_activity_monitoring"
                  },
                  "type": "SimpleStep",
                  "order": 0
                }
              ],
              "order": 0
            }
          ],
          "order": 1
        }
      ]
    }
  ]
}