{
  "outputs": [
    {
      "name": "zoneIntrusionAlert",
      "type": "alert"
    }
  ],
  "qos": [],
  "inputs": [
    {
      "name": "courseContent",
      "type": "rar"
    }
  ],
  "domains": [
    {
      "name": "Educational",
      "url": "http://www.surf.scss.tcd.ie/cityOntology/#Educational"
    },
    {
      "name": "Safety_and_Emergencies",
      "url": "http://www.surf.scss.tcd.ie/cityOntology/#Safety_and_Emergencies"
    }
  ],
  "location": {}
}