{
  "outputs": [
    {
      "name": "_ruralarea",
      "type": "string",
      "desc": "Output of service Activity RuralArea Service"
    }
  ],
  "provider": {
    "type": "asp"
  },
  "inputs": [
    {
      "name": "_activity",
      "type": "string",
      "desc": "Input of service Activity RuralArea Service"
    }
  ],
  "name": "Activity RuralArea Service",
  "description": "This service returns ruralarea for a given activity.",
  "domains": [
    {
      "name": "Sports_Equipment",
      "url": "http://www.surf.scss.tcd.ie/cityOntology/#Sports_Equipment"
    }
  ],
  "id": "tourism/activity_ruralarea_service",
  "state": true,
  "url": "http://surf.scss.tcd.ie/_provider_/tourism/activity_ruralarea_service"
}