{
  "outputs": [
    {
      "name": "similarResults",
      "type": "json"
    }
  ],
  "qos": [],
  "inputs": [
    {
      "name": "gridReport",
      "type": "json"
    }
  ],
  "domains": [
    {
      "name": "Energy",
      "url": "http://www.surf.scss.tcd.ie/cityOntology/#Energy"
    },
    {
      "name": "Sport",
      "url": "http://www.surf.scss.tcd.ie/cityOntology/#Sport"
    }
  ],
  "location": {}
}