{
  "outputs": [
    {
      "name": "historicPlaceInfo",
      "type": "xml"
    }
  ],
  "qos": [],
  "inputs": [
    {
      "name": "gridReport",
      "type": "json"
    }
  ],
  "domains": [
    {
      "name": "Energy",
      "url": "http://www.surf.scss.tcd.ie/cityOntology/#Energy"
    },
    {
      "name": "Touristic_Place",
      "url": "http://www.surf.scss.tcd.ie/cityOntology/#Touristic_Place"
    },
    {
      "name": "History",
      "url": "http://www.surf.scss.tcd.ie/cityOntology/#History"
    }
  ],
  "location": {}
}