{
  "outputs": [
    {
      "name": "augmentedRealityResourcePresentation",
      "type": "multimedia"
    }
  ],
  "provider": {
    "type": "asp"
  },
  "inputs": [
    {
      "name": "augmentedRealityResource",
      "type": "xml"
    }
  ],
  "name": "present_augmented_reality_resource",
  "description": "This is the service present_augmented_reality_resource",
  "domains": [
    {
      "name": "Educational",
      "url": "http://www.surf.scss.tcd.ie/cityOntology/#Educational"
    }
  ],
  "id": "62/present_augmented_reality_resource",
  "state": true,
  "url": "http://surf.scss.tcd.ie/_provider_/present_augmented_reality_resource"
}