{
  "outputs": [
    {
      "name": "_recommendedpriceineuro",
      "type": "string",
      "desc": "Output of service car Recommended price service"
    }
  ],
  "provider": "",
  "inputs": [
    {
      "name": "_car",
      "type": "string",
      "desc": "Input of service car Recommended price service"
    }
  ],
  "latitude": 0.0,
  "name": "car Recommended price service",
  "description": "you can acquire recommended price in Euro for a car.",
  "domains": [
    {
      "name": "retail",
      "uri": "http://www.disit.org/km4city/schema#Retail"
    }
  ],
  "id": "retail/car_recommendedpriceineuro_service",
  "state": true,
  "type": "wsdn",
  "url": "http://surf.scss.tcd.ie/_provider_/retail/car_recommendedpriceineuro_service",
  "longitude": 0.0
}