{
  "outputs": [
    {
      "name": "_hotel",
      "type": "string",
      "desc": "Output of service CapitalCityCountaryHotelInfoService"
    }
  ],
  "provider": "",
  "inputs": [
    {
      "name": "_capital-city",
      "type": "string",
      "desc": "Input of service CapitalCityCountaryHotelInfoService"
    },
    {
      "name": "_country",
      "type": "string",
      "desc": "Input of service CapitalCityCountaryHotelInfoService"
    }
  ],
  "latitude": 0.0,
  "name": "CapitalCityCountaryHotelInfoService",
  "description": "This service returns hotel of the capital city of the country, the countryis an optional input.",
  "domains": [],
  "id": "tourism/countrycapital-city_hotel_service",
  "state": true,
  "type": "wsdn",
  "url": "http://surf.scss.tcd.ie/_provider_/tourism/countrycapital-city_hotel_service",
  "longitude": 0.0
}