{
  "outputs": [
    {
      "name": "displayVideo",
      "type": "multimedia"
    }
  ],
  "qos": [],
  "inputs": [
    {
      "name": "gridId",
      "type": "long"
    }
  ],
  "domains": [
    {
      "name": "Energy",
      "url": "http://www.surf.scss.tcd.ie/cityOntology/#Energy"
    },
    {
      "name": "Educational",
      "url": "http://www.surf.scss.tcd.ie/cityOntology/#Educational"
    }
  ],
  "location": {}
}