{
  "outputs": [
    {
      "name": "binStatus",
      "type": "json"
    }
  ],
  "qos": [],
  "inputs": [
    {
      "name": "eventParameters",
      "type": "xml"
    }
  ],
  "domains": [
    {
      "name": "Sport",
      "url": "http://www.surf.scss.tcd.ie/cityOntology/#Sport"
    },
    {
      "name": "Leisure",
      "url": "http://www.surf.scss.tcd.ie/cityOntology/#Leisure"
    },
    {
      "name": "Waste",
      "url": "http://www.surf.scss.tcd.ie/cityOntology/#Waste"
    }
  ],
  "location": {}
}