{
  "plans": [
    {
      "outputs": [
        {
          "name": "ambulanceInfo",
          "type": "json"
        }
      ],
      "inputs": [
        {
          "name": "patientInfo",
          "type": "xml"
        }
      ],
      "domains": [
        {
          "name": "Health",
          "url": "http://www.surf.scss.tcd.ie/cityOntology/#Health"
        },
        {
          "name": "Safety_and_Emergencies",
          "url": "http://www.surf.scss.tcd.ie/cityOntology/#Safety_and_Emergencies"
        }
      ],
      "state": 1,
      "steps": [
        {
          "outputs": [
            {
              "name": "ambulanceInfo",
              "type": "json"
            }
          ],
          "inputs": [
            {
              "name": "patientInfo",
              "type": "xml"
            }
          ],
          "serviceDescription": {
            "outputs": [
              {
                "name": "ambulanceInfo",
                "type": "json"
              }
            ],
            "provider": {
              "type": "asp"
            },
            "inputs": [
              {
                "name": "patientInfo",
                "type": "xml"
              }
            ],
            "name": "call_ambulance",
            "description": "This is the service call_ambulance",
            "domains": [
              {
                "name": "Health",
                "url": "http://www.surf.scss.tcd.ie/cityOntology/#Health"
              },
              {
                "name": "Safety_and_Emergencies",
                "url": "http://www.surf.scss.tcd.ie/cityOntology/#Safety_and_Emergencies"
              }
            ],
            "id": "93/call_ambulance",
            "state": true,
            "url": "http://surf.scss.tcd.ie/_provider_/call_ambulance"
          },
          "type": "SimpleStep",
          "order": 0
        }
      ]
    }
  ]
}