{
  "outputs": [
    {
      "name": "streetsWaterLevel",
      "type": "json"
    }
  ],
  "qos": [],
  "inputs": [
    {
      "name": "transportInfo",
      "type": "json"
    },
    {
      "name": "stadiumMap",
      "type": "interactive"
    },
    {
      "name": "similarResults",
      "type": "json"
    }
  ],
  "domains": [
    {
      "name": "Sport",
      "url": "http://www.surf.scss.tcd.ie/cityOntology/#Sport"
    },
    {
      "name": "Government_and_Planning",
      "url": "http://www.surf.scss.tcd.ie/cityOntology/#Government_and_Planning"
    },
    {
      "name": "Nature",
      "url": "http://www.surf.scss.tcd.ie/cityOntology/#Nature"
    }
  ],
  "location": {}
}