{
  "outputs": [
    {
      "name": "_price",
      "type": "string",
      "desc": "Output of service Car price service"
    },
    {
      "name": "_auto",
      "type": "string",
      "desc": "Output of service Car price service"
    }
  ],
  "provider": {
    "type": "asp"
  },
  "inputs": [
    {
      "name": "_car",
      "type": "string",
      "desc": "Input of service Car price service"
    }
  ],
  "name": "Car price service",
  "description": "There are some agencies, who attracts customersby providing a car and a gift auto.",
  "domains": [
    {
      "name": "Marketing",
      "url": "http://www.surf.scss.tcd.ie/cityOntology/#Marketing"
    }
  ],
  "id": "retail/car_priceauto_service",
  "state": true,
  "url": "http://surf.scss.tcd.ie/_provider_/retail/car_priceauto_service"
}