{
  "outputs": [
    {
      "name": "_price",
      "type": "string",
      "desc": "Output of service Auto Price Color service"
    },
    {
      "name": "_color",
      "type": "string",
      "desc": "Output of service Auto Price Color service"
    }
  ],
  "provider": {
    "type": "wsdn"
  },
  "inputs": [
    {
      "name": "_auto",
      "type": "string",
      "desc": "Input of service Auto Price Color service"
    }
  ],
  "name": "Auto Price Color service",
  "description": "This service provides a list of price of auto with its color.",
  "domains": [
    {
      "name": "Industry",
      "url": "http://www.surf.scss.tcd.ie/cityOntology/#Industry"
    }
  ],
  "id": "retail/auto_pricecolor_service",
  "state": true,
  "url": "http://surf.scss.tcd.ie/_provider_/retail/auto_pricecolor_service"
}