{
  "outputs": [
    {
      "name": "parkingInfo",
      "type": "map"
    }
  ],
  "provider": {
    "type": "wsdn"
  },
  "inputs": [
    {
      "name": "location",
      "type": "json"
    }
  ],
  "name": "near_parking_space",
  "description": "This is the service near_parking_space",
  "domains": [
    {
      "name": "Transport_and_Mobility",
      "url": "http://www.surf.scss.tcd.ie/cityOntology/#Transport_and_Mobility"
    }
  ],
  "id": "103/near_parking_space",
  "state": true,
  "url": "http://surf.scss.tcd.ie/_provider_/near_parking_space"
}