{
  "outputs": [
    {
      "name": "_price",
      "type": "string",
      "desc": "Output of service FastCar Price Report service"
    },
    {
      "name": "_report",
      "type": "string",
      "desc": "Output of service FastCar Price Report service"
    }
  ],
  "provider": {
    "type": "wsdn"
  },
  "inputs": [
    {
      "name": "_fastcar",
      "type": "string",
      "desc": "Input of service FastCar Price Report service"
    }
  ],
  "name": "FastCar Price Report service",
  "description": "This service returns not only price of a fastcar, but also a short report about its recommendation.",
  "domains": [
    {
      "name": "Marketing",
      "url": "http://www.surf.scss.tcd.ie/cityOntology/#Marketing"
    }
  ],
  "id": "retail/fastcar_pricereport_service",
  "state": true,
  "url": "http://surf.scss.tcd.ie/_provider_/retail/fastcar_pricereport_service"
}