{
  "outputs": [
    {
      "name": "_recommendedprice",
      "type": "string",
      "desc": "Output of service Sandwich RecommendedPrice Service"
    }
  ],
  "provider": {
    "type": "webservice"
  },
  "inputs": [
    {
      "name": "_sandwich",
      "type": "string",
      "desc": "Input of service Sandwich RecommendedPrice Service"
    }
  ],
  "name": "Sandwich RecommendedPrice Service",
  "description": "This service returns recommended price of sandwich.",
  "domains": [
    {
      "name": "Sport",
      "url": "http://www.surf.scss.tcd.ie/cityOntology/#Sport"
    }
  ],
  "id": "retail/sandwich_recommendedprice_service",
  "state": true,
  "url": "http://surf.scss.tcd.ie/_provider_/retail/sandwich_recommendedprice_service"
}