{
  "outputs": [
    {
      "name": "_address",
      "type": "string",
      "desc": "Output of service TREE Researcher address service"
    }
  ],
  "provider": {
    "type": "asp"
  },
  "inputs": [
    {
      "name": "_researcher-in-academia",
      "type": "string",
      "desc": "Input of service TREE Researcher address service"
    }
  ],
  "name": "TREE Researcher address service",
  "description": "TREE service returns an addresses, whether email or postal, of a researcher in academia.",
  "domains": [
    {
      "name": "Health",
      "url": "http://www.surf.scss.tcd.ie/cityOntology/#Health"
    }
  ],
  "id": "educational/researcher-in-academia_address_service",
  "state": true,
  "url": "http://surf.scss.tcd.ie/_provider_/educational/researcher-in-academia_address_service"
}