{
  "plans": [
    {
      "outputs": [
        {
          "name": "touristicPlan",
          "type": "interactive"
        }
      ],
      "inputs": [
        {
          "name": "activityInfo",
          "type": "xml"
        },
        {
          "name": "activityInfo",
          "type": "xml"
        },
        {
          "name": "activityInfo",
          "type": "xml"
        }
      ],
      "domains": [
        {
          "name": "Activity",
          "url": "http://www.surf.scss.tcd.ie/cityOntology/#Activity"
        },
        {
          "name": "Activity",
          "url": "http://www.surf.scss.tcd.ie/cityOntology/#Activity"
        },
        {
          "name": "Activity",
          "url": "http://www.surf.scss.tcd.ie/cityOntology/#Activity"
        }
      ],
      "state": 1,
      "steps": [
        {
          "outputs": [
            {
              "name": "touristicPlan",
              "type": "interactive"
            }
          ],
          "inputs": [
            {
              "name": "touristicPath",
              "type": "json"
            },
            {
              "name": "suggestedActivities",
              "type": "json"
            },
            {
              "name": "relatedContent",
              "type": "xml"
            }
          ],
          "type": "SequentialStep",
          "steps": [
            {
              "outputs": [
                {
                  "name": "touristicPlan",
                  "type": "interactive"
                }
              ],
              "inputs": [
                {
                  "name": "touristicPath",
                  "type": "json"
                },
                {
                  "name": "suggestedActivities",
                  "type": "json"
                },
                {
                  "name": "relatedContent",
                  "type": "xml"
                }
              ],
              "serviceDescription": {
                "outputs": [
                  {
                    "name": "touristicPlan",
                    "type": "interactive"
                  }
                ],
                "provider": {
                  "type": "asp"
                },
                "inputs": [
                  {
                    "name": "touristicPath",
                    "type": "json"
                  },
                  {
                    "name": "suggestedActivities",
                    "type": "json"
                  },
                  {
                    "name": "relatedContent",
                    "type": "xml"
                  }
                ],
                "name": "present_touristic_plan",
                "description": "This is the service present_touristic_plan",
                "domains": [
                  {
                    "name": "Activity",
                    "url": "http://www.surf.scss.tcd.ie/cityOntology/#Activity"
                  }
                ],
                "id": "78/present_touristic_plan",
                "state": true,
                "url": "http://surf.scss.tcd.ie/_provider_/present_touristic_plan"
              },
              "type": "SimpleStep",
              "order": 0
            }
          ],
          "order": 0
        },
        {
          "outputs": [
            {
              "name": "touristicPath",
              "type": "json"
            },
            {
              "name": "relatedContent",
              "type": "xml"
            }
          ],
          "inputs": [
            {
              "name": "activityInfo",
              "type": "xml"
            },
            {
              "name": "activityInfo",
              "type": "xml"
            },
            {
              "name": "activityInfo",
              "type": "xml"
            }
          ],
          "type": "ParallelStep",
          "steps": [
            {
              "outputs": [
                {
                  "name": "touristicPath",
                  "type": "json"
                }
              ],
              "inputs": [
                {
                  "name": "activityInfo",
                  "type": "xml"
                }
              ],
              "type": "SequentialStep",
              "steps": [
                {
                  "outputs": [
                    {
                      "name": "touristicPath",
                      "type": "json"
                    }
                  ],
                  "inputs": [
                    {
                      "name": "activityInfo",
                      "type": "xml"
                    }
                  ],
                  "serviceDescription": {
                    "outputs": [
                      {
                        "name": "touristicPath",
                        "type": "json"
                      }
                    ],
                    "provider": {
                      "type": "ws"
                    },
                    "inputs": [
                      {
                        "name": "activityInfo",
                        "type": "xml"
                      }
                    ],
                    "name": "touristic_path_calculator",
                    "description": "This is the service touristic_path_calculator",
                    "domains": [
                      {
                        "name": "Activity",
                        "url": "http://www.surf.scss.tcd.ie/cityOntology/#Activity"
                      }
                    ],
                    "id": "75/touristic_path_calculator",
                    "state": true,
                    "url": "http://surf.scss.tcd.ie/_provider_/touristic_path_calculator"
                  },
                  "type": "SimpleStep",
                  "order": 0
                }
              ],
              "order": 0
            },
            {
              "outputs": [
                {
                  "name": "relatedContent",
                  "type": "xml"
                }
              ],
              "inputs": [
                {
                  "name": "activityInfo",
                  "type": "xml"
                }
              ],
              "type": "SequentialStep",
              "steps": [
                {
                  "outputs": [
                    {
                      "name": "relatedContent",
                      "type": "xml"
                    }
                  ],
                  "inputs": [
                    {
                      "name": "activityInfo",
                      "type": "xml"
                    }
                  ],
                  "serviceDescription": {
                    "outputs": [
                      {
                        "name": "relatedContent",
                        "type": "xml"
                      }
                    ],
                    "provider": {
                      "type": "ws"
                    },
                    "inputs": [
                      {
                        "name": "activityInfo",
                        "type": "xml"
                      }
                    ],
                    "name": "related_content",
                    "description": "This is the service related_content",
                    "domains": [
                      {
                        "name": "Activity",
                        "url": "http://www.surf.scss.tcd.ie/cityOntology/#Activity"
                      }
                    ],
                    "id": "77/related_content",
                    "state": true,
                    "url": "http://surf.scss.tcd.ie/_provider_/related_content"
                  },
                  "type": "SimpleStep",
                  "order": 0
                }
              ],
              "order": 1
            },
            {
              "outputs": [
                {
                  "name": "suggestedActivities",
                  "type": "json"
                }
              ],
              "inputs": [
                {
                  "name": "activityInfo",
                  "type": "xml"
                }
              ],
              "type": "SequentialStep",
              "steps": [
                {
                  "outputs": [
                    {
                      "name": "suggestedActivities",
                      "type": "json"
                    }
                  ],
                  "inputs": [
                    {
                      "name": "activityInfo",
                      "type": "xml"
                    }
                  ],
                  "serviceDescription": {
                    "outputs": [
                      {
                        "name": "suggestedActivities",
                        "type": "json"
                      }
                    ],
                    "provider": {
                      "type": "ws"
                    },
                    "inputs": [
                      {
                        "name": "activityInfo",
                        "type": "xml"
                      }
                    ],
                    "name": "recommended_activities",
                    "description": "This is the service recommended_activities",
                    "domains": [
                      {
                        "name": "Activity",
                        "url": "http://www.surf.scss.tcd.ie/cityOntology/#Activity"
                      }
                    ],
                    "id": "76/recommended_activities",
                    "state": true,
                    "url": "http://surf.scss.tcd.ie/_provider_/recommended_activities"
                  },
                  "type": "SimpleStep",
                  "order": 0
                }
              ],
              "order": 0
            }
          ],
          "order": 1
        }
      ]
    }
  ]
}