{
  "outputs": [
    {
      "name": "_author",
      "type": "string",
      "desc": "Output of service BookAuthorPriceService"
    },
    {
      "name": "_price",
      "type": "string",
      "desc": "Output of service BookAuthorPriceService"
    }
  ],
  "provider": "",
  "inputs": [
    {
      "name": "_book",
      "type": "string",
      "desc": "Input of service BookAuthorPriceService"
    }
  ],
  "latitude": 0.0,
  "name": "BookAuthorPriceService",
  "description": "This service returns author and price of a book, short-story or text book (but no novel).",
  "domains": [
    {
      "name": "retail",
      "uri": "http://www.disit.org/km4city/schema#Retail"
    }
  ],
  "id": "retail/book_authorprice_service",
  "state": true,
  "type": "asp",
  "url": "http://surf.scss.tcd.ie/_provider_/retail/book_authorprice_service",
  "longitude": 0.0
}