{
  "outputs": [
    {
      "name": "_recommendedpriceindollar",
      "type": "string",
      "desc": "Output of service Bamzon RecommendedPriceService"
    }
  ],
  "provider": {
    "type": "wsdn"
  },
  "inputs": [
    {
      "name": "_book",
      "type": "string",
      "desc": "Input of service Bamzon RecommendedPriceService"
    }
  ],
  "name": "Bamzon RecommendedPriceService",
  "description": "Bamzon is a popular service to return recommended price of a book.",
  "domains": [
    {
      "name": "Activity",
      "url": "http://www.surf.scss.tcd.ie/cityOntology/#Activity"
    }
  ],
  "id": "retail/book_recommendedpriceindollar_service",
  "state": true,
  "url": "http://surf.scss.tcd.ie/_provider_/retail/book_recommendedpriceindollar_service"
}