{
  "outputs": [
    {
      "name": "eventTicketsInfo",
      "type": "json"
    }
  ],
  "qos": [],
  "inputs": [
    {
      "name": "streetsInfo",
      "type": "json"
    }
  ],
  "domains": [
    {
      "name": "Government_and_Planning",
      "url": "http://www.surf.scss.tcd.ie/cityOntology/#Government_and_Planning"
    },
    {
      "name": "Sport",
      "url": "http://www.surf.scss.tcd.ie/cityOntology/#Sport"
    },
    {
      "name": "Leisure",
      "url": "http://www.surf.scss.tcd.ie/cityOntology/#Leisure"
    }
  ],
  "location": {}
}