{
  "plans": [
    {
      "outputs": [
        {
          "name": "packageStatus",
          "type": "json"
        }
      ],
      "inputs": [
        {
          "name": "packageInfo",
          "type": "xml"
        }
      ],
      "domains": [
        {
          "name": "Logistic",
          "url": "http://www.surf.scss.tcd.ie/cityOntology/#Logistic"
        },
        {
          "name": "Communications",
          "url": "http://www.surf.scss.tcd.ie/cityOntology/#Communications"
        }
      ],
      "state": 1,
      "steps": [
        {
          "outputs": [
            {
              "name": "packageStatus",
              "type": "json"
            }
          ],
          "inputs": [
            {
              "name": "packageInfo",
              "type": "xml"
            }
          ],
          "type": "SequentialStep",
          "steps": [
            {
              "outputs": [
                {
                  "name": "packageStatus",
                  "type": "json"
                }
              ],
              "inputs": [
                {
                  "name": "activateTracking",
                  "type": "json"
                }
              ],
              "serviceDescription": {
                "outputs": [
                  {
                    "name": "packageStatus",
                    "type": "json"
                  }
                ],
                "provider": {
                  "type": "asp"
                },
                "inputs": [
                  {
                    "name": "activateTracking",
                    "type": "json"
                  }
                ],
                "name": "package_monitoring",
                "description": "This is the service package_monitoring",
                "domains": [
                  {
                    "name": "Logistic",
                    "url": "http://www.surf.scss.tcd.ie/cityOntology/#Logistic"
                  },
                  {
                    "name": "Communications",
                    "url": "http://www.surf.scss.tcd.ie/cityOntology/#Communications"
                  }
                ],
                "id": "99/package_monitoring",
                "state": true,
                "url": "http://surf.scss.tcd.ie/_provider_/package_monitoring"
              },
              "type": "SimpleStep",
              "order": 0
            },
            {
              "outputs": [
                {
                  "name": "activateTracking",
                  "type": "json"
                }
              ],
              "inputs": [
                {
                  "name": "packageInfo",
                  "type": "xml"
                }
              ],
              "serviceDescription": {
                "outputs": [
                  {
                    "name": "activateTracking",
                    "type": "json"
                  }
                ],
                "provider": {
                  "type": "ws"
                },
                "inputs": [
                  {
                    "name": "packageInfo",
                    "type": "xml"
                  }
                ],
                "name": "package_configuration",
                "description": "This is the service package_configuration",
                "domains": [
                  {
                    "name": "Logistic",
                    "url": "http://www.surf.scss.tcd.ie/cityOntology/#Logistic"
                  },
                  {
                    "name": "Communications",
                    "url": "http://www.surf.scss.tcd.ie/cityOntology/#Communications"
                  }
                ],
                "id": "97/package_configuration",
                "state": true,
                "url": "http://surf.scss.tcd.ie/_provider_/package_configuration"
              },
              "type": "SimpleStep",
              "order": 1
            }
          ],
          "order": 0
        }
      ]
    }
  ]
}