{
  "outputs": [
    {
      "name": "_accommodation",
      "type": "string",
      "desc": "Output of service City Accommodation Service"
    }
  ],
  "provider": {
    "type": "wsdn"
  },
  "inputs": [
    {
      "name": "_city",
      "type": "string",
      "desc": "Input of service City Accommodation Service"
    }
  ],
  "name": "City Accommodation Service",
  "description": "This service returns information about accommodations on a given city.",
  "domains": [
    {
      "name": "Accommodation",
      "url": "http://www.surf.scss.tcd.ie/cityOntology/#Accommodation"
    }
  ],
  "id": "tourism/city_accommodation_service",
  "state": true,
  "url": "http://surf.scss.tcd.ie/_provider_/tourism/city_accommodation_service"
}