{
  "outputs": [
    {
      "name": "inventoryConfig",
      "type": "json"
    }
  ],
  "qos": [],
  "inputs": [
    {
      "name": "campusZone",
      "type": "json"
    }
  ],
  "domains": [
    {
      "name": "Educational",
      "url": "http://www.surf.scss.tcd.ie/cityOntology/#Educational"
    },
    {
      "name": "Clothing",
      "url": "http://www.surf.scss.tcd.ie/cityOntology/#Clothing"
    }
  ],
  "location": {}
}