{
  "outputs": [
    {
      "name": "_price",
      "type": "string",
      "desc": "Output of service Car Price service"
    }
  ],
  "provider": "",
  "inputs": [
    {
      "name": "_car",
      "type": "string",
      "desc": "Input of service Car Price service"
    },
    {
      "name": "_amount-of-money",
      "type": "string",
      "desc": "Input of service Car Price service"
    }
  ],
  "latitude": 0.0,
  "name": "Car Price service",
  "description": "This service tries to find price of a car within given amount of money.",
  "domains": [
    {
      "name": "retail",
      "uri": "http://www.disit.org/km4city/schema#Retail"
    }
  ],
  "id": "retail/amount-of-moneycar_price_service",
  "state": true,
  "type": "wsdn",
  "url": "http://surf.scss.tcd.ie/_provider_/retail/amount-of-moneycar_price_service",
  "longitude": 0.0
}