{
  "outputs": [
    {
      "name": "_author",
      "type": "string",
      "desc": "Output of service Short-Story Author TaxedPrice Service"
    },
    {
      "name": "_taxedprice",
      "type": "string",
      "desc": "Output of service Short-Story Author TaxedPrice Service"
    }
  ],
  "provider": {
    "type": "webservice"
  },
  "inputs": [
    {
      "name": "_short-story",
      "type": "string",
      "desc": "Input of service Short-Story Author TaxedPrice Service"
    }
  ],
  "name": "Short-Story Author TaxedPrice Service",
  "description": "This service returns author and taxed price of a given short-story.",
  "domains": [
    {
      "name": "Clothing",
      "url": "http://www.surf.scss.tcd.ie/cityOntology/#Clothing"
    }
  ],
  "id": "retail/short-story_authortaxedprice_service",
  "state": true,
  "url": "http://surf.scss.tcd.ie/_provider_/retail/short-story_authortaxedprice_service"
}