{
  "outputs": [
    {
      "name": "_weatherseason",
      "type": "string",
      "desc": "Output of service GEWS Service"
    },
    {
      "name": "_proposition",
      "type": "string",
      "desc": "Output of service GEWS Service"
    }
  ],
  "provider": {
    "type": "wsdn"
  },
  "inputs": [
    {
      "name": "_geopolitical-entity",
      "type": "string",
      "desc": "Input of service GEWS Service"
    }
  ],
  "name": "GEWS Service",
  "description": "GEWS service is used to get season report and proposition about aweather status of a particular geogrphical region.",
  "domains": [
    {
      "name": "Clothing",
      "url": "http://www.surf.scss.tcd.ie/cityOntology/#Clothing"
    }
  ],
  "id": "environmental/geopolitical-entity_weatherseasonproposition_service",
  "state": true,
  "url": "http://surf.scss.tcd.ie/_provider_/environmental/geopolitical-entity_weatherseasonproposition_service"
}