{
  "outputs": [
    {
      "name": "_lecturer-in-academia",
      "type": "string",
      "desc": "Output of service OrganizationLecturer Service"
    }
  ],
  "provider": {
    "type": "wsdn"
  },
  "inputs": [
    {
      "name": "_organization",
      "type": "string",
      "desc": "Input of service OrganizationLecturer Service"
    }
  ],
  "name": "OrganizationLecturer Service",
  "description": "This service returns lecturer of the given organization.",
  "domains": [
    {
      "name": "Transport_and_Mobility",
      "url": "http://www.surf.scss.tcd.ie/cityOntology/#Transport_and_Mobility"
    }
  ],
  "id": "educational/organization_lecturer-in-academia_service",
  "state": true,
  "url": "http://surf.scss.tcd.ie/_provider_/educational/organization_lecturer-in-academia_service"
}