{
  "outputs": [
    {
      "name": "historicPlaceInfo",
      "type": "xml"
    }
  ],
  "provider": {
    "type": "wsdn"
  },
  "inputs": [
    {
      "name": "userLocation",
      "type": "json"
    }
  ],
  "name": "surrounding_historic_places",
  "description": "This is the service surrounding_historic_places",
  "domains": [
    {
      "name": "Touristic_Place",
      "url": "http://www.surf.scss.tcd.ie/cityOntology/#Touristic_Place"
    },
    {
      "name": "History",
      "url": "http://www.surf.scss.tcd.ie/cityOntology/#History"
    }
  ],
  "id": "79/surrounding_historic_places",
  "state": true,
  "url": "http://surf.scss.tcd.ie/_provider_/surrounding_historic_places"
}