{
  "outputs": [
    {
      "name": "parkingInfo",
      "type": "map"
    }
  ],
  "qos": [],
  "inputs": [
    {
      "name": "roomVideo",
      "type": "stream"
    }
  ],
  "domains": [
    {
      "name": "Accommodation",
      "url": "http://www.surf.scss.tcd.ie/cityOntology/#Accommodation"
    },
    {
      "name": "Transport_and_Mobility",
      "url": "http://www.surf.scss.tcd.ie/cityOntology/#Transport_and_Mobility"
    }
  ],
  "location": {}
}