{
  "outputs": [
    {
      "name": "_maxprice",
      "type": "string",
      "desc": "Output of service 4wheeledcar2personbicycle_maxprice_service"
    }
  ],
  "provider": {
    "type": "asp"
  },
  "inputs": [
    {
      "name": "_2personbicycle",
      "type": "string",
      "desc": "Input of service 4wheeledcar2personbicycle_maxprice_service"
    },
    {
      "name": "_4wheeledcar",
      "type": "string",
      "desc": "Input of service 4wheeledcar2personbicycle_maxprice_service"
    }
  ],
  "name": "4wheeledcar2personbicycle_maxprice_service",
  "description": "This service is about retail",
  "domains": [
    {
      "name": "Religious",
      "url": "http://www.surf.scss.tcd.ie/cityOntology/#Religious"
    }
  ],
  "id": "retail/4wheeledcar2personbicycle_maxprice_service",
  "state": true,
  "url": "http://surf.scss.tcd.ie/_provider_/retail/4wheeledcar2personbicycle_maxprice_service"
}