{
  "outputs": [
    {
      "name": "atmVideo",
      "type": "video"
    }
  ],
  "qos": [],
  "inputs": [
    {
      "name": "trafficInfo",
      "type": "json"
    },
    {
      "name": "pollutionInfo",
      "type": "json"
    },
    {
      "name": "noiseInfo",
      "type": "json"
    },
    {
      "name": "floodingInfo",
      "type": "json"
    }
  ],
  "domains": [
    {
      "name": "Transport_and_Mobility",
      "url": "http://www.surf.scss.tcd.ie/cityOntology/#Transport_and_Mobility"
    },
    {
      "name": "Safety_and_Emergencies",
      "url": "http://www.surf.scss.tcd.ie/cityOntology/#Safety_and_Emergencies"
    },
    {
      "name": "Finance",
      "url": "http://www.surf.scss.tcd.ie/cityOntology/#Finance"
    }
  ],
  "location": {}
}