{
  "outputs": [
    {
      "name": "_book",
      "type": "string",
      "desc": "Output of service Academic Book Number booksearch"
    }
  ],
  "provider": {
    "type": "webservice"
  },
  "inputs": [
    {
      "name": "_academic-item-number",
      "type": "string",
      "desc": "Input of service Academic Book Number booksearch"
    }
  ],
  "name": "Academic Book Number booksearch",
  "description": "Allows booksearch using the academic book number",
  "domains": [
    {
      "name": "Energy",
      "url": "http://www.surf.scss.tcd.ie/cityOntology/#Energy"
    }
  ],
  "id": "educational/academic-item-number_book_service",
  "state": true,
  "url": "http://surf.scss.tcd.ie/_provider_/educational/academic-item-number_book_service"
}