{
  "outputs": [
    {
      "name": "gridReport",
      "type": "json"
    }
  ],
  "provider": {
    "type": "wsdn"
  },
  "inputs": [
    {
      "name": "gridId",
      "type": "long"
    }
  ],
  "name": "grid_monitoring",
  "description": "This is the service grid_monitoring",
  "domains": [
    {
      "name": "Energy",
      "url": "http://www.surf.scss.tcd.ie/cityOntology/#Energy"
    }
  ],
  "id": "109/grid_monitoring",
  "state": true,
  "url": "http://surf.scss.tcd.ie/_provider_/grid_monitoring"
}