{
  "plans": [
    {
      "outputs": [
        {
          "name": "monumentInfo",
          "type": "interactive"
        }
      ],
      "inputs": [
        {
          "name": "userLocation",
          "type": "json"
        }
      ],
      "domains": [
        {
          "name": "Touristic_Place",
          "url": "http://www.surf.scss.tcd.ie/cityOntology/#Touristic_Place"
        },
        {
          "name": "History",
          "url": "http://www.surf.scss.tcd.ie/cityOntology/#History"
        }
      ],
      "state": 1,
      "steps": [
        {
          "outputs": [
            {
              "name": "monumentInfo",
              "type": "interactive"
            }
          ],
          "inputs": [
            {
              "name": "userLocation",
              "type": "json"
            }
          ],
          "type": "SequentialStep",
          "steps": [
            {
              "outputs": [
                {
                  "name": "monumentInfo",
                  "type": "interactive"
                }
              ],
              "inputs": [
                {
                  "name": "historicContent",
                  "type": "xml"
                }
              ],
              "serviceDescription": {
                "outputs": [
                  {
                    "name": "monumentInfo",
                    "type": "interactive"
                  }
                ],
                "provider": {
                  "type": "asp"
                },
                "inputs": [
                  {
                    "name": "historicContent",
                    "type": "xml"
                  }
                ],
                "name": "present_monument_content",
                "description": "This is the service present_monument_content",
                "domains": [
                  {
                    "name": "Touristic_Place",
                    "url": "http://www.surf.scss.tcd.ie/cityOntology/#Touristic_Place"
                  },
                  {
                    "name": "History",
                    "url": "http://www.surf.scss.tcd.ie/cityOntology/#History"
                  }
                ],
                "id": "81/present_monument_content",
                "state": true,
                "url": "http://surf.scss.tcd.ie/_provider_/present_monument_content"
              },
              "type": "SimpleStep",
              "order": 0
            },
            {
              "outputs": [
                {
                  "name": "historicContent",
                  "type": "xml"
                }
              ],
              "inputs": [
                {
                  "name": "historicPlaceInfo",
                  "type": "xml"
                }
              ],
              "serviceDescription": {
                "outputs": [
                  {
                    "name": "historicContent",
                    "type": "xml"
                  }
                ],
                "provider": {
                  "type": "ws"
                },
                "inputs": [
                  {
                    "name": "historicPlaceInfo",
                    "type": "xml"
                  }
                ],
                "name": "search_historic_content",
                "description": "This is the service search_historic_content",
                "domains": [
                  {
                    "name": "Touristic_Place",
                    "url": "http://www.surf.scss.tcd.ie/cityOntology/#Touristic_Place"
                  },
                  {
                    "name": "History",
                    "url": "http://www.surf.scss.tcd.ie/cityOntology/#History"
                  }
                ],
                "id": "80/search_historic_content",
                "state": true,
                "url": "http://surf.scss.tcd.ie/_provider_/search_historic_content"
              },
              "type": "SimpleStep",
              "order": 1
            },
            {
              "outputs": [
                {
                  "name": "historicPlaceInfo",
                  "type": "xml"
                }
              ],
              "inputs": [
                {
                  "name": "userLocation",
                  "type": "json"
                }
              ],
              "serviceDescription": {
                "outputs": [
                  {
                    "name": "historicPlaceInfo",
                    "type": "xml"
                  }
                ],
                "provider": {
                  "type": "wsdn"
                },
                "inputs": [
                  {
                    "name": "userLocation",
                    "type": "json"
                  }
                ],
                "name": "surrounding_historic_places",
                "description": "This is the service surrounding_historic_places",
                "domains": [
                  {
                    "name": "Touristic_Place",
                    "url": "http://www.surf.scss.tcd.ie/cityOntology/#Touristic_Place"
                  },
                  {
                    "name": "History",
                    "url": "http://www.surf.scss.tcd.ie/cityOntology/#History"
                  }
                ],
                "id": "79/surrounding_historic_places",
                "state": true,
                "url": "http://surf.scss.tcd.ie/_provider_/surrounding_historic_places"
              },
              "type": "SimpleStep",
              "order": 2
            }
          ],
          "order": 0
        }
      ]
    }
  ]
}