{
  "outputs": [
    {
      "name": "_diagnosticprocess",
      "type": "string",
      "desc": "Output of service CareOrganization DiagnosticProcess Service"
    }
  ],
  "provider": {
    "type": "asp"
  },
  "inputs": [
    {
      "name": "_careorganization",
      "type": "string",
      "desc": "Input of service CareOrganization DiagnosticProcess Service"
    }
  ],
  "name": "CareOrganization DiagnosticProcess Service",
  "description": "This service returns certain type diagnostic process available in the certain care organization.",
  "domains": [
    {
      "name": "Nature",
      "url": "http://www.surf.scss.tcd.ie/cityOntology/#Nature"
    }
  ],
  "id": "health/careorganization_diagnosticprocess_service",
  "state": true,
  "url": "http://surf.scss.tcd.ie/_provider_/health/careorganization_diagnosticprocess_service"
}