{
  "outputs": [
    {
      "name": "_monograph",
      "type": "string",
      "desc": "Output of service author_monographrecommendedprice_service"
    },
    {
      "name": "_recommendedprice",
      "type": "string",
      "desc": "Output of service author_monographrecommendedprice_service"
    }
  ],
  "provider": {
    "type": "webservice"
  },
  "inputs": [
    {
      "name": "_author",
      "type": "string",
      "desc": "Input of service author_monographrecommendedprice_service"
    }
  ],
  "name": "author_monographrecommendedprice_service",
  "description": "This service is about retail",
  "domains": [
    {
      "name": "Tools",
      "url": "http://www.surf.scss.tcd.ie/cityOntology/#Tools"
    }
  ],
  "id": "retail/author_monographrecommendedprice_service",
  "state": true,
  "url": "http://surf.scss.tcd.ie/_provider_/retail/author_monographrecommendedprice_service"
}