{
  "outputs": [
    {
      "name": "_price",
      "type": "string",
      "desc": "Output of service BookPrice"
    }
  ],
  "provider": {
    "type": "asp"
  },
  "inputs": [
    {
      "name": "_book",
      "type": "string",
      "desc": "Input of service BookPrice"
    },
    {
      "name": "_person",
      "type": "string",
      "desc": "Input of service BookPrice"
    }
  ],
  "name": "BookPrice",
  "description": "This service returns price of a book, person is an optional input.",
  "domains": [
    {
      "name": "Industry",
      "url": "http://www.surf.scss.tcd.ie/cityOntology/#Industry"
    }
  ],
  "id": "retail/personbook_price_service",
  "state": true,
  "url": "http://surf.scss.tcd.ie/_provider_/retail/personbook_price_service"
}