{
  "outputs": [
    {
      "name": "zoneInfo",
      "type": "json"
    }
  ],
  "qos": [],
  "inputs": [
    {
      "name": "binId",
      "type": "long"
    }
  ],
  "domains": [
    {
      "name": "Waste",
      "url": "http://www.surf.scss.tcd.ie/cityOntology/#Waste"
    },
    {
      "name": "Transport_and_Mobility",
      "url": "http://www.surf.scss.tcd.ie/cityOntology/#Transport_and_Mobility"
    }
  ],
  "location": {}
}