{
  "outputs": [
    {
      "name": "_lightning",
      "type": "string",
      "desc": "Output of service RegionLightiningConditionService"
    }
  ],
  "provider": {
    "type": "wsdn"
  },
  "inputs": [
    {
      "name": "_geographical-region",
      "type": "string",
      "desc": "Input of service RegionLightiningConditionService"
    }
  ],
  "name": "RegionLightiningConditionService",
  "description": "This service returns lightening condition of a region.",
  "domains": [
    {
      "name": "Entertainment_Products",
      "url": "http://www.surf.scss.tcd.ie/cityOntology/#Entertainment_Products"
    }
  ],
  "id": "environmental/geographical-region_lightning_service",
  "state": true,
  "url": "http://surf.scss.tcd.ie/_provider_/environmental/geographical-region_lightning_service"
}