{
  "outputs": [
    {
      "name": "_address",
      "type": "string",
      "desc": "Output of service HOM2 Researcher address  service"
    }
  ],
  "provider": {
    "type": "asp"
  },
  "inputs": [
    {
      "name": "_researcher",
      "type": "string",
      "desc": "Input of service HOM2 Researcher address  service"
    }
  ],
  "name": "HOM2 Researcher address  service",
  "description": "HOM2 is the mostly used service to return an address of a given researcher.",
  "domains": [
    {
      "name": "Arts",
      "url": "http://www.surf.scss.tcd.ie/cityOntology/#Arts"
    }
  ],
  "id": "educational/researcher_address_service",
  "state": true,
  "url": "http://surf.scss.tcd.ie/_provider_/educational/researcher_address_service"
}