{
  "outputs": [
    {
      "name": "products",
      "type": "json"
    }
  ],
  "provider": {
    "type": "wsdn"
  },
  "inputs": [
    {
      "name": "productData",
      "type": "xml"
    }
  ],
  "name": "buy_sport_products",
  "description": "This is the service buy_sport_products",
  "domains": [
    {
      "name": "Sport",
      "url": "http://www.surf.scss.tcd.ie/cityOntology/#Sport"
    }
  ],
  "id": "130/buy_sport_products",
  "state": true,
  "url": "http://surf.scss.tcd.ie/_provider_/buy_sport_products"
}