{
  "outputs": [
    {
      "name": "_hotel",
      "type": "string",
      "desc": "Output of service GeopoliticalHotelService"
    }
  ],
  "provider": "",
  "inputs": [
    {
      "name": "_geopolitical-entity",
      "type": "string",
      "desc": "Input of service GeopoliticalHotelService"
    }
  ],
  "latitude": 0.0,
  "name": "GeopoliticalHotelService",
  "description": "This service is the best service to know about the hotel in a geographical entity.",
  "domains": [],
  "id": "tourism/geopolitical-entity_hotel_service",
  "state": true,
  "type": "wsdn",
  "url": "http://surf.scss.tcd.ie/_provider_/tourism/geopolitical-entity_hotel_service",
  "longitude": 0.0
}