{
  "outputs": [
    {
      "name": "taxiLocation",
      "type": "json"
    }
  ],
  "qos": [],
  "inputs": [
    {
      "name": "gridReport",
      "type": "json"
    }
  ],
  "domains": [
    {
      "name": "Energy",
      "url": "http://www.surf.scss.tcd.ie/cityOntology/#Energy"
    },
    {
      "name": "Transport_and_Mobility",
      "url": "http://www.surf.scss.tcd.ie/cityOntology/#Transport_and_Mobility"
    }
  ],
  "location": {}
}