{
  "outputs": [
    {
      "name": "industryInfo",
      "type": "json"
    }
  ],
  "qos": [],
  "inputs": [
    {
      "name": "accommodationList",
      "type": "xml"
    }
  ],
  "domains": [
    {
      "name": "Accommodation",
      "url": "http://www.surf.scss.tcd.ie/cityOntology/#Accommodation"
    },
    {
      "name": "Industry",
      "url": "http://www.surf.scss.tcd.ie/cityOntology/#Industry"
    },
    {
      "name": "Nature",
      "url": "http://www.surf.scss.tcd.ie/cityOntology/#Nature"
    }
  ],
  "location": {}
}