{
  "outputs": [
    {
      "name": "_hotel",
      "type": "string",
      "desc": "Output of service CapitalCityCountaryHotelInfoService"
    }
  ],
  "provider": {
    "type": "asp"
  },
  "inputs": [
    {
      "name": "_capital-city",
      "type": "string",
      "desc": "Input of service CapitalCityCountaryHotelInfoService"
    },
    {
      "name": "_country",
      "type": "string",
      "desc": "Input of service CapitalCityCountaryHotelInfoService"
    }
  ],
  "name": "CapitalCityCountaryHotelInfoService",
  "description": "This service returns hotel of the capital city of the country, the countryis an optional input.",
  "domains": [
    {
      "name": "Foundations_and_Charity",
      "url": "http://www.surf.scss.tcd.ie/cityOntology/#Foundations_and_Charity"
    }
  ],
  "id": "tourism/countrycapital-city_hotel_service",
  "state": true,
  "url": "http://surf.scss.tcd.ie/_provider_/tourism/countrycapital-city_hotel_service"
}