{
  "plans": [
    {
      "outputs": [
        {
          "name": "accommodationList",
          "type": "xml"
        }
      ],
      "inputs": [
        {
          "name": "accommodationParameters",
          "type": "xml"
        }
      ],
      "domains": [
        {
          "name": "Accommodation",
          "url": "http://www.surf.scss.tcd.ie/cityOntology/#Accommodation"
        }
      ],
      "state": 1,
      "steps": [
        {
          "outputs": [
            {
              "name": "accommodationList",
              "type": "xml"
            }
          ],
          "inputs": [
            {
              "name": "accommodationParameters",
              "type": "xml"
            }
          ],
          "serviceDescription": {
            "outputs": [
              {
                "name": "accommodationList",
                "type": "xml"
              }
            ],
            "provider": {
              "type": "ws"
            },
            "inputs": [
              {
                "name": "accommodationParameters",
                "type": "xml"
              }
            ],
            "name": "search_accommodation",
            "description": "This is the service search_accommodation",
            "domains": [
              {
                "name": "Accommodation",
                "url": "http://www.surf.scss.tcd.ie/cityOntology/#Accommodation"
              }
            ],
            "id": "82/search_accommodation",
            "state": true,
            "url": "http://surf.scss.tcd.ie/_provider_/search_accommodation"
          },
          "type": "SimpleStep",
          "order": 0
        }
      ]
    }
  ]
}