{
  "outputs": [
    {
      "name": "products",
      "type": "json"
    }
  ],
  "qos": [],
  "inputs": [
    {
      "name": "accommodationConfirmation",
      "type": "json"
    }
  ],
  "domains": [
    {
      "name": "Accommodation",
      "url": "http://www.surf.scss.tcd.ie/cityOntology/#Accommodation"
    },
    {
      "name": "Food_and_Drinks",
      "url": "http://www.surf.scss.tcd.ie/cityOntology/#Food_and_Drinks"
    }
  ],
  "location": {}
}