{
  "outputs": [
    {
      "name": "_price",
      "type": "string",
      "desc": "Output of service car price report service"
    },
    {
      "name": "_report",
      "type": "string",
      "desc": "Output of service car price report service"
    }
  ],
  "provider": {
    "type": "asp"
  },
  "inputs": [
    {
      "name": "_car",
      "type": "string",
      "desc": "Input of service car price report service"
    }
  ],
  "name": "car price report service",
  "description": "This service returns not only price of a car, but also a short reportabout its recommendation.",
  "domains": [
    {
      "name": "Entertainment_Products",
      "url": "http://www.surf.scss.tcd.ie/cityOntology/#Entertainment_Products"
    }
  ],
  "id": "retail/car_pricereport_service",
  "state": true,
  "url": "http://surf.scss.tcd.ie/_provider_/retail/car_pricereport_service"
}