{
  "outputs": [
    {
      "name": "_price",
      "type": "string",
      "desc": "Output of service T-car price service"
    },
    {
      "name": "_color",
      "type": "string",
      "desc": "Output of service T-car price service"
    }
  ],
  "provider": {
    "type": "wsdn"
  },
  "inputs": [
    {
      "name": "_car",
      "type": "string",
      "desc": "Input of service T-car price service"
    }
  ],
  "name": "T-car price service",
  "description": "T-service analysed car market value and deduced that color isone of the main issue in its popularity, so this service provideslist of price of car with its color.",
  "domains": [
    {
      "name": "Activity",
      "url": "http://www.surf.scss.tcd.ie/cityOntology/#Activity"
    }
  ],
  "id": "retail/car_pricecolor_service",
  "state": true,
  "url": "http://surf.scss.tcd.ie/_provider_/retail/car_pricecolor_service"
}