{
  "outputs": [
    {
      "name": "booksInformation",
      "type": "xml"
    }
  ],
  "qos": [],
  "inputs": [
    {
      "name": "bookAccommodation",
      "type": "xml"
    }
  ],
  "domains": [
    {
      "name": "Accommodation",
      "url": "http://www.surf.scss.tcd.ie/cityOntology/#Accommodation"
    },
    {
      "name": "Educational",
      "url": "http://www.surf.scss.tcd.ie/cityOntology/#Educational"
    },
    {
      "name": "Research_and_Science",
      "url": "http://www.surf.scss.tcd.ie/cityOntology/#Research_and_Science"
    }
  ],
  "location": {}
}