{
  "outputs": [
    {
      "name": "_taxedprice",
      "type": "string",
      "desc": "Output of service Sandwich TaxedPrice Service"
    }
  ],
  "provider": "",
  "inputs": [
    {
      "name": "_sandwich",
      "type": "string",
      "desc": "Input of service Sandwich TaxedPrice Service"
    }
  ],
  "latitude": 0.0,
  "name": "Sandwich TaxedPrice Service",
  "description": "This service returns taxed price of sandwich.",
  "domains": [
    {
      "name": "retail",
      "uri": "http://www.disit.org/km4city/schema#Retail"
    }
  ],
  "id": "retail/sandwich_taxedprice_service",
  "state": true,
  "type": "webservice",
  "url": "http://surf.scss.tcd.ie/_provider_/retail/sandwich_taxedprice_service",
  "longitude": 0.0
}