{
  "plans": [
    {
      "outputs": [
        {
          "name": "prisionNotification",
          "type": "alert"
        }
      ],
      "inputs": [
        {
          "name": "prisionersList",
          "type": "json"
        },
        {
          "name": "prisionZone",
          "type": "json"
        }
      ],
      "domains": [
        {
          "name": "Safety_and_Emergencies",
          "url": "http://www.surf.scss.tcd.ie/cityOntology/#Safety_and_Emergencies"
        },
        {
          "name": "Safety_and_Emergencies",
          "url": "http://www.surf.scss.tcd.ie/cityOntology/#Safety_and_Emergencies"
        }
      ],
      "state": 1,
      "steps": [
        {
          "outputs": [
            {
              "name": "prisionNotification",
              "type": "alert"
            }
          ],
          "inputs": [
            {
              "name": "prisionerInfo",
              "type": "json"
            },
            {
              "name": "prisionVideo",
              "type": "video"
            }
          ],
          "type": "SequentialStep",
          "steps": [
            {
              "outputs": [
                {
                  "name": "prisionNotification",
                  "type": "alert"
                }
              ],
              "inputs": [
                {
                  "name": "prisionerInfo",
                  "type": "json"
                },
                {
                  "name": "prisionVideo",
                  "type": "video"
                }
              ],
              "serviceDescription": {
                "outputs": [
                  {
                    "name": "prisionNotification",
                    "type": "alert"
                  }
                ],
                "provider": {
                  "type": "ws"
                },
                "inputs": [
                  {
                    "name": "prisionerInfo",
                    "type": "json"
                  },
                  {
                    "name": "prisionVideo",
                    "type": "video"
                  }
                ],
                "name": "prision_anomaly_detection",
                "description": "This is the service prision_anomaly_detection",
                "domains": [
                  {
                    "name": "Safety_and_Emergencies",
                    "url": "http://www.surf.scss.tcd.ie/cityOntology/#Safety_and_Emergencies"
                  }
                ],
                "id": "20/prision_anomaly_detection",
                "state": true,
                "url": "http://surf.scss.tcd.ie/_provider_/prision_anomaly_detection"
              },
              "type": "SimpleStep",
              "order": 0
            }
          ],
          "order": 0
        },
        {
          "outputs": [
            {
              "name": "prisionerInfo",
              "type": "json"
            }
          ],
          "inputs": [
            {
              "name": "prisionersList",
              "type": "json"
            },
            {
              "name": "prisionZone",
              "type": "json"
            }
          ],
          "type": "ParallelStep",
          "steps": [
            {
              "outputs": [
                {
                  "name": "prisionerInfo",
                  "type": "json"
                }
              ],
              "inputs": [
                {
                  "name": "prisionersList",
                  "type": "json"
                }
              ],
              "type": "SequentialStep",
              "steps": [
                {
                  "outputs": [
                    {
                      "name": "prisionerInfo",
                      "type": "json"
                    }
                  ],
                  "inputs": [
                    {
                      "name": "prisionersList",
                      "type": "json"
                    }
                  ],
                  "serviceDescription": {
                    "outputs": [
                      {
                        "name": "prisionerInfo",
                        "type": "json"
                      }
                    ],
                    "provider": {
                      "type": "wsdn"
                    },
                    "inputs": [
                      {
                        "name": "prisionersList",
                        "type": "json"
                      }
                    ],
                    "name": "prisioner_monitoring",
                    "description": "This is the service prisioner_monitoring",
                    "domains": [
                      {
                        "name": "Safety_and_Emergencies",
                        "url": "http://www.surf.scss.tcd.ie/cityOntology/#Safety_and_Emergencies"
                      }
                    ],
                    "id": "18/prisioner_monitoring",
                    "state": true,
                    "url": "http://surf.scss.tcd.ie/_provider_/prisioner_monitoring"
                  },
                  "type": "SimpleStep",
                  "order": 0
                }
              ],
              "order": 0
            },
            {
              "outputs": [
                {
                  "name": "prisionVideo",
                  "type": "video"
                }
              ],
              "inputs": [
                {
                  "name": "prisionZone",
                  "type": "json"
                }
              ],
              "type": "SequentialStep",
              "steps": [
                {
                  "outputs": [
                    {
                      "name": "prisionVideo",
                      "type": "video"
                    }
                  ],
                  "inputs": [
                    {
                      "name": "prisionZone",
                      "type": "json"
                    }
                  ],
                  "serviceDescription": {
                    "outputs": [
                      {
                        "name": "prisionVideo",
                        "type": "video"
                      }
                    ],
                    "provider": {
                      "type": "wsdn"
                    },
                    "inputs": [
                      {
                        "name": "prisionZone",
                        "type": "json"
                      }
                    ],
                    "name": "prision_video_camera",
                    "description": "This is the service prision_video_camera",
                    "domains": [
                      {
                        "name": "Safety_and_Emergencies",
                        "url": "http://www.surf.scss.tcd.ie/cityOntology/#Safety_and_Emergencies"
                      }
                    ],
                    "id": "19/prision_video_camera",
                    "state": true,
                    "url": "http://surf.scss.tcd.ie/_provider_/prision_video_camera"
                  },
                  "type": "SimpleStep",
                  "order": 0
                }
              ],
              "order": 0
            }
          ],
          "order": 1
        }
      ]
    }
  ]
}