{
  "outputs": [
    {
      "name": "_recommendedprice",
      "type": "string",
      "desc": "Output of service FastCar RecommendedPrice Color service"
    },
    {
      "name": "_color",
      "type": "string",
      "desc": "Output of service FastCar RecommendedPrice Color service"
    }
  ],
  "provider": {
    "type": "asp"
  },
  "inputs": [
    {
      "name": "_fastcar",
      "type": "string",
      "desc": "Input of service FastCar RecommendedPrice Color service"
    }
  ],
  "name": "FastCar RecommendedPrice Color service",
  "description": "This service provides a list of recommended price of fast car with its color.",
  "domains": [
    {
      "name": "Marketing",
      "url": "http://www.surf.scss.tcd.ie/cityOntology/#Marketing"
    }
  ],
  "id": "retail/fastcar_recommendedpricecolor_service",
  "state": true,
  "url": "http://surf.scss.tcd.ie/_provider_/retail/fastcar_recommendedpricecolor_service"
}