{
  "plans": [
    {
      "outputs": [
        {
          "name": "multimodalRouteMap",
          "type": "interactive"
        }
      ],
      "inputs": [
        {
          "name": "routeParameters",
          "type": "json"
        },
        {
          "name": "routeParameters",
          "type": "json"
        }
      ],
      "domains": [
        {
          "name": "Transport_and_Mobility",
          "url": "http://www.surf.scss.tcd.ie/cityOntology/#Transport_and_Mobility"
        },
        {
          "name": "Transport_and_Mobility",
          "url": "http://www.surf.scss.tcd.ie/cityOntology/#Transport_and_Mobility"
        }
      ],
      "state": 1,
      "steps": [
        {
          "outputs": [
            {
              "name": "multimodalRouteMap",
              "type": "interactive"
            }
          ],
          "inputs": [
            {
              "name": "bikeAvailability",
              "type": "json"
            },
            {
              "name": "busAvailability",
              "type": "json"
            }
          ],
          "type": "SequentialStep",
          "steps": [
            {
              "outputs": [
                {
                  "name": "multimodalRouteMap",
                  "type": "interactive"
                }
              ],
              "inputs": [
                {
                  "name": "bikeAvailability",
                  "type": "json"
                },
                {
                  "name": "busAvailability",
                  "type": "json"
                }
              ],
              "serviceDescription": {
                "outputs": [
                  {
                    "name": "multimodalRouteMap",
                    "type": "interactive"
                  }
                ],
                "provider": {
                  "type": "ws"
                },
                "inputs": [
                  {
                    "name": "bikeAvailability",
                    "type": "json"
                  },
                  {
                    "name": "busAvailability",
                    "type": "json"
                  }
                ],
                "name": "multimodal_service",
                "description": "This is the service multimodal_service",
                "domains": [
                  {
                    "name": "Transport_and_Mobility",
                    "url": "http://www.surf.scss.tcd.ie/cityOntology/#Transport_and_Mobility"
                  }
                ],
                "id": "9/multimodal_service",
                "state": true,
                "url": "http://surf.scss.tcd.ie/_provider_/multimodal_service"
              },
              "type": "SimpleStep",
              "order": 0
            }
          ],
          "order": 0
        },
        {
          "outputs": [
            {
              "name": "busAvailability",
              "type": "json"
            }
          ],
          "inputs": [
            {
              "name": "routeParameters",
              "type": "json"
            },
            {
              "name": "routeParameters",
              "type": "json"
            }
          ],
          "type": "ParallelStep",
          "steps": [
            {
              "outputs": [
                {
                  "name": "busAvailability",
                  "type": "json"
                }
              ],
              "inputs": [
                {
                  "name": "routeParameters",
                  "type": "json"
                }
              ],
              "type": "SequentialStep",
              "steps": [
                {
                  "outputs": [
                    {
                      "name": "busAvailability",
                      "type": "json"
                    }
                  ],
                  "inputs": [
                    {
                      "name": "routeParameters",
                      "type": "json"
                    }
                  ],
                  "serviceDescription": {
                    "outputs": [
                      {
                        "name": "busAvailability",
                        "type": "json"
                      }
                    ],
                    "provider": {
                      "type": "asp"
                    },
                    "inputs": [
                      {
                        "name": "routeParameters",
                        "type": "json"
                      }
                    ],
                    "name": "bus_availability",
                    "description": "This is the service bus_availability",
                    "domains": [
                      {
                        "name": "Transport_and_Mobility",
                        "url": "http://www.surf.scss.tcd.ie/cityOntology/#Transport_and_Mobility"
                      }
                    ],
                    "id": "8/bus_availability",
                    "state": true,
                    "url": "http://surf.scss.tcd.ie/_provider_/bus_availability"
                  },
                  "type": "SimpleStep",
                  "order": 0
                }
              ],
              "order": 0
            },
            {
              "outputs": [
                {
                  "name": "bikeAvailability",
                  "type": "json"
                }
              ],
              "inputs": [
                {
                  "name": "routeParameters",
                  "type": "json"
                }
              ],
              "type": "SequentialStep",
              "steps": [
                {
                  "outputs": [
                    {
                      "name": "bikeAvailability",
                      "type": "json"
                    }
                  ],
                  "inputs": [
                    {
                      "name": "routeParameters",
                      "type": "json"
                    }
                  ],
                  "serviceDescription": {
                    "outputs": [
                      {
                        "name": "bikeAvailability",
                        "type": "json"
                      }
                    ],
                    "provider": {
                      "type": "wsdn"
                    },
                    "inputs": [
                      {
                        "name": "routeParameters",
                        "type": "json"
                      }
                    ],
                    "name": "bike_availability",
                    "description": "This is the service bike_availability",
                    "domains": [
                      {
                        "name": "Transport_and_Mobility",
                        "url": "http://www.surf.scss.tcd.ie/cityOntology/#Transport_and_Mobility"
                      }
                    ],
                    "id": "7/bike_availability",
                    "state": true,
                    "url": "http://surf.scss.tcd.ie/_provider_/bike_availability"
                  },
                  "type": "SimpleStep",
                  "order": 0
                }
              ],
              "order": 0
            }
          ],
          "order": 1
        }
      ]
    }
  ]
}