{
  "outputs": [
    {
      "name": "streetsVideo",
      "type": "video"
    }
  ],
  "provider": {
    "type": "wsdn"
  },
  "inputs": [
    {
      "name": "streetsInfo",
      "type": "json"
    }
  ],
  "name": "streets_camera",
  "description": "This is the service streets_camera",
  "domains": [
    {
      "name": "Government_and_Planning",
      "url": "http://www.surf.scss.tcd.ie/cityOntology/#Government_and_Planning"
    }
  ],
  "id": "125/streets_camera",
  "state": true,
  "url": "http://surf.scss.tcd.ie/_provider_/streets_camera"
}