{
  "outputs": [
    {
      "name": "_sports",
      "type": "string",
      "desc": "Output of service CityCountryInfoService"
    },
    {
      "name": "_hotel",
      "type": "string",
      "desc": "Output of service CityCountryInfoService"
    }
  ],
  "provider": {
    "type": "asp"
  },
  "inputs": [
    {
      "name": "_city",
      "type": "string",
      "desc": "Input of service CityCountryInfoService"
    },
    {
      "name": "_country",
      "type": "string",
      "desc": "Input of service CityCountryInfoService"
    }
  ],
  "name": "CityCountryInfoService",
  "description": "This service is used not only to know the hotel informationof the city of the country, but also about its sport facilities.",
  "domains": [
    {
      "name": "Educational",
      "url": "http://www.surf.scss.tcd.ie/cityOntology/#Educational"
    }
  ],
  "id": "tourism/countrycity_sportshotel_service",
  "state": true,
  "url": "http://surf.scss.tcd.ie/_provider_/tourism/countrycity_sportshotel_service"
}