{
  "plans": [
    {
      "outputs": [
        {
          "name": "gasDetection",
          "type": "json"
        }
      ],
      "inputs": [
        {
          "name": "constructionMonitoringParameters",
          "type": "xml"
        }
      ],
      "domains": [
        {
          "name": "Safety_and_Emergencies",
          "url": "http://www.surf.scss.tcd.ie/cityOntology/#Safety_and_Emergencies"
        },
        {
          "name": "Construction",
          "url": "http://www.surf.scss.tcd.ie/cityOntology/#Construction"
        }
      ],
      "state": 1,
      "steps": [
        {
          "outputs": [
            {
              "name": "gasDetection",
              "type": "json"
            }
          ],
          "inputs": [
            {
              "name": "constructionMonitoringParameters",
              "type": "xml"
            }
          ],
          "type": "SequentialStep",
          "steps": [
            {
              "outputs": [
                {
                  "name": "gasDetection",
                  "type": "json"
                }
              ],
              "inputs": [
                {
                  "name": "constructionStatus",
                  "type": "json"
                }
              ],
              "serviceDescription": {
                "outputs": [
                  {
                    "name": "gasDetection",
                    "type": "json"
                  }
                ],
                "provider": {
                  "type": "wsdn"
                },
                "inputs": [
                  {
                    "name": "constructionStatus",
                    "type": "json"
                  }
                ],
                "name": "hazardous_gases_detection",
                "description": "This is the service hazardous_gases_detection",
                "domains": [
                  {
                    "name": "Safety_and_Emergencies",
                    "url": "http://www.surf.scss.tcd.ie/cityOntology/#Safety_and_Emergencies"
                  },
                  {
                    "name": "Construction",
                    "url": "http://www.surf.scss.tcd.ie/cityOntology/#Construction"
                  }
                ],
                "id": "43/hazardous_gases_detection",
                "state": true,
                "url": "http://surf.scss.tcd.ie/_provider_/hazardous_gases_detection"
              },
              "type": "SimpleStep",
              "order": 0
            },
            {
              "outputs": [
                {
                  "name": "constructionStatus",
                  "type": "json"
                }
              ],
              "inputs": [
                {
                  "name": "constructionInfo",
                  "type": "xml"
                }
              ],
              "serviceDescription": {
                "outputs": [
                  {
                    "name": "constructionStatus",
                    "type": "json"
                  }
                ],
                "provider": {
                  "type": "wsdn"
                },
                "inputs": [
                  {
                    "name": "constructionInfo",
                    "type": "xml"
                  }
                ],
                "name": "construction_status",
                "description": "This is the service construction_status",
                "domains": [
                  {
                    "name": "Safety_and_Emergencies",
                    "url": "http://www.surf.scss.tcd.ie/cityOntology/#Safety_and_Emergencies"
                  },
                  {
                    "name": "Construction",
                    "url": "http://www.surf.scss.tcd.ie/cityOntology/#Construction"
                  }
                ],
                "id": "41/construction_status",
                "state": true,
                "url": "http://surf.scss.tcd.ie/_provider_/construction_status"
              },
              "type": "SimpleStep",
              "order": 1
            },
            {
              "outputs": [
                {
                  "name": "constructionInfo",
                  "type": "xml"
                }
              ],
              "inputs": [
                {
                  "name": "constructionMonitoringParameters",
                  "type": "xml"
                }
              ],
              "serviceDescription": {
                "outputs": [
                  {
                    "name": "constructionInfo",
                    "type": "xml"
                  }
                ],
                "provider": {
                  "type": "ws"
                },
                "inputs": [
                  {
                    "name": "constructionMonitoringParameters",
                    "type": "xml"
                  }
                ],
                "name": "construction_monitoring_configurator",
                "description": "This is the service construction_monitoring_configurator",
                "domains": [
                  {
                    "name": "Safety_and_Emergencies",
                    "url": "http://www.surf.scss.tcd.ie/cityOntology/#Safety_and_Emergencies"
                  },
                  {
                    "name": "Construction",
                    "url": "http://www.surf.scss.tcd.ie/cityOntology/#Construction"
                  }
                ],
                "id": "40/construction_monitoring_configurator",
                "state": true,
                "url": "http://surf.scss.tcd.ie/_provider_/construction_monitoring_configurator"
              },
              "type": "SimpleStep",
              "order": 2
            }
          ],
          "order": 0
        }
      ]
    }
  ]
}