{
  "outputs": [
    {
      "name": "_taxedprice",
      "type": "string",
      "desc": "Output of service FastCar TaxedPrice Report service"
    },
    {
      "name": "_report",
      "type": "string",
      "desc": "Output of service FastCar TaxedPrice Report service"
    }
  ],
  "provider": "",
  "inputs": [
    {
      "name": "_fastcar",
      "type": "string",
      "desc": "Input of service FastCar TaxedPrice Report service"
    }
  ],
  "latitude": 0.0,
  "name": "FastCar TaxedPrice Report service",
  "description": "This service returns not only taxed price of a fastcar, but also a short report about its recommendation.",
  "domains": [
    {
      "name": "retail",
      "uri": "http://www.disit.org/km4city/schema#Retail"
    }
  ],
  "id": "retail/fastcar_taxedpricereport_service",
  "state": true,
  "type": "webservice",
  "url": "http://surf.scss.tcd.ie/_provider_/retail/fastcar_taxedpricereport_service",
  "longitude": 0.0
}