{
  "outputs": [
    {
      "name": "busAvailability",
      "type": "json"
    }
  ],
  "qos": [],
  "inputs": [
    {
      "name": "campusZone",
      "type": "json"
    }
  ],
  "domains": [
    {
      "name": "Educational",
      "url": "http://www.surf.scss.tcd.ie/cityOntology/#Educational"
    },
    {
      "name": "Transport_and_Mobility",
      "url": "http://www.surf.scss.tcd.ie/cityOntology/#Transport_and_Mobility"
    }
  ],
  "location": {}
}