{
  "outputs": [
    {
      "name": "patientReadings",
      "type": "json"
    }
  ],
  "qos": [],
  "inputs": [
    {
      "name": "selectedRoute",
      "type": "json"
    }
  ],
  "domains": [
    {
      "name": "Transport_and_Mobility",
      "url": "http://www.surf.scss.tcd.ie/cityOntology/#Transport_and_Mobility"
    },
    {
      "name": "Health",
      "url": "http://www.surf.scss.tcd.ie/cityOntology/#Health"
    }
  ],
  "location": {}
}