{
  "plans": [
    {
      "outputs": [
        {
          "name": "productsDeliveryPlan",
          "type": "json"
        }
      ],
      "inputs": [
        {
          "name": "paymentInfo",
          "type": "xml"
        }
      ],
      "domains": [
        {
          "name": "Food_and_Drinks",
          "url": "http://www.surf.scss.tcd.ie/cityOntology/#Food_and_Drinks"
        },
        {
          "name": "Sport",
          "url": "http://www.surf.scss.tcd.ie/cityOntology/#Sport"
        },
        {
          "name": "Tools",
          "url": "http://www.surf.scss.tcd.ie/cityOntology/#Tools"
        },
        {
          "name": "Furniture_and_Housing",
          "url": "http://www.surf.scss.tcd.ie/cityOntology/#Furniture_and_Housing"
        },
        {
          "name": "Clothing",
          "url": "http://www.surf.scss.tcd.ie/cityOntology/#Clothing"
        },
        {
          "name": "Technology",
          "url": "http://www.surf.scss.tcd.ie/cityOntology/#Technology"
        }
      ],
      "state": 1,
      "steps": [
        {
          "outputs": [
            {
              "name": "productsDeliveryPlan",
              "type": "json"
            }
          ],
          "inputs": [
            {
              "name": "paymentInfo",
              "type": "xml"
            }
          ],
          "serviceDescription": {
            "outputs": [
              {
                "name": "productsDeliveryPlan",
                "type": "json"
              }
            ],
            "provider": {
              "type": "asp"
            },
            "inputs": [
              {
                "name": "paymentInfo",
                "type": "xml"
              }
            ],
            "name": "products_delivery",
            "description": "This is the service products_delivery",
            "domains": [
              {
                "name": "Food_and_Drinks",
                "url": "http://www.surf.scss.tcd.ie/cityOntology/#Food_and_Drinks"
              },
              {
                "name": "Sport",
                "url": "http://www.surf.scss.tcd.ie/cityOntology/#Sport"
              },
              {
                "name": "Tools",
                "url": "http://www.surf.scss.tcd.ie/cityOntology/#Tools"
              },
              {
                "name": "Furniture_and_Housing",
                "url": "http://www.surf.scss.tcd.ie/cityOntology/#Furniture_and_Housing"
              },
              {
                "name": "Clothing",
                "url": "http://www.surf.scss.tcd.ie/cityOntology/#Clothing"
              },
              {
                "name": "Technology",
                "url": "http://www.surf.scss.tcd.ie/cityOntology/#Technology"
              }
            ],
            "id": "136/products_delivery",
            "state": true,
            "url": "http://surf.scss.tcd.ie/_provider_/products_delivery"
          },
          "type": "SimpleStep",
          "order": 0
        }
      ]
    }
  ]
}