{
  "outputs": [
    {
      "name": "temperature",
      "type": "int"
    }
  ],
  "qos": [],
  "inputs": [
    {
      "name": "touristicPath",
      "type": "json"
    },
    {
      "name": "suggestedActivities",
      "type": "json"
    },
    {
      "name": "relatedContent",
      "type": "xml"
    }
  ],
  "domains": [
    {
      "name": "Activity",
      "url": "http://www.surf.scss.tcd.ie/cityOntology/#Activity"
    },
    {
      "name": "Transport_and_Mobility",
      "url": "http://www.surf.scss.tcd.ie/cityOntology/#Transport_and_Mobility"
    }
  ],
  "location": {}
}