{
  "outputs": [
    {
      "name": "packageStatus",
      "type": "json"
    }
  ],
  "qos": [],
  "inputs": [
    {
      "name": "cameraId",
      "type": "long"
    }
  ],
  "domains": [
    {
      "name": "Safety_and_Emergencies",
      "url": "http://www.surf.scss.tcd.ie/cityOntology/#Safety_and_Emergencies"
    },
    {
      "name": "Logistic",
      "url": "http://www.surf.scss.tcd.ie/cityOntology/#Logistic"
    },
    {
      "name": "Communications",
      "url": "http://www.surf.scss.tcd.ie/cityOntology/#Communications"
    }
  ],
  "location": {}
}