{
  "outputs": [
    {
      "name": "products",
      "type": "json"
    }
  ],
  "provider": {
    "type": "wsdn"
  },
  "inputs": [
    {
      "name": "productData",
      "type": "xml"
    }
  ],
  "name": "buy_furniture_products",
  "description": "This is the service buy_furniture_products",
  "domains": [
    {
      "name": "Furniture_and_Housing",
      "url": "http://www.surf.scss.tcd.ie/cityOntology/#Furniture_and_Housing"
    }
  ],
  "id": "133/buy_furniture_products",
  "state": true,
  "url": "http://surf.scss.tcd.ie/_provider_/buy_furniture_products"
}