{
  "outputs": [
    {
      "name": "gunshotAlert",
      "type": "alert"
    }
  ],
  "qos": [],
  "inputs": [
    {
      "name": "touristicPath",
      "type": "json"
    },
    {
      "name": "suggestedActivities",
      "type": "json"
    },
    {
      "name": "relatedContent",
      "type": "xml"
    }
  ],
  "domains": [
    {
      "name": "Activity",
      "url": "http://www.surf.scss.tcd.ie/cityOntology/#Activity"
    },
    {
      "name": "Safety_and_Emergencies",
      "url": "http://www.surf.scss.tcd.ie/cityOntology/#Safety_and_Emergencies"
    }
  ],
  "location": {}
}