{
  "outputs": [
    {
      "name": "_recommendedpriceindollar",
      "type": "string",
      "desc": "Output of service ZAD service"
    }
  ],
  "provider": {
    "type": "asp"
  },
  "inputs": [
    {
      "name": "_preparedfood",
      "type": "string",
      "desc": "Input of service ZAD service"
    }
  ],
  "name": "ZAD service",
  "description": "ZAD is mostly used service that returns recommended price in Bollar of a prepared food.",
  "domains": [
    {
      "name": "Health",
      "url": "http://www.surf.scss.tcd.ie/cityOntology/#Health"
    }
  ],
  "id": "retail/preparedfood_recommendedpriceindollar_service",
  "state": true,
  "url": "http://surf.scss.tcd.ie/_provider_/retail/preparedfood_recommendedpriceindollar_service"
}