{
  "outputs": [
    {
      "name": "_price",
      "type": "string",
      "desc": "Output of service "
    }
  ],
  "provider": "",
  "inputs": [
    {
      "name": "_bicycle",
      "type": "string",
      "desc": "Input of service "
    },
    {
      "name": "_4wheeledcar",
      "type": "string",
      "desc": "Input of service "
    }
  ],
  "latitude": 0.0,
  "name": "",
  "description": "",
  "domains": [
    {
      "name": "retail",
      "uri": "http://www.disit.org/km4city/schema#Retail"
    }
  ],
  "id": "retail/4wheeledcarbicycle_price_service",
  "state": true,
  "type": "asp",
  "url": "http://surf.scss.tcd.ie/_provider_/retail/4wheeledcarbicycle_price_service",
  "longitude": 0.0
}