{
  "outputs": [
    {
      "name": "industryInfo",
      "type": "json"
    }
  ],
  "provider": {
    "type": "wsdn"
  },
  "inputs": [
    {
      "name": "industryId",
      "type": "int"
    }
  ],
  "name": "industry_pollution_monitoring",
  "description": "This is the service industry_pollution_monitoring",
  "domains": [
    {
      "name": "Industry",
      "url": "http://www.surf.scss.tcd.ie/cityOntology/#Industry"
    },
    {
      "name": "Nature",
      "url": "http://www.surf.scss.tcd.ie/cityOntology/#Nature"
    }
  ],
  "id": "118/industry_pollution_monitoring",
  "state": true,
  "url": "http://surf.scss.tcd.ie/_provider_/industry_pollution_monitoring"
}