{
  "outputs": [
    {
      "name": "bookNotification",
      "type": "mail"
    }
  ],
  "qos": [],
  "inputs": [
    {
      "name": "fridgeData",
      "type": "xml"
    }
  ],
  "domains": [
    {
      "name": "Food_and_Drinks",
      "url": "http://www.surf.scss.tcd.ie/cityOntology/#Food_and_Drinks"
    },
    {
      "name": "Accommodation",
      "url": "http://www.surf.scss.tcd.ie/cityOntology/#Accommodation"
    }
  ],
  "location": {}
}