{
  "outputs": [
    {
      "name": "_price",
      "type": "string",
      "desc": "Output of service FoodPriceService"
    }
  ],
  "provider": "",
  "inputs": [
    {
      "name": "_food",
      "type": "string",
      "desc": "Input of service FoodPriceService"
    }
  ],
  "latitude": 0.0,
  "name": "FoodPriceService",
  "description": "This service informs the price of certain food, used for human being.",
  "domains": [
    {
      "name": "retail",
      "uri": "http://www.disit.org/km4city/schema#Retail"
    }
  ],
  "id": "retail/food_price_service",
  "state": true,
  "type": "asp",
  "url": "http://surf.scss.tcd.ie/_provider_/retail/food_price_service",
  "longitude": 0.0
}