{
  "outputs": [
    {
      "name": "augmentedRealityResourcePresentation",
      "type": "multimedia"
    }
  ],
  "qos": [],
  "inputs": [
    {
      "name": "road",
      "type": "string"
    }
  ],
  "domains": [
    {
      "name": "Transport_and_Mobility",
      "url": "http://www.surf.scss.tcd.ie/cityOntology/#Transport_and_Mobility"
    },
    {
      "name": "Educational",
      "url": "http://www.surf.scss.tcd.ie/cityOntology/#Educational"
    }
  ],
  "location": {}
}