{
  "outputs": [
    {
      "name": "riverInfo",
      "type": "json"
    }
  ],
  "qos": [],
  "inputs": [
    {
      "name": "patientId",
      "type": "long"
    }
  ],
  "domains": [
    {
      "name": "Health",
      "url": "http://www.surf.scss.tcd.ie/cityOntology/#Health"
    },
    {
      "name": "Nature",
      "url": "http://www.surf.scss.tcd.ie/cityOntology/#Nature"
    }
  ],
  "location": {}
}