{
  "outputs": [
    {
      "name": "prisionNotification",
      "type": "alert"
    }
  ],
  "qos": [],
  "inputs": [
    {
      "name": "userLocation",
      "type": "json"
    }
  ],
  "domains": [
    {
      "name": "Touristic_Place",
      "url": "http://www.surf.scss.tcd.ie/cityOntology/#Touristic_Place"
    },
    {
      "name": "History",
      "url": "http://www.surf.scss.tcd.ie/cityOntology/#History"
    },
    {
      "name": "Safety_and_Emergencies",
      "url": "http://www.surf.scss.tcd.ie/cityOntology/#Safety_and_Emergencies"
    }
  ],
  "location": {}
}