{
  "outputs": [
    {
      "name": "pollutionInfo",
      "type": "json"
    }
  ],
  "qos": [],
  "inputs": [
    {
      "name": "inventoryData",
      "type": "json"
    }
  ],
  "domains": [
    {
      "name": "Clothing",
      "url": "http://www.surf.scss.tcd.ie/cityOntology/#Clothing"
    },
    {
      "name": "Transport_and_Mobility",
      "url": "http://www.surf.scss.tcd.ie/cityOntology/#Transport_and_Mobility"
    }
  ],
  "location": {}
}