{
  "outputs": [
    {
      "name": "booksInformation",
      "type": "xml"
    }
  ],
  "qos": [],
  "inputs": [
    {
      "name": "transportInfo",
      "type": "json"
    },
    {
      "name": "stadiumMap",
      "type": "interactive"
    },
    {
      "name": "similarResults",
      "type": "json"
    }
  ],
  "domains": [
    {
      "name": "Sport",
      "url": "http://www.surf.scss.tcd.ie/cityOntology/#Sport"
    },
    {
      "name": "Educational",
      "url": "http://www.surf.scss.tcd.ie/cityOntology/#Educational"
    },
    {
      "name": "Research_and_Science",
      "url": "http://www.surf.scss.tcd.ie/cityOntology/#Research_and_Science"
    }
  ],
  "location": {}
}