{
  "outputs": [
    {
      "name": "buildingDashboard",
      "type": "interactive"
    }
  ],
  "qos": [],
  "inputs": [
    {
      "name": "routeParameters",
      "type": "json"
    }
  ],
  "domains": [
    {
      "name": "Transport_and_Mobility",
      "url": "http://www.surf.scss.tcd.ie/cityOntology/#Transport_and_Mobility"
    },
    {
      "name": "Safety_and_Emergencies",
      "url": "http://www.surf.scss.tcd.ie/cityOntology/#Safety_and_Emergencies"
    },
    {
      "name": "Buildings",
      "url": "http://www.surf.scss.tcd.ie/cityOntology/#Buildings"
    }
  ],
  "location": {}
}