{
  "outputs": [
    {
      "name": "binStatus",
      "type": "json"
    }
  ],
  "qos": [],
  "inputs": [
    {
      "name": "productsStatus",
      "type": "json"
    }
  ],
  "domains": [
    {
      "name": "Clothing",
      "url": "http://www.surf.scss.tcd.ie/cityOntology/#Clothing"
    },
    {
      "name": "Waste",
      "url": "http://www.surf.scss.tcd.ie/cityOntology/#Waste"
    }
  ],
  "location": {}
}