{
  "outputs": [
    {
      "name": "stadiumMap",
      "type": "interactive"
    }
  ],
  "qos": [],
  "inputs": [
    {
      "name": "broadcastVideo",
      "type": "streaming"
    }
  ],
  "domains": [
    {
      "name": "Safety_and_Emergencies",
      "url": "http://www.surf.scss.tcd.ie/cityOntology/#Safety_and_Emergencies"
    },
    {
      "name": "Sport",
      "url": "http://www.surf.scss.tcd.ie/cityOntology/#Sport"
    },
    {
      "name": "Leisure",
      "url": "http://www.surf.scss.tcd.ie/cityOntology/#Leisure"
    }
  ],
  "location": {}
}