{
  "outputs": [
    {
      "name": "_map",
      "type": "string",
      "desc": "Output of service RouteFinder Service"
    }
  ],
  "provider": {
    "type": "wsdn"
  },
  "inputs": [
    {
      "name": "_geographical-region",
      "type": "string",
      "desc": "Input of service RouteFinder Service"
    },
    {
      "name": "_geographical-region",
      "type": "string",
      "desc": "Input of service RouteFinder Service"
    }
  ],
  "name": "RouteFinder Service",
  "description": "This service provides all relative paths between two given geographical regions.",
  "domains": [
    {
      "name": "Foundations_and_Charity",
      "url": "http://www.surf.scss.tcd.ie/cityOntology/#Foundations_and_Charity"
    }
  ],
  "id": "mobility/geographical-regiongeographical-region_map_service",
  "state": true,
  "url": "http://surf.scss.tcd.ie/_provider_/mobility/geographical-regiongeographical-region_map_service"
}