{
  "outputs": [
    {
      "name": "buildingDashboard",
      "type": "interactive"
    }
  ],
  "provider": {
    "type": "asp"
  },
  "inputs": [
    {
      "name": "buildingStatus",
      "type": "json"
    },
    {
      "name": "buildingIntrusionAlert",
      "type": "alert"
    }
  ],
  "name": "building_anomaly_detection",
  "description": "This is the service building_anomaly_detection",
  "domains": [
    {
      "name": "Safety_and_Emergencies",
      "url": "http://www.surf.scss.tcd.ie/cityOntology/#Safety_and_Emergencies"
    },
    {
      "name": "Buildings",
      "url": "http://www.surf.scss.tcd.ie/cityOntology/#Buildings"
    }
  ],
  "id": "39/building_anomaly_detection",
  "state": true,
  "url": "http://surf.scss.tcd.ie/_provider_/building_anomaly_detection"
}