{
  "outputs": [
    {
      "name": "packageStatus",
      "type": "json"
    }
  ],
  "qos": [],
  "inputs": [
    {
      "name": "ambulanceRoute",
      "type": "json"
    }
  ],
  "domains": [
    {
      "name": "Communications",
      "url": "http://www.surf.scss.tcd.ie/cityOntology/#Communications"
    },
    {
      "name": "Transport_and_Mobility",
      "url": "http://www.surf.scss.tcd.ie/cityOntology/#Transport_and_Mobility"
    },
    {
      "name": "Logistic",
      "url": "http://www.surf.scss.tcd.ie/cityOntology/#Logistic"
    }
  ],
  "location": {}
}