{
  "outputs": [
    {
      "name": "similarResults",
      "type": "json"
    }
  ],
  "qos": [],
  "inputs": [
    {
      "name": "inventoryData",
      "type": "json"
    }
  ],
  "domains": [
    {
      "name": "Clothing",
      "url": "http://www.surf.scss.tcd.ie/cityOntology/#Clothing"
    },
    {
      "name": "Sport",
      "url": "http://www.surf.scss.tcd.ie/cityOntology/#Sport"
    }
  ],
  "location": {}
}