{
  "outputs": [
    {
      "name": "_lecturer-in-academia",
      "type": "string",
      "desc": "Output of service UniversityLecturerService"
    }
  ],
  "provider": "",
  "inputs": [
    {
      "name": "_university",
      "type": "string",
      "desc": "Input of service UniversityLecturerService"
    }
  ],
  "latitude": 0.0,
  "name": "UniversityLecturerService",
  "description": "It is a recommended service that returns lecturer of a university.",
  "domains": [
    {
      "name": "educational",
      "uri": "http://www.disit.org/km4city/schema#Educational"
    }
  ],
  "id": "educational/university_lecturer-in-academia_service",
  "state": true,
  "type": "asp",
  "url": "http://surf.scss.tcd.ie/_provider_/educational/university_lecturer-in-academia_service",
  "longitude": 0.0
}