{
  "outputs": [
    {
      "name": "_book",
      "type": "string",
      "desc": "Output of service author_bookmaxprice_service"
    },
    {
      "name": "_maxprice",
      "type": "string",
      "desc": "Output of service author_bookmaxprice_service"
    }
  ],
  "provider": {
    "type": "asp"
  },
  "inputs": [
    {
      "name": "_author",
      "type": "string",
      "desc": "Input of service author_bookmaxprice_service"
    }
  ],
  "name": "author_bookmaxprice_service",
  "description": "This service is about retail",
  "domains": [
    {
      "name": "Pharmacy_Products",
      "url": "http://www.surf.scss.tcd.ie/cityOntology/#Pharmacy_Products"
    }
  ],
  "id": "retail/author_bookmaxprice_service",
  "state": true,
  "url": "http://surf.scss.tcd.ie/_provider_/retail/author_bookmaxprice_service"
}