{
  "outputs": [
    {
      "name": "_city",
      "type": "string",
      "desc": "Output of service Sightseeing City Service"
    }
  ],
  "provider": "",
  "inputs": [
    {
      "name": "_sightseeing",
      "type": "string",
      "desc": "Input of service Sightseeing City Service"
    }
  ],
  "latitude": 0.0,
  "name": "Sightseeing City Service",
  "description": "This service returns city for sightseeing.",
  "domains": [],
  "id": "tourism/sightseeing_city_service",
  "state": true,
  "type": "wsdn",
  "url": "http://surf.scss.tcd.ie/_provider_/tourism/sightseeing_city_service",
  "longitude": 0.0
}