{
  "outputs": [
    {
      "name": "_recommendedpriceineuro",
      "type": "string",
      "desc": "Output of service BreadBiscuitPriceService"
    },
    {
      "name": "_taxedpriceineuro",
      "type": "string",
      "desc": "Output of service BreadBiscuitPriceService"
    }
  ],
  "provider": "",
  "inputs": [
    {
      "name": "_breadorbiscuit",
      "type": "string",
      "desc": "Input of service BreadBiscuitPriceService"
    }
  ],
  "latitude": 0.0,
  "name": "BreadBiscuitPriceService",
  "description": "This service returns recommended price and tax price (in euros) of certain bread or biscuit..",
  "domains": [
    {
      "name": "retail",
      "uri": "http://www.disit.org/km4city/schema#Retail"
    }
  ],
  "id": "retail/breadorbiscuit_recommendedpriceineurotaxedpriceineuro_service",
  "state": true,
  "type": "webservice",
  "url": "http://surf.scss.tcd.ie/_provider_/retail/breadorbiscuit_recommendedpriceineurotaxedpriceineuro_service",
  "longitude": 0.0
}