{
  "outputs": [
    {
      "name": "_price",
      "type": "string",
      "desc": "Output of service Car Price quality"
    },
    {
      "name": "_quality",
      "type": "string",
      "desc": "Output of service Car Price quality"
    }
  ],
  "provider": {
    "type": "asp"
  },
  "inputs": [
    {
      "name": "_car",
      "type": "string",
      "desc": "Input of service Car Price quality"
    }
  ],
  "name": "Car Price quality",
  "description": "Car Price quality",
  "domains": [
    {
      "name": "Energy",
      "url": "http://www.surf.scss.tcd.ie/cityOntology/#Energy"
    }
  ],
  "id": "retail/car_pricequality_service",
  "state": true,
  "url": "http://surf.scss.tcd.ie/_provider_/retail/car_pricequality_service"
}