{
  "outputs": [
    {
      "name": "_taxedprice",
      "type": "string",
      "desc": "Output of service car price service"
    },
    {
      "name": "_price",
      "type": "string",
      "desc": "Output of service car price service"
    }
  ],
  "provider": {
    "type": "webservice"
  },
  "inputs": [
    {
      "name": "_car",
      "type": "string",
      "desc": "Input of service car price service"
    }
  ],
  "name": "car price service",
  "description": "This service return not only price of a car, but alsotell how much tax its price includes.",
  "domains": [
    {
      "name": "Accommodation",
      "url": "http://www.surf.scss.tcd.ie/cityOntology/#Accommodation"
    }
  ],
  "id": "retail/car_taxedpriceprice_service",
  "state": true,
  "url": "http://surf.scss.tcd.ie/_provider_/retail/car_taxedpriceprice_service"
}