{
  "outputs": [
    {
      "name": "_hotel",
      "type": "string",
      "desc": "Output of service HotelInfoService"
    }
  ],
  "provider": "",
  "inputs": [
    {
      "name": "_city",
      "type": "string",
      "desc": "Input of service HotelInfoService"
    },
    {
      "name": "_country",
      "type": "string",
      "desc": "Input of service HotelInfoService"
    }
  ],
  "latitude": 0.0,
  "name": "HotelInfoService",
  "description": "It is a reliable service to return hotel of the city of the country",
  "domains": [],
  "id": "tourism/countrycity_hotel_service",
  "state": true,
  "type": "wsdn",
  "url": "http://surf.scss.tcd.ie/_provider_/tourism/countrycity_hotel_service",
  "longitude": 0.0
}