{
  "plans": [
    {
      "outputs": [
        {
          "name": "subjectsList",
          "type": "json"
        }
      ],
      "inputs": [
        {
          "name": "courseStructure",
          "type": "json"
        }
      ],
      "domains": [
        {
          "name": "Educational",
          "url": "http://www.surf.scss.tcd.ie/cityOntology/#Educational"
        }
      ],
      "state": 1,
      "steps": [
        {
          "outputs": [
            {
              "name": "subjectsList",
              "type": "json"
            }
          ],
          "inputs": [
            {
              "name": "courseStructure",
              "type": "json"
            }
          ],
          "serviceDescription": {
            "outputs": [
              {
                "name": "subjectsList",
                "type": "json"
              }
            ],
            "provider": {
              "type": "ws"
            },
            "inputs": [
              {
                "name": "courseStructure",
                "type": "json"
              }
            ],
            "name": "progress_monitoring_service",
            "description": "This is the service progress_monitoring_service",
            "domains": [
              {
                "name": "Educational",
                "url": "http://www.surf.scss.tcd.ie/cityOntology/#Educational"
              }
            ],
            "id": "47/progress_monitoring_service",
            "state": true,
            "url": "http://surf.scss.tcd.ie/_provider_/progress_monitoring_service"
          },
          "type": "SimpleStep",
          "order": 0
        }
      ]
    }
  ]
}