{
  "outputs": [
    {
      "name": "accommodationConfirmation",
      "type": "json"
    }
  ],
  "qos": [],
  "inputs": [
    {
      "name": "offersInfo",
      "type": "json"
    }
  ],
  "domains": [
    {
      "name": "Clothing",
      "url": "http://www.surf.scss.tcd.ie/cityOntology/#Clothing"
    },
    {
      "name": "Accommodation",
      "url": "http://www.surf.scss.tcd.ie/cityOntology/#Accommodation"
    }
  ],
  "location": {}
}