{
  "outputs": [
    {
      "name": "eventVisualisation",
      "type": "interactive"
    }
  ],
  "qos": [],
  "inputs": [
    {
      "name": "patientReadings",
      "type": "json"
    },
    {
      "name": "patientVideo",
      "type": "video"
    }
  ],
  "domains": [
    {
      "name": "Health",
      "url": "http://www.surf.scss.tcd.ie/cityOntology/#Health"
    },
    {
      "name": "Sport",
      "url": "http://www.surf.scss.tcd.ie/cityOntology/#Sport"
    }
  ],
  "location": {}
}