{
  "outputs": [
    {
      "name": "_map",
      "type": "string",
      "desc": "Output of service Route to Berlin Service"
    }
  ],
  "provider": {
    "type": "asp"
  },
  "inputs": [
    {
      "name": "_geographical-region",
      "type": "string",
      "desc": "Input of service Route to Berlin Service"
    }
  ],
  "name": "Route to Berlin Service",
  "description": "If you want to travel to Berlin, the we provide a service to return a mapindicate all paths from your location to Berlin.",
  "domains": [
    {
      "name": "House_Sale_and_Rent",
      "url": "http://www.surf.scss.tcd.ie/cityOntology/#House_Sale_and_Rent"
    }
  ],
  "id": "mobility/geographical-region_map_service",
  "state": true,
  "url": "http://surf.scss.tcd.ie/_provider_/mobility/geographical-region_map_service"
}