{
  "outputs": [
    {
      "name": "products",
      "type": "json"
    }
  ],
  "qos": [],
  "inputs": [
    {
      "name": "streetsInfo",
      "type": "json"
    }
  ],
  "domains": [
    {
      "name": "Government_and_Planning",
      "url": "http://www.surf.scss.tcd.ie/cityOntology/#Government_and_Planning"
    },
    {
      "name": "Nature",
      "url": "http://www.surf.scss.tcd.ie/cityOntology/#Nature"
    },
    {
      "name": "Furniture_and_Housing",
      "url": "http://www.surf.scss.tcd.ie/cityOntology/#Furniture_and_Housing"
    }
  ],
  "location": {}
}