{
  "outputs": [
    {
      "name": "products",
      "type": "json"
    }
  ],
  "qos": [],
  "inputs": [
    {
      "name": "patientAlert",
      "type": "alert"
    }
  ],
  "domains": [
    {
      "name": "Health",
      "url": "http://www.surf.scss.tcd.ie/cityOntology/#Health"
    },
    {
      "name": "Safety_and_Emergencies",
      "url": "http://www.surf.scss.tcd.ie/cityOntology/#Safety_and_Emergencies"
    },
    {
      "name": "Clothing",
      "url": "http://www.surf.scss.tcd.ie/cityOntology/#Clothing"
    }
  ],
  "location": {}
}