{
  "outputs": [
    {
      "name": "industryInfo",
      "type": "json"
    }
  ],
  "qos": [],
  "inputs": [
    {
      "name": "inventoryConfig",
      "type": "json"
    }
  ],
  "domains": [
    {
      "name": "Clothing",
      "url": "http://www.surf.scss.tcd.ie/cityOntology/#Clothing"
    },
    {
      "name": "Industry",
      "url": "http://www.surf.scss.tcd.ie/cityOntology/#Industry"
    },
    {
      "name": "Nature",
      "url": "http://www.surf.scss.tcd.ie/cityOntology/#Nature"
    }
  ],
  "location": {}
}