{
  "outputs": [
    {
      "name": "patientPresentation",
      "type": "interactive"
    }
  ],
  "qos": [],
  "inputs": [
    {
      "name": "activityInfo",
      "type": "xml"
    }
  ],
  "domains": [
    {
      "name": "Activity",
      "url": "http://www.surf.scss.tcd.ie/cityOntology/#Activity"
    },
    {
      "name": "Health",
      "url": "http://www.surf.scss.tcd.ie/cityOntology/#Health"
    }
  ],
  "location": {}
}