{
  "outputs": [
    {
      "name": "configuredGrid",
      "type": "json"
    }
  ],
  "qos": [],
  "inputs": [
    {
      "name": "streetSurveillanceParameters",
      "type": "json"
    }
  ],
  "domains": [
    {
      "name": "Safety_and_Emergencies",
      "url": "http://www.surf.scss.tcd.ie/cityOntology/#Safety_and_Emergencies"
    },
    {
      "name": "Energy",
      "url": "http://www.surf.scss.tcd.ie/cityOntology/#Energy"
    }
  ],
  "location": {}
}