{
  "outputs": [
    {
      "name": "products",
      "type": "json"
    }
  ],
  "provider": {
    "type": "asp"
  },
  "inputs": [
    {
      "name": "presentOffers",
      "type": "interactive"
    }
  ],
  "name": "clothes_selection",
  "description": "This is the service clothes_selection",
  "domains": [
    {
      "name": "Clothing",
      "url": "http://www.surf.scss.tcd.ie/cityOntology/#Clothing"
    }
  ],
  "id": "70/clothes_selection",
  "state": true,
  "url": "http://surf.scss.tcd.ie/_provider_/clothes_selection"
}