{
  "outputs": [
    {
      "name": "_price",
      "type": "string",
      "desc": "Output of service 3wheeledcar year price service"
    }
  ],
  "provider": {
    "type": "webservice"
  },
  "inputs": [
    {
      "name": "_3wheeledcar",
      "type": "string",
      "desc": "Input of service 3wheeledcar year price service"
    },
    {
      "name": "_year",
      "type": "string",
      "desc": "Input of service 3wheeledcar year price service"
    }
  ],
  "name": "3wheeledcar year price service",
  "description": "You can inquire a price of a three wheeled car given the model year.",
  "domains": [
    {
      "name": "Activity",
      "url": "http://www.surf.scss.tcd.ie/cityOntology/#Activity"
    }
  ],
  "id": "retail/3wheeledcaryear_price_service",
  "state": true,
  "url": "http://surf.scss.tcd.ie/_provider_/retail/3wheeledcaryear_price_service"
}