{
  "outputs": [
    {
      "name": "inventoryReport",
      "type": "pdf"
    }
  ],
  "qos": [],
  "inputs": [
    {
      "name": "prisionZone",
      "type": "json"
    }
  ],
  "domains": [
    {
      "name": "Safety_and_Emergencies",
      "url": "http://www.surf.scss.tcd.ie/cityOntology/#Safety_and_Emergencies"
    },
    {
      "name": "Clothing",
      "url": "http://www.surf.scss.tcd.ie/cityOntology/#Clothing"
    }
  ],
  "location": {}
}