{
  "outputs": [
    {
      "name": "alertNotification",
      "type": "alert"
    }
  ],
  "qos": [],
  "inputs": [
    {
      "name": "bookAccommodation",
      "type": "xml"
    }
  ],
  "domains": [
    {
      "name": "Accommodation",
      "url": "http://www.surf.scss.tcd.ie/cityOntology/#Accommodation"
    },
    {
      "name": "Safety_and_Emergencies",
      "url": "http://www.surf.scss.tcd.ie/cityOntology/#Safety_and_Emergencies"
    }
  ],
  "location": {}
}