{
  "outputs": [
    {
      "name": "updatedRoomCalendar",
      "type": "json"
    }
  ],
  "provider": {
    "type": "ws"
  },
  "inputs": [
    {
      "name": "bookedRoom",
      "type": "xml"
    }
  ],
  "name": "update_room_calendar",
  "description": "This is the service update_room_calendar",
  "domains": [
    {
      "name": "Educational",
      "url": "http://www.surf.scss.tcd.ie/cityOntology/#Educational"
    }
  ],
  "id": "67/update_room_calendar",
  "state": true,
  "url": "http://surf.scss.tcd.ie/_provider_/update_room_calendar"
}