{
  "outputs": [
    {
      "name": "roomVideo",
      "type": "stream"
    }
  ],
  "qos": [],
  "inputs": [
    {
      "name": "activityInfo",
      "type": "xml"
    }
  ],
  "domains": [
    {
      "name": "Activity",
      "url": "http://www.surf.scss.tcd.ie/cityOntology/#Activity"
    },
    {
      "name": "Accommodation",
      "url": "http://www.surf.scss.tcd.ie/cityOntology/#Accommodation"
    }
  ],
  "location": {}
}