{
  "outputs": [
    {
      "name": "_weathersystem",
      "type": "string",
      "desc": "Output of service GEWeatherSystemService"
    }
  ],
  "provider": "",
  "inputs": [
    {
      "name": "_geopolitical-entity",
      "type": "string",
      "desc": "Input of service GEWeatherSystemService"
    }
  ],
  "latitude": 0.0,
  "name": "GEWeatherSystemService",
  "description": "This service returns the weather condition, large-scale atmospheric processesthat influence weather in a given region for 2-5 days.",
  "domains": [
    {
      "name": "environmental",
      "uri": "http://www.disit.org/km4city/schema#Environmental"
    }
  ],
  "id": "environmental/geopolitical-entity_weathersystem_service",
  "state": true,
  "type": "webservice",
  "url": "http://surf.scss.tcd.ie/_provider_/environmental/geopolitical-entity_weathersystem_service",
  "longitude": 0.0
}