{
  "outputs": [
    {
      "name": "_report",
      "type": "string",
      "desc": "Output of service car report service"
    }
  ],
  "provider": {
    "type": "webservice"
  },
  "inputs": [
    {
      "name": "_car",
      "type": "string",
      "desc": "Input of service car report service"
    }
  ],
  "name": "car report service",
  "description": "This service supply a critical report of analysis of a car, including its price also.",
  "domains": [
    {
      "name": "Furniture_and_Housing",
      "url": "http://www.surf.scss.tcd.ie/cityOntology/#Furniture_and_Housing"
    }
  ],
  "id": "retail/car_report_service",
  "state": true,
  "url": "http://surf.scss.tcd.ie/_provider_/retail/car_report_service"
}