{
  "outputs": [
    {
      "name": "_hotel",
      "type": "string",
      "desc": "Output of service HotelInfoService"
    }
  ],
  "provider": {
    "type": "webservice"
  },
  "inputs": [
    {
      "name": "_city",
      "type": "string",
      "desc": "Input of service HotelInfoService"
    },
    {
      "name": "_country",
      "type": "string",
      "desc": "Input of service HotelInfoService"
    },
    {
      "name": "_duration",
      "type": "string",
      "desc": "Input of service HotelInfoService"
    }
  ],
  "name": "HotelInfoService",
  "description": "This service tells you that is there any availability of hotel in a city ofthe country during the given duration, the duration is obligatory input.",
  "domains": [
    {
      "name": "Food_and_Drinks",
      "url": "http://www.surf.scss.tcd.ie/cityOntology/#Food_and_Drinks"
    }
  ],
  "id": "tourism/durationcountrycity_hotel_service",
  "state": true,
  "url": "http://surf.scss.tcd.ie/_provider_/tourism/durationcountrycity_hotel_service"
}