{
  "outputs": [
    {
      "name": "_town",
      "type": "string",
      "desc": "Output of service HikingTownService"
    }
  ],
  "provider": {
    "type": "webservice"
  },
  "inputs": [
    {
      "name": "_hiking",
      "type": "string",
      "desc": "Input of service HikingTownService"
    }
  ],
  "name": "HikingTownService",
  "description": "This service returns town for hiking.",
  "domains": [
    {
      "name": "Sport",
      "url": "http://www.surf.scss.tcd.ie/cityOntology/#Sport"
    }
  ],
  "id": "tourism/hiking_town_service",
  "state": true,
  "url": "http://surf.scss.tcd.ie/_provider_/tourism/hiking_town_service"
}