{
  "outputs": [
    {
      "name": "_price",
      "type": "string",
      "desc": "Output of service MianMarkt ShoppingService"
    }
  ],
  "provider": {
    "type": "webservice"
  },
  "inputs": [
    {
      "name": "_agent",
      "type": "string",
      "desc": "Input of service MianMarkt ShoppingService"
    }
  ],
  "name": "MianMarkt ShoppingService",
  "description": "MianMarkt presents a service to get price of prepared food for a certain customer (agent), which is an optional input.",
  "domains": [
    {
      "name": "Safety_and_Emergencies",
      "url": "http://www.surf.scss.tcd.ie/cityOntology/#Safety_and_Emergencies"
    }
  ],
  "id": "retail/agent_price_service",
  "state": true,
  "url": "http://surf.scss.tcd.ie/_provider_/retail/agent_price_service"
}