{
  "outputs": [
    {
      "name": "distribution_map",
      "type": "interactive"
    }
  ],
  "qos": [],
  "inputs": [
    {
      "name": "startAlarm",
      "type": "alarm"
    }
  ],
  "domains": [
    {
      "name": "Safety_and_Emergencies",
      "url": "http://www.surf.scss.tcd.ie/cityOntology/#Safety_and_Emergencies"
    },
    {
      "name": "Transport_and_Mobility",
      "url": "http://www.surf.scss.tcd.ie/cityOntology/#Transport_and_Mobility"
    }
  ],
  "location": {}
}