{
  "outputs": [
    {
      "name": "patientReadings",
      "type": "json"
    }
  ],
  "qos": [],
  "inputs": [
    {
      "name": "displayRoomInfo",
      "type": "json"
    },
    {
      "name": "displayVideo",
      "type": "multimedia"
    }
  ],
  "domains": [
    {
      "name": "Educational",
      "url": "http://www.surf.scss.tcd.ie/cityOntology/#Educational"
    },
    {
      "name": "Health",
      "url": "http://www.surf.scss.tcd.ie/cityOntology/#Health"
    }
  ],
  "location": {}
}