{
  "outputs": [
    {
      "name": "_destination",
      "type": "string",
      "desc": "Output of service Always SurfingDestinationService"
    }
  ],
  "provider": "",
  "inputs": [
    {
      "name": "_surfing",
      "type": "string",
      "desc": "Input of service Always SurfingDestinationService"
    }
  ],
  "latitude": 0.0,
  "name": "Always SurfingDestinationService",
  "description": "Always use this service to know about the destination for surfing.",
  "domains": [],
  "id": "tourism/surfing_destination_service",
  "state": true,
  "type": "asp",
  "url": "http://surf.scss.tcd.ie/_provider_/tourism/surfing_destination_service",
  "longitude": 0.0
}