{
  "outputs": [
    {
      "name": "streetsWaterLevel",
      "type": "json"
    }
  ],
  "qos": [],
  "inputs": [
    {
      "name": "constructionInfo",
      "type": "xml"
    }
  ],
  "domains": [
    {
      "name": "Safety_and_Emergencies",
      "url": "http://www.surf.scss.tcd.ie/cityOntology/#Safety_and_Emergencies"
    },
    {
      "name": "Construction",
      "url": "http://www.surf.scss.tcd.ie/cityOntology/#Construction"
    },
    {
      "name": "Government_and_Planning",
      "url": "http://www.surf.scss.tcd.ie/cityOntology/#Government_and_Planning"
    },
    {
      "name": "Nature",
      "url": "http://www.surf.scss.tcd.ie/cityOntology/#Nature"
    }
  ],
  "location": {}
}