{
  "outputs": [
    {
      "name": "packageStatus",
      "type": "json"
    }
  ],
  "qos": [],
  "inputs": [
    {
      "name": "activityParameters",
      "type": "xml"
    }
  ],
  "domains": [
    {
      "name": "Activity",
      "url": "http://www.surf.scss.tcd.ie/cityOntology/#Activity"
    },
    {
      "name": "Logistic",
      "url": "http://www.surf.scss.tcd.ie/cityOntology/#Logistic"
    },
    {
      "name": "Communications",
      "url": "http://www.surf.scss.tcd.ie/cityOntology/#Communications"
    }
  ],
  "location": {}
}