{
  "outputs": [
    {
      "name": "bookedRoom",
      "type": "xml"
    }
  ],
  "qos": [],
  "inputs": [
    {
      "name": "userLocation",
      "type": "json"
    }
  ],
  "domains": [
    {
      "name": "Touristic_Place",
      "url": "http://www.surf.scss.tcd.ie/cityOntology/#Touristic_Place"
    },
    {
      "name": "History",
      "url": "http://www.surf.scss.tcd.ie/cityOntology/#History"
    },
    {
      "name": "Educational",
      "url": "http://www.surf.scss.tcd.ie/cityOntology/#Educational"
    }
  ],
  "location": {}
}