{
  "outputs": [
    {
      "name": "streetsVideo",
      "type": "video"
    }
  ],
  "qos": [],
  "inputs": [
    {
      "name": "activityInfo",
      "type": "xml"
    }
  ],
  "domains": [
    {
      "name": "Activity",
      "url": "http://www.surf.scss.tcd.ie/cityOntology/#Activity"
    },
    {
      "name": "Government_and_Planning",
      "url": "http://www.surf.scss.tcd.ie/cityOntology/#Government_and_Planning"
    }
  ],
  "location": {}
}