{
  "outputs": [
    {
      "name": "presentOffers",
      "type": "interactive"
    }
  ],
  "qos": [],
  "inputs": [
    {
      "name": "courseParameters",
      "type": "xml"
    }
  ],
  "domains": [
    {
      "name": "Educational",
      "url": "http://www.surf.scss.tcd.ie/cityOntology/#Educational"
    },
    {
      "name": "Clothing",
      "url": "http://www.surf.scss.tcd.ie/cityOntology/#Clothing"
    }
  ],
  "location": {}
}