{
  "outputs": [
    {
      "name": "zoneIntrusionAlert",
      "type": "alert"
    }
  ],
  "qos": [],
  "inputs": [
    {
      "name": "buildingId",
      "type": "long"
    }
  ],
  "domains": [
    {
      "name": "Buildings",
      "url": "http://www.surf.scss.tcd.ie/cityOntology/#Buildings"
    },
    {
      "name": "Safety_and_Emergencies",
      "url": "http://www.surf.scss.tcd.ie/cityOntology/#Safety_and_Emergencies"
    }
  ],
  "location": {}
}