{
  "outputs": [
    {
      "name": "roomVideo",
      "type": "stream"
    }
  ],
  "provider": {
    "type": "asp"
  },
  "inputs": [
    {
      "name": "selectedAccommodation",
      "type": "json"
    }
  ],
  "name": "activate_room_camera",
  "description": "This is the service activate_room_camera",
  "domains": [
    {
      "name": "Accommodation",
      "url": "http://www.surf.scss.tcd.ie/cityOntology/#Accommodation"
    }
  ],
  "id": "84/activate_room_camera",
  "state": true,
  "url": "http://surf.scss.tcd.ie/_provider_/activate_room_camera"
}