{
  "outputs": [
    {
      "name": "_town",
      "type": "string",
      "desc": "Output of service SportsTownService"
    }
  ],
  "provider": "",
  "inputs": [
    {
      "name": "_sports",
      "type": "string",
      "desc": "Input of service SportsTownService"
    }
  ],
  "latitude": 0.0,
  "name": "SportsTownService",
  "description": "This service returns town for sports.",
  "domains": [],
  "id": "tourism/sports_town_service",
  "state": true,
  "type": "webservice",
  "url": "http://surf.scss.tcd.ie/_provider_/tourism/sports_town_service",
  "longitude": 0.0
}