{
  "outputs": [
    {
      "name": "_price",
      "type": "string",
      "desc": "Output of service Vehicle price service"
    }
  ],
  "provider": {
    "type": "wsdn"
  },
  "inputs": [
    {
      "name": "_vehicle",
      "type": "string",
      "desc": "Input of service Vehicle price service"
    }
  ],
  "name": "Vehicle price service",
  "description": "This service is used to get price of a vehicle.",
  "domains": [
    {
      "name": "Pharmacy_Products",
      "url": "http://www.surf.scss.tcd.ie/cityOntology/#Pharmacy_Products"
    }
  ],
  "id": "retail/vehicle_price_service",
  "state": true,
  "url": "http://surf.scss.tcd.ie/_provider_/retail/vehicle_price_service"
}