{
  "outputs": [
    {
      "name": "_price",
      "type": "string",
      "desc": "Output of service Car Price service"
    },
    {
      "name": "_company",
      "type": "string",
      "desc": "Output of service Car Price service"
    }
  ],
  "provider": "",
  "inputs": [
    {
      "name": "_car",
      "type": "string",
      "desc": "Input of service Car Price service"
    },
    {
      "name": "_amount-of-money",
      "type": "string",
      "desc": "Input of service Car Price service"
    }
  ],
  "latitude": 0.0,
  "name": "Car Price service",
  "description": "This service facilitate a client to find a company which offer thesame car within range of given amount of money.",
  "domains": [
    {
      "name": "retail",
      "uri": "http://www.disit.org/km4city/schema#Retail"
    }
  ],
  "id": "retail/amount-of-moneycar_pricecompany_service",
  "state": true,
  "type": "asp",
  "url": "http://surf.scss.tcd.ie/_provider_/retail/amount-of-moneycar_pricecompany_service",
  "longitude": 0.0
}