{
  "outputs": [
    {
      "name": "_author",
      "type": "string",
      "desc": "Output of service Short-Story Author Price Service"
    },
    {
      "name": "_price",
      "type": "string",
      "desc": "Output of service Short-Story Author Price Service"
    }
  ],
  "provider": "",
  "inputs": [
    {
      "name": "_short-story",
      "type": "string",
      "desc": "Input of service Short-Story Author Price Service"
    }
  ],
  "latitude": 0.0,
  "name": "Short-Story Author Price Service",
  "description": "This service returns author and price of a given short-story.",
  "domains": [
    {
      "name": "retail",
      "uri": "http://www.disit.org/km4city/schema#Retail"
    }
  ],
  "id": "retail/short-story_authorprice_service",
  "state": true,
  "type": "asp",
  "url": "http://surf.scss.tcd.ie/_provider_/retail/short-story_authorprice_service",
  "longitude": 0.0
}