{
  "outputs": [
    {
      "name": "energyUsage",
      "type": "json"
    }
  ],
  "qos": [],
  "inputs": [
    {
      "name": "bookAccommodation",
      "type": "xml"
    }
  ],
  "domains": [
    {
      "name": "Accommodation",
      "url": "http://www.surf.scss.tcd.ie/cityOntology/#Accommodation"
    },
    {
      "name": "Buildings",
      "url": "http://www.surf.scss.tcd.ie/cityOntology/#Buildings"
    }
  ],
  "location": {}
}