{
  "outputs": [
    {
      "name": "ambulanceRoute",
      "type": "json"
    }
  ],
  "provider": {
    "type": "asp"
  },
  "inputs": [
    {
      "name": "ambulanceInfo",
      "type": "json"
    }
  ],
  "name": "calculate_ambulance_path",
  "description": "This is the service calculate_ambulance_path",
  "domains": [
    {
      "name": "Transport_and_Mobility",
      "url": "http://www.surf.scss.tcd.ie/cityOntology/#Transport_and_Mobility"
    }
  ],
  "id": "94/calculate_ambulance_path",
  "state": true,
  "url": "http://surf.scss.tcd.ie/_provider_/calculate_ambulance_path"
}