{
  "outputs": [
    {
      "name": "bookNotification",
      "type": "mail"
    }
  ],
  "provider": {
    "type": "ws"
  },
  "inputs": [
    {
      "name": "bookAccommodation",
      "type": "xml"
    }
  ],
  "name": "notify_booking",
  "description": "This is the service notify_booking",
  "domains": [
    {
      "name": "Accommodation",
      "url": "http://www.surf.scss.tcd.ie/cityOntology/#Accommodation"
    }
  ],
  "id": "87/notify_booking",
  "state": true,
  "url": "http://surf.scss.tcd.ie/_provider_/notify_booking"
}