{
  "outputs": [
    {
      "name": "historicContent",
      "type": "xml"
    }
  ],
  "qos": [],
  "inputs": [
    {
      "name": "monitoringConfiguration",
      "type": "json"
    }
  ],
  "domains": [
    {
      "name": "Safety_and_Emergencies",
      "url": "http://www.surf.scss.tcd.ie/cityOntology/#Safety_and_Emergencies"
    },
    {
      "name": "Transport_and_Mobility",
      "url": "http://www.surf.scss.tcd.ie/cityOntology/#Transport_and_Mobility"
    },
    {
      "name": "Government_and_Planning",
      "url": "http://www.surf.scss.tcd.ie/cityOntology/#Government_and_Planning"
    },
    {
      "name": "Touristic_Place",
      "url": "http://www.surf.scss.tcd.ie/cityOntology/#Touristic_Place"
    },
    {
      "name": "History",
      "url": "http://www.surf.scss.tcd.ie/cityOntology/#History"
    }
  ],
  "location": {}
}