{
  "outputs": [
    {
      "name": "waterPollutionInfo",
      "type": "json"
    }
  ],
  "qos": [],
  "inputs": [
    {
      "name": "vehicleConfigured",
      "type": "json"
    }
  ],
  "domains": [
    {
      "name": "Health",
      "url": "http://www.surf.scss.tcd.ie/cityOntology/#Health"
    },
    {
      "name": "Safety_and_Emergencies",
      "url": "http://www.surf.scss.tcd.ie/cityOntology/#Safety_and_Emergencies"
    },
    {
      "name": "Nature",
      "url": "http://www.surf.scss.tcd.ie/cityOntology/#Nature"
    }
  ],
  "location": {}
}