{
  "outputs": [
    {
      "name": "_beach",
      "type": "string",
      "desc": "Output of service Activity Beach Service"
    }
  ],
  "provider": {
    "type": "asp"
  },
  "inputs": [
    {
      "name": "_activity",
      "type": "string",
      "desc": "Input of service Activity Beach Service"
    }
  ],
  "name": "Activity Beach Service",
  "description": "This service returns beach for a given activity.",
  "domains": [
    {
      "name": "Educational",
      "url": "http://www.surf.scss.tcd.ie/cityOntology/#Educational"
    }
  ],
  "id": "tourism/activity_beach_service",
  "state": true,
  "url": "http://surf.scss.tcd.ie/_provider_/tourism/activity_beach_service"
}