{
  "outputs": [
    {
      "name": "prisionVideo",
      "type": "video"
    }
  ],
  "provider": {
    "type": "wsdn"
  },
  "inputs": [
    {
      "name": "prisionZone",
      "type": "json"
    }
  ],
  "name": "prision_video_camera",
  "description": "This is the service prision_video_camera",
  "domains": [
    {
      "name": "Safety_and_Emergencies",
      "url": "http://www.surf.scss.tcd.ie/cityOntology/#Safety_and_Emergencies"
    }
  ],
  "id": "19/prision_video_camera",
  "state": true,
  "url": "http://surf.scss.tcd.ie/_provider_/prision_video_camera"
}