{
  "outputs": [
    {
      "name": "_currency",
      "type": "string",
      "desc": "Output of service ULiPublicationLocatorService"
    },
    {
      "name": "_publication",
      "type": "string",
      "desc": "Output of service ULiPublicationLocatorService"
    }
  ],
  "provider": "",
  "inputs": [
    {
      "name": "_publication-number",
      "type": "string",
      "desc": "Input of service ULiPublicationLocatorService"
    }
  ],
  "latitude": 0.0,
  "name": "ULiPublicationLocatorService",
  "description": "ULi is a reliable service for locating a publication on publication number,it also returns associated currency.",
  "domains": [
    {
      "name": "educational",
      "uri": "http://www.disit.org/km4city/schema#Educational"
    }
  ],
  "id": "educational/publication-number_currencypublication_service",
  "state": true,
  "type": "wsdn",
  "url": "http://surf.scss.tcd.ie/_provider_/educational/publication-number_currencypublication_service",
  "longitude": 0.0
}