{
  "outputs": [
    {
      "name": "presentOffers",
      "type": "interactive"
    }
  ],
  "provider": {
    "type": "asp"
  },
  "inputs": [
    {
      "name": "offersInfo",
      "type": "json"
    }
  ],
  "name": "present_offers_mirror",
  "description": "This is the service present_offers_mirror",
  "domains": [
    {
      "name": "Clothing",
      "url": "http://www.surf.scss.tcd.ie/cityOntology/#Clothing"
    }
  ],
  "id": "69/present_offers_mirror",
  "state": true,
  "url": "http://surf.scss.tcd.ie/_provider_/present_offers_mirror"
}