{
  "outputs": [
    {
      "name": "activityInfo",
      "type": "xml"
    }
  ],
  "provider": {
    "type": "ws"
  },
  "inputs": [
    {
      "name": "activityParameters",
      "type": "xml"
    }
  ],
  "name": "activity_search",
  "description": "This is the service activity_search",
  "domains": [
    {
      "name": "Activity",
      "url": "http://www.surf.scss.tcd.ie/cityOntology/#Activity"
    }
  ],
  "id": "74/activity_search",
  "state": true,
  "url": "http://surf.scss.tcd.ie/_provider_/activity_search"
}