{
  "outputs": [
    {
      "name": "prisionerInfo",
      "type": "json"
    }
  ],
  "qos": [],
  "inputs": [
    {
      "name": "publicArea",
      "type": "json"
    },
    {
      "name": "ligthIntensity",
      "type": "int"
    }
  ],
  "domains": [
    {
      "name": "Transport_and_Mobility",
      "url": "http://www.surf.scss.tcd.ie/cityOntology/#Transport_and_Mobility"
    },
    {
      "name": "Safety_and_Emergencies",
      "url": "http://www.surf.scss.tcd.ie/cityOntology/#Safety_and_Emergencies"
    }
  ],
  "location": {}
}