{
  "outputs": [
    {
      "name": "_price",
      "type": "string",
      "desc": "Output of service 4WheeledCar price service"
    }
  ],
  "provider": "",
  "inputs": [
    {
      "name": "_4wheeledcar",
      "type": "string",
      "desc": "Input of service 4WheeledCar price service"
    }
  ],
  "latitude": 0.0,
  "name": "4WheeledCar price service",
  "description": "Car is a motor vehicle with four wheels; usually propelled by an internal combustion engine.This service informs you price of a four wheeled car.",
  "domains": [
    {
      "name": "retail",
      "uri": "http://www.disit.org/km4city/schema#Retail"
    }
  ],
  "id": "retail/4wheeledcar_price_service",
  "state": true,
  "type": "wsdn",
  "url": "http://surf.scss.tcd.ie/_provider_/retail/4wheeledcar_price_service",
  "longitude": 0.0
}