{
  "outputs": [
    {
      "name": "multimodalRouteMap",
      "type": "interactive"
    }
  ],
  "provider": {
    "type": "ws"
  },
  "inputs": [
    {
      "name": "bikeAvailability",
      "type": "json"
    },
    {
      "name": "busAvailability",
      "type": "json"
    }
  ],
  "name": "multimodal_service",
  "description": "This is the service multimodal_service",
  "domains": [
    {
      "name": "Transport_and_Mobility",
      "url": "http://www.surf.scss.tcd.ie/cityOntology/#Transport_and_Mobility"
    }
  ],
  "id": "9/multimodal_service",
  "state": true,
  "url": "http://surf.scss.tcd.ie/_provider_/multimodal_service"
}