{
  "plans": [
    {
      "outputs": [
        {
          "name": "bookStatus",
          "type": "boolean"
        }
      ],
      "inputs": [
        {
          "name": "booksInformation",
          "type": "xml"
        }
      ],
      "domains": [
        {
          "name": "Educational",
          "url": "http://www.surf.scss.tcd.ie/cityOntology/#Educational"
        },
        {
          "name": "Research_and_Science",
          "url": "http://www.surf.scss.tcd.ie/cityOntology/#Research_and_Science"
        }
      ],
      "state": 1,
      "steps": [
        {
          "outputs": [
            {
              "name": "bookStatus",
              "type": "boolean"
            }
          ],
          "inputs": [
            {
              "name": "booksInformation",
              "type": "xml"
            }
          ],
          "serviceDescription": {
            "outputs": [
              {
                "name": "bookStatus",
                "type": "boolean"
              }
            ],
            "provider": {
              "type": "wsdn"
            },
            "inputs": [
              {
                "name": "booksInformation",
                "type": "xml"
              }
            ],
            "name": "book_status",
            "description": "This is the service book_status",
            "domains": [
              {
                "name": "Educational",
                "url": "http://www.surf.scss.tcd.ie/cityOntology/#Educational"
              },
              {
                "name": "Research_and_Science",
                "url": "http://www.surf.scss.tcd.ie/cityOntology/#Research_and_Science"
              }
            ],
            "id": "56/book_status",
            "state": true,
            "url": "http://surf.scss.tcd.ie/_provider_/book_status"
          },
          "type": "SimpleStep",
          "order": 0
        }
      ]
    }
  ]
}