{
  "outputs": [
    {
      "name": "_weatherprocess",
      "type": "string",
      "desc": "Output of service GeoEntityWeatherProcessService"
    }
  ],
  "provider": {
    "type": "asp"
  },
  "inputs": [
    {
      "name": "_geopolitical-entity",
      "type": "string",
      "desc": "Input of service GeoEntityWeatherProcessService"
    }
  ],
  "name": "GeoEntityWeatherProcessService",
  "description": "This service returns the weather process condition of a given geopolitical entity.",
  "domains": [
    {
      "name": "Tools",
      "url": "http://www.surf.scss.tcd.ie/cityOntology/#Tools"
    }
  ],
  "id": "environmental/geopolitical-entity_weatherprocess_service",
  "state": true,
  "url": "http://surf.scss.tcd.ie/_provider_/environmental/geopolitical-entity_weatherprocess_service"
}