{
  "outputs": [
    {
      "name": "_recommendedprice",
      "type": "string",
      "desc": "Output of service AuthorisedPersonBookRecommendedPrice"
    }
  ],
  "provider": {
    "type": "webservice"
  },
  "inputs": [
    {
      "name": "_person",
      "type": "string",
      "desc": "Input of service AuthorisedPersonBookRecommendedPrice"
    },
    {
      "name": "_book",
      "type": "string",
      "desc": "Input of service AuthorisedPersonBookRecommendedPrice"
    },
    {
      "name": "_creditcardaccount",
      "type": "string",
      "desc": "Input of service AuthorisedPersonBookRecommendedPrice"
    }
  ],
  "name": "AuthorisedPersonBookRecommendedPrice",
  "description": "This service varify account of an authorised person andreturns recommended price of the book.",
  "domains": [
    {
      "name": "Food_and_Drinks",
      "url": "http://www.surf.scss.tcd.ie/cityOntology/#Food_and_Drinks"
    }
  ],
  "id": "retail/creditcardaccountbookperson_recommendedprice_service",
  "state": true,
  "url": "http://surf.scss.tcd.ie/_provider_/retail/creditcardaccountbookperson_recommendedprice_service"
}