{
  "outputs": [
    {
      "name": "_warmfront",
      "type": "string",
      "desc": "Output of service Geopolitica-Entity WarmFront Service"
    }
  ],
  "provider": "",
  "inputs": [
    {
      "name": "_geopolitical-entity",
      "type": "string",
      "desc": "Input of service Geopolitica-Entity WarmFront Service"
    }
  ],
  "latitude": 0.0,
  "name": "Geopolitica-Entity WarmFront Service",
  "description": "This service informs about warmfronts of a given geopolitical entity.",
  "domains": [
    {
      "name": "environmental",
      "uri": "http://www.disit.org/km4city/schema#Environmental"
    }
  ],
  "id": "environmental/geopolitical-entity_warmfront_service",
  "state": true,
  "type": "wsdn",
  "url": "http://surf.scss.tcd.ie/_provider_/environmental/geopolitical-entity_warmfront_service",
  "longitude": 0.0
}