{
  "plans": [
    {
      "outputs": [
        {
          "name": "homeAlarm",
          "type": "audio"
        }
      ],
      "inputs": [
        {
          "name": "alertNotification",
          "type": "alert"
        }
      ],
      "domains": [
        {
          "name": "Safety_and_Emergencies",
          "url": "http://www.surf.scss.tcd.ie/cityOntology/#Safety_and_Emergencies"
        }
      ],
      "state": 1,
      "steps": [
        {
          "outputs": [
            {
              "name": "homeAlarm",
              "type": "audio"
            }
          ],
          "inputs": [
            {
              "name": "alertNotification",
              "type": "alert"
            }
          ],
          "type": "SequentialStep",
          "steps": [
            {
              "outputs": [
                {
                  "name": "homeAlarm",
                  "type": "audio"
                }
              ],
              "inputs": [
                {
                  "name": "startAlarm",
                  "type": "alarm"
                }
              ],
              "serviceDescription": {
                "outputs": [
                  {
                    "name": "homeAlarm",
                    "type": "audio"
                  }
                ],
                "provider": {
                  "type": "wsdn"
                },
                "inputs": [
                  {
                    "name": "startAlarm",
                    "type": "alarm"
                  }
                ],
                "name": "start_home_alarm",
                "description": "This is the service start_home_alarm",
                "domains": [
                  {
                    "name": "Safety_and_Emergencies",
                    "url": "http://www.surf.scss.tcd.ie/cityOntology/#Safety_and_Emergencies"
                  }
                ],
                "id": "35/start_home_alarm",
                "state": true,
                "url": "http://surf.scss.tcd.ie/_provider_/start_home_alarm"
              },
              "type": "SimpleStep",
              "order": 0
            },
            {
              "outputs": [
                {
                  "name": "startAlarm",
                  "type": "alarm"
                }
              ],
              "inputs": [
                {
                  "name": "alertNotification",
                  "type": "alert"
                }
              ],
              "serviceDescription": {
                "outputs": [
                  {
                    "name": "startAlarm",
                    "type": "alarm"
                  }
                ],
                "provider": {
                  "type": "wsdn"
                },
                "inputs": [
                  {
                    "name": "alertNotification",
                    "type": "alert"
                  }
                ],
                "name": "notify_home_owner",
                "description": "This is the service notify_home_owner",
                "domains": [
                  {
                    "name": "Safety_and_Emergencies",
                    "url": "http://www.surf.scss.tcd.ie/cityOntology/#Safety_and_Emergencies"
                  }
                ],
                "id": "34/notify_home_owner",
                "state": true,
                "url": "http://surf.scss.tcd.ie/_provider_/notify_home_owner"
              },
              "type": "SimpleStep",
              "order": 1
            }
          ],
          "order": 0
        }
      ]
    },
    {
      "outputs": [
        {
          "name": "homeAlarm",
          "type": "audio"
        }
      ],
      "inputs": [
        {
          "name": "alertNotification",
          "type": "alert"
        }
      ],
      "domains": [
        {
          "name": "Safety_and_Emergencies",
          "url": "http://www.surf.scss.tcd.ie/cityOntology/#Safety_and_Emergencies"
        }
      ],
      "state": 1,
      "steps": [
        {
          "outputs": [
            {
              "name": "homeAlarm",
              "type": "audio"
            }
          ],
          "inputs": [
            {
              "name": "alertNotification",
              "type": "alert"
            }
          ],
          "type": "SequentialStep",
          "steps": [
            {
              "outputs": [
                {
                  "name": "homeAlarm",
                  "type": "audio"
                }
              ],
              "inputs": [
                {
                  "name": "startAlarm",
                  "type": "alarm"
                }
              ],
              "serviceDescription": {
                "outputs": [
                  {
                    "name": "homeAlarm",
                    "type": "audio"
                  }
                ],
                "provider": {
                  "type": "wsdn"
                },
                "inputs": [
                  {
                    "name": "startAlarm",
                    "type": "alarm"
                  }
                ],
                "name": "start_home_alarm",
                "description": "This is the service start_home_alarm",
                "domains": [
                  {
                    "name": "Safety_and_Emergencies",
                    "url": "http://www.surf.scss.tcd.ie/cityOntology/#Safety_and_Emergencies"
                  }
                ],
                "id": "35/start_home_alarm",
                "state": true,
                "url": "http://surf.scss.tcd.ie/_provider_/start_home_alarm"
              },
              "type": "SimpleStep",
              "order": 0
            },
            {
              "outputs": [
                {
                  "name": "startAlarm",
                  "type": "alarm"
                }
              ],
              "inputs": [
                {
                  "name": "alertNotification",
                  "type": "alert"
                }
              ],
              "serviceDescription": {
                "outputs": [
                  {
                    "name": "startAlarm",
                    "type": "alarm"
                  }
                ],
                "provider": {
                  "type": "wsdn"
                },
                "inputs": [
                  {
                    "name": "alertNotification",
                    "type": "alert"
                  }
                ],
                "name": "notify_police",
                "description": "This is the service notify_police",
                "domains": [
                  {
                    "name": "Safety_and_Emergencies",
                    "url": "http://www.surf.scss.tcd.ie/cityOntology/#Safety_and_Emergencies"
                  }
                ],
                "id": "33/notify_police",
                "state": true,
                "url": "http://surf.scss.tcd.ie/_provider_/notify_police"
              },
              "type": "SimpleStep",
              "order": 1
            }
          ],
          "order": 0
        }
      ]
    }
  ]
}