{
  "outputs": [
    {
      "name": "eventTicketsInfo",
      "type": "json"
    }
  ],
  "qos": [],
  "inputs": [
    {
      "name": "studentsInfo",
      "type": "json"
    }
  ],
  "domains": [
    {
      "name": "Educational",
      "url": "http://www.surf.scss.tcd.ie/cityOntology/#Educational"
    },
    {
      "name": "Sport",
      "url": "http://www.surf.scss.tcd.ie/cityOntology/#Sport"
    },
    {
      "name": "Leisure",
      "url": "http://www.surf.scss.tcd.ie/cityOntology/#Leisure"
    }
  ],
  "location": {}
}