{
  "outputs": [
    {
      "name": "startAlarm",
      "type": "alarm"
    }
  ],
  "qos": [],
  "inputs": [
    {
      "name": "patientId",
      "type": "long"
    }
  ],
  "domains": [
    {
      "name": "Health",
      "url": "http://www.surf.scss.tcd.ie/cityOntology/#Health"
    },
    {
      "name": "Safety_and_Emergencies",
      "url": "http://www.surf.scss.tcd.ie/cityOntology/#Safety_and_Emergencies"
    }
  ],
  "location": {}
}