{
  "outputs": [
    {
      "name": "callTaxi",
      "type": "call"
    }
  ],
  "qos": [],
  "inputs": [
    {
      "name": "productData",
      "type": "xml"
    }
  ],
  "domains": [
    {
      "name": "Tools",
      "url": "http://www.surf.scss.tcd.ie/cityOntology/#Tools"
    },
    {
      "name": "Transport_and_Mobility",
      "url": "http://www.surf.scss.tcd.ie/cityOntology/#Transport_and_Mobility"
    }
  ],
  "location": {}
}