{
  "plans": [
    {
      "outputs": [
        {
          "name": "place",
          "type": "json"
        }
      ],
      "inputs": [
        {
          "name": "cityZoneToMonitor",
          "type": "json"
        },
        {
          "name": "cityZoneToMonitor",
          "type": "json"
        },
        {
          "name": "cityZoneToMonitor",
          "type": "json"
        }
      ],
      "domains": [
        {
          "name": "Safety_and_Emergencies",
          "url": "http://www.surf.scss.tcd.ie/cityOntology/#Safety_and_Emergencies"
        },
        {
          "name": "Safety_and_Emergencies",
          "url": "http://www.surf.scss.tcd.ie/cityOntology/#Safety_and_Emergencies"
        },
        {
          "name": "Safety_and_Emergencies",
          "url": "http://www.surf.scss.tcd.ie/cityOntology/#Safety_and_Emergencies"
        }
      ],
      "state": 1,
      "steps": [
        {
          "outputs": [
            {
              "name": "place",
              "type": "json"
            }
          ],
          "inputs": [
            {
              "name": "gunshotAlert",
              "type": "alert"
            },
            {
              "name": "zoneIntrusionAlert",
              "type": "alert"
            },
            {
              "name": "report",
              "type": "json"
            }
          ],
          "type": "SequentialStep",
          "steps": [
            {
              "outputs": [
                {
                  "name": "place",
                  "type": "json"
                }
              ],
              "inputs": [
                {
                  "name": "gunshotAlert",
                  "type": "alert"
                },
                {
                  "name": "zoneIntrusionAlert",
                  "type": "alert"
                },
                {
                  "name": "report",
                  "type": "json"
                }
              ],
              "serviceDescription": {
                "outputs": [
                  {
                    "name": "place",
                    "type": "json"
                  }
                ],
                "provider": {
                  "type": "ws"
                },
                "inputs": [
                  {
                    "name": "gunshotAlert",
                    "type": "alert"
                  },
                  {
                    "name": "zoneIntrusionAlert",
                    "type": "alert"
                  },
                  {
                    "name": "report",
                    "type": "json"
                  }
                ],
                "name": "street_anomaly_detection",
                "description": "This is the service street_anomaly_detection",
                "domains": [
                  {
                    "name": "Safety_and_Emergencies",
                    "url": "http://www.surf.scss.tcd.ie/cityOntology/#Safety_and_Emergencies"
                  }
                ],
                "id": "25/street_anomaly_detection",
                "state": true,
                "url": "http://surf.scss.tcd.ie/_provider_/street_anomaly_detection"
              },
              "type": "SimpleStep",
              "order": 0
            }
          ],
          "order": 0
        },
        {
          "outputs": [
            {
              "name": "zoneIntrusionAlert",
              "type": "alert"
            },
            {
              "name": "gunshotAlert",
              "type": "alert"
            }
          ],
          "inputs": [
            {
              "name": "cityZoneToMonitor",
              "type": "json"
            },
            {
              "name": "cityZoneToMonitor",
              "type": "json"
            },
            {
              "name": "cityZoneToMonitor",
              "type": "json"
            }
          ],
          "type": "ParallelStep",
          "steps": [
            {
              "outputs": [
                {
                  "name": "zoneIntrusionAlert",
                  "type": "alert"
                }
              ],
              "inputs": [
                {
                  "name": "cityZoneToMonitor",
                  "type": "json"
                }
              ],
              "type": "SequentialStep",
              "steps": [
                {
                  "outputs": [
                    {
                      "name": "zoneIntrusionAlert",
                      "type": "alert"
                    }
                  ],
                  "inputs": [
                    {
                      "name": "cityZoneToMonitor",
                      "type": "json"
                    }
                  ],
                  "serviceDescription": {
                    "outputs": [
                      {
                        "name": "zoneIntrusionAlert",
                        "type": "alert"
                      }
                    ],
                    "provider": {
                      "type": "wsdn"
                    },
                    "inputs": [
                      {
                        "name": "cityZoneToMonitor",
                        "type": "json"
                      }
                    ],
                    "name": "zone_intruder_detection",
                    "description": "This is the service zone_intruder_detection",
                    "domains": [
                      {
                        "name": "Safety_and_Emergencies",
                        "url": "http://www.surf.scss.tcd.ie/cityOntology/#Safety_and_Emergencies"
                      }
                    ],
                    "id": "23/zone_intruder_detection",
                    "state": true,
                    "url": "http://surf.scss.tcd.ie/_provider_/zone_intruder_detection"
                  },
                  "type": "SimpleStep",
                  "order": 0
                }
              ],
              "order": 0
            },
            {
              "outputs": [
                {
                  "name": "gunshotAlert",
                  "type": "alert"
                }
              ],
              "inputs": [
                {
                  "name": "cityZoneToMonitor",
                  "type": "json"
                }
              ],
              "type": "SequentialStep",
              "steps": [
                {
                  "outputs": [
                    {
                      "name": "gunshotAlert",
                      "type": "alert"
                    }
                  ],
                  "inputs": [
                    {
                      "name": "cityZoneToMonitor",
                      "type": "json"
                    }
                  ],
                  "serviceDescription": {
                    "outputs": [
                      {
                        "name": "gunshotAlert",
                        "type": "alert"
                      }
                    ],
                    "provider": {
                      "type": "wsdn"
                    },
                    "inputs": [
                      {
                        "name": "cityZoneToMonitor",
                        "type": "json"
                      }
                    ],
                    "name": "gunshot_detection",
                    "description": "This is the service gunshot_detection",
                    "domains": [
                      {
                        "name": "Safety_and_Emergencies",
                        "url": "http://www.surf.scss.tcd.ie/cityOntology/#Safety_and_Emergencies"
                      }
                    ],
                    "id": "22/gunshot_detection",
                    "state": true,
                    "url": "http://surf.scss.tcd.ie/_provider_/gunshot_detection"
                  },
                  "type": "SimpleStep",
                  "order": 0
                }
              ],
              "order": 1
            },
            {
              "outputs": [
                {
                  "name": "report",
                  "type": "json"
                }
              ],
              "inputs": [
                {
                  "name": "cityZoneToMonitor",
                  "type": "json"
                }
              ],
              "type": "SequentialStep",
              "steps": [
                {
                  "outputs": [
                    {
                      "name": "report",
                      "type": "json"
                    }
                  ],
                  "inputs": [
                    {
                      "name": "cityZoneToMonitor",
                      "type": "json"
                    }
                  ],
                  "serviceDescription": {
                    "outputs": [
                      {
                        "name": "report",
                        "type": "json"
                      }
                    ],
                    "provider": {
                      "type": "ws"
                    },
                    "inputs": [
                      {
                        "name": "cityZoneToMonitor",
                        "type": "json"
                      }
                    ],
                    "name": "criminal_history",
                    "description": "This is the service criminal_history",
                    "domains": [
                      {
                        "name": "Safety_and_Emergencies",
                        "url": "http://www.surf.scss.tcd.ie/cityOntology/#Safety_and_Emergencies"
                      }
                    ],
                    "id": "24/criminal_history",
                    "state": true,
                    "url": "http://surf.scss.tcd.ie/_provider_/criminal_history"
                  },
                  "type": "SimpleStep",
                  "order": 0
                }
              ],
              "order": 0
            }
          ],
          "order": 1
        }
      ]
    }
  ]
}