{
  "outputs": [
    {
      "name": "buildingIntrusionAlert",
      "type": "alert"
    }
  ],
  "qos": [],
  "inputs": [
    {
      "name": "fridgeData",
      "type": "xml"
    }
  ],
  "domains": [
    {
      "name": "Food_and_Drinks",
      "url": "http://www.surf.scss.tcd.ie/cityOntology/#Food_and_Drinks"
    },
    {
      "name": "Safety_and_Emergencies",
      "url": "http://www.surf.scss.tcd.ie/cityOntology/#Safety_and_Emergencies"
    },
    {
      "name": "Buildings",
      "url": "http://www.surf.scss.tcd.ie/cityOntology/#Buildings"
    }
  ],
  "location": {}
}