{
  "outputs": [
    {
      "name": "_price",
      "type": "string",
      "desc": "Output of service FoodPriceService"
    }
  ],
  "provider": {
    "type": "webservice"
  },
  "inputs": [
    {
      "name": "_food",
      "type": "string",
      "desc": "Input of service FoodPriceService"
    }
  ],
  "name": "FoodPriceService",
  "description": "This service informs the price of certain food, used for human being.",
  "domains": [
    {
      "name": "Government_and_Planning",
      "url": "http://www.surf.scss.tcd.ie/cityOntology/#Government_and_Planning"
    }
  ],
  "id": "retail/food_price_service",
  "state": true,
  "url": "http://surf.scss.tcd.ie/_provider_/retail/food_price_service"
}