{
  "outputs": [
    {
      "name": "_price",
      "type": "string",
      "desc": "Output of service 4wheeledcar year price report service"
    },
    {
      "name": "_report",
      "type": "string",
      "desc": "Output of service 4wheeledcar year price report service"
    }
  ],
  "provider": {
    "type": "asp"
  },
  "inputs": [
    {
      "name": "_4wheeledcar",
      "type": "string",
      "desc": "Input of service 4wheeledcar year price report service"
    },
    {
      "name": "_year",
      "type": "string",
      "desc": "Input of service 4wheeledcar year price report service"
    }
  ],
  "name": "4wheeledcar year price report service",
  "description": "You can inquire a price of a four wheeled car given the model year. This service returns also a short reportabout the car\u0027s recommendation.",
  "domains": [
    {
      "name": "Sport",
      "url": "http://www.surf.scss.tcd.ie/cityOntology/#Sport"
    }
  ],
  "id": "retail/4wheeledcaryear_pricereport_service",
  "state": true,
  "url": "http://surf.scss.tcd.ie/_provider_/retail/4wheeledcaryear_pricereport_service"
}