{
  "plans": [
    {
      "outputs": [
        {
          "name": "updatedRoomCalendar",
          "type": "json"
        }
      ],
      "inputs": [
        {
          "name": "displayRoomInfo",
          "type": "json"
        },
        {
          "name": "displayVideo",
          "type": "multimedia"
        }
      ],
      "domains": [
        {
          "name": "Educational",
          "url": "http://www.surf.scss.tcd.ie/cityOntology/#Educational"
        }
      ],
      "state": 1,
      "steps": [
        {
          "outputs": [
            {
              "name": "updatedRoomCalendar",
              "type": "json"
            }
          ],
          "inputs": [
            {
              "name": "displayRoomInfo",
              "type": "json"
            },
            {
              "name": "displayVideo",
              "type": "multimedia"
            }
          ],
          "type": "SequentialStep",
          "steps": [
            {
              "outputs": [
                {
                  "name": "updatedRoomCalendar",
                  "type": "json"
                }
              ],
              "inputs": [
                {
                  "name": "bookedRoom",
                  "type": "xml"
                }
              ],
              "serviceDescription": {
                "outputs": [
                  {
                    "name": "updatedRoomCalendar",
                    "type": "json"
                  }
                ],
                "provider": {
                  "type": "ws"
                },
                "inputs": [
                  {
                    "name": "bookedRoom",
                    "type": "xml"
                  }
                ],
                "name": "update_room_calendar",
                "description": "This is the service update_room_calendar",
                "domains": [
                  {
                    "name": "Educational",
                    "url": "http://www.surf.scss.tcd.ie/cityOntology/#Educational"
                  }
                ],
                "id": "67/update_room_calendar",
                "state": true,
                "url": "http://surf.scss.tcd.ie/_provider_/update_room_calendar"
              },
              "type": "SimpleStep",
              "order": 0
            },
            {
              "outputs": [
                {
                  "name": "bookedRoom",
                  "type": "xml"
                }
              ],
              "inputs": [
                {
                  "name": "displayRoomInfo",
                  "type": "json"
                },
                {
                  "name": "displayVideo",
                  "type": "multimedia"
                }
              ],
              "serviceDescription": {
                "outputs": [
                  {
                    "name": "bookedRoom",
                    "type": "xml"
                  }
                ],
                "provider": {
                  "type": "asp"
                },
                "inputs": [
                  {
                    "name": "displayRoomInfo",
                    "type": "json"
                  },
                  {
                    "name": "displayVideo",
                    "type": "multimedia"
                  }
                ],
                "name": "book_room_campus",
                "description": "This is the service book_room_campus",
                "domains": [
                  {
                    "name": "Educational",
                    "url": "http://www.surf.scss.tcd.ie/cityOntology/#Educational"
                  }
                ],
                "id": "66/book_room_campus",
                "state": true,
                "url": "http://surf.scss.tcd.ie/_provider_/book_room_campus"
              },
              "type": "SimpleStep",
              "order": 1
            }
          ],
          "order": 0
        }
      ]
    }
  ]
}