{
  "outputs": [
    {
      "name": "_maxprice",
      "type": "string",
      "desc": "Output of service PreparedFood MaxPrice Service"
    }
  ],
  "provider": "",
  "inputs": [
    {
      "name": "_preparedfood",
      "type": "string",
      "desc": "Input of service PreparedFood MaxPrice Service"
    }
  ],
  "latitude": 0.0,
  "name": "PreparedFood MaxPrice Service",
  "description": "This service returns max price of certain prepared food.",
  "domains": [
    {
      "name": "retail",
      "uri": "http://www.disit.org/km4city/schema#Retail"
    }
  ],
  "id": "retail/preparedfood_maxprice_service",
  "state": true,
  "type": "wsdn",
  "url": "http://surf.scss.tcd.ie/_provider_/retail/preparedfood_maxprice_service",
  "longitude": 0.0
}