{
  "outputs": [
    {
      "name": "streetsWaterLevel",
      "type": "json"
    }
  ],
  "qos": [],
  "inputs": [
    {
      "name": "accommodationConfirmation",
      "type": "json"
    }
  ],
  "domains": [
    {
      "name": "Accommodation",
      "url": "http://www.surf.scss.tcd.ie/cityOntology/#Accommodation"
    },
    {
      "name": "Government_and_Planning",
      "url": "http://www.surf.scss.tcd.ie/cityOntology/#Government_and_Planning"
    },
    {
      "name": "Nature",
      "url": "http://www.surf.scss.tcd.ie/cityOntology/#Nature"
    }
  ],
  "location": {}
}