{
  "outputs": [
    {
      "name": "transportInfo",
      "type": "json"
    }
  ],
  "qos": [],
  "inputs": [
    {
      "name": "eventTicketsInfo",
      "type": "json"
    }
  ],
  "domains": [
    {
      "name": "Sport",
      "url": "http://www.surf.scss.tcd.ie/cityOntology/#Sport"
    },
    {
      "name": "Transport_and_Mobility",
      "url": "http://www.surf.scss.tcd.ie/cityOntology/#Transport_and_Mobility"
    }
  ],
  "location": {}
}