{
  "outputs": [
    {
      "name": "_beach",
      "type": "string",
      "desc": "Output of service SportsBeachService"
    }
  ],
  "provider": "",
  "inputs": [
    {
      "name": "_sports",
      "type": "string",
      "desc": "Input of service SportsBeachService"
    }
  ],
  "latitude": 0.0,
  "name": "SportsBeachService",
  "description": "This is a recommended service to know aboutthe beach for the beach sports.",
  "domains": [],
  "id": "tourism/sports_beach_service",
  "state": true,
  "type": "webservice",
  "url": "http://surf.scss.tcd.ie/_provider_/tourism/sports_beach_service",
  "longitude": 0.0
}