{
  "outputs": [
    {
      "name": "homeIntrusionAlert",
      "type": "alert"
    }
  ],
  "provider": {
    "type": "wsdn"
  },
  "inputs": [
    {
      "name": "homeInformation",
      "type": "json"
    }
  ],
  "name": "home_intruder_detection",
  "description": "This is the service home_intruder_detection",
  "domains": [
    {
      "name": "Safety_and_Emergencies",
      "url": "http://www.surf.scss.tcd.ie/cityOntology/#Safety_and_Emergencies"
    }
  ],
  "id": "30/home_intruder_detection",
  "state": true,
  "url": "http://surf.scss.tcd.ie/_provider_/home_intruder_detection"
}