{
  "outputs": [
    {
      "name": "_hotel",
      "type": "string",
      "desc": "Output of service CityHotelInfoService"
    }
  ],
  "provider": {
    "type": "asp"
  },
  "inputs": [
    {
      "name": "_city",
      "type": "string",
      "desc": "Input of service CityHotelInfoService"
    }
  ],
  "name": "CityHotelInfoService",
  "description": "This service returns hotel of the city of Saarland state of the germany.",
  "domains": [
    {
      "name": "Activity",
      "url": "http://www.surf.scss.tcd.ie/cityOntology/#Activity"
    }
  ],
  "id": "tourism/city_hotel_service",
  "state": true,
  "url": "http://surf.scss.tcd.ie/_provider_/tourism/city_hotel_service"
}