{
  "outputs": [
    {
      "name": "_icon",
      "type": "string",
      "desc": "Output of service LocationTravelInfo Service"
    }
  ],
  "provider": "",
  "inputs": [
    {
      "name": "_location",
      "type": "string",
      "desc": "Input of service LocationTravelInfo Service"
    }
  ],
  "latitude": 0.0,
  "name": "LocationTravelInfo Service",
  "description": "This service returns a set of icons reprsent roadway signs in the given location, andalso photographs of the location.",
  "domains": [
    {
      "name": "mobility",
      "uri": "http://www.disit.org/km4city/schema#Mobility"
    }
  ],
  "id": "mobility/location_icon_service",
  "state": true,
  "type": "asp",
  "url": "http://surf.scss.tcd.ie/_provider_/mobility/location_icon_service",
  "longitude": 0.0
}