{
  "outputs": [
    {
      "name": "bookAccommodation",
      "type": "xml"
    }
  ],
  "provider": {
    "type": "asp"
  },
  "inputs": [
    {
      "name": "accommodationConfirmation",
      "type": "json"
    }
  ],
  "name": "book_accommodation",
  "description": "This is the service book_accommodation",
  "domains": [
    {
      "name": "Accommodation",
      "url": "http://www.surf.scss.tcd.ie/cityOntology/#Accommodation"
    }
  ],
  "id": "86/book_accommodation",
  "state": true,
  "url": "http://surf.scss.tcd.ie/_provider_/book_accommodation"
}