{
  "outputs": [
    {
      "name": "stadiumMap",
      "type": "interactive"
    }
  ],
  "qos": [],
  "inputs": [
    {
      "name": "industryId",
      "type": "int"
    }
  ],
  "domains": [
    {
      "name": "Industry",
      "url": "http://www.surf.scss.tcd.ie/cityOntology/#Industry"
    },
    {
      "name": "Nature",
      "url": "http://www.surf.scss.tcd.ie/cityOntology/#Nature"
    },
    {
      "name": "Sport",
      "url": "http://www.surf.scss.tcd.ie/cityOntology/#Sport"
    },
    {
      "name": "Leisure",
      "url": "http://www.surf.scss.tcd.ie/cityOntology/#Leisure"
    }
  ],
  "location": {}
}