{
  "outputs": [
    {
      "name": "bikeAvailability",
      "type": "json"
    }
  ],
  "provider": {
    "type": "wsdn"
  },
  "inputs": [
    {
      "name": "routeParameters",
      "type": "json"
    }
  ],
  "name": "bike_availability",
  "description": "This is the service bike_availability",
  "domains": [
    {
      "name": "Transport_and_Mobility",
      "url": "http://www.surf.scss.tcd.ie/cityOntology/#Transport_and_Mobility"
    }
  ],
  "id": "7/bike_availability",
  "state": true,
  "url": "http://surf.scss.tcd.ie/_provider_/bike_availability"
}