{
  "outputs": [
    {
      "name": "_publication",
      "type": "string",
      "desc": "Output of service PublicationFinderService"
    },
    {
      "name": "_author",
      "type": "string",
      "desc": "Output of service PublicationFinderService"
    }
  ],
  "provider": {
    "type": "wsdn"
  },
  "inputs": [
    {
      "name": "_publication-number",
      "type": "string",
      "desc": "Input of service PublicationFinderService"
    }
  ],
  "name": "PublicationFinderService",
  "description": "This service finds a publication on publication number,it also returns also its author.",
  "domains": [
    {
      "name": "House_Sale_and_Rent",
      "url": "http://www.surf.scss.tcd.ie/cityOntology/#House_Sale_and_Rent"
    }
  ],
  "id": "educational/publication-number_publicationauthor_service",
  "state": true,
  "url": "http://surf.scss.tcd.ie/_provider_/educational/publication-number_publicationauthor_service"
}