{
  "outputs": [
    {
      "name": "_price",
      "type": "string",
      "desc": "Output of service 3Wheeled Car price service"
    }
  ],
  "provider": {
    "type": "wsdn"
  },
  "inputs": [
    {
      "name": "_3wheeledcar",
      "type": "string",
      "desc": "Input of service 3Wheeled Car price service"
    }
  ],
  "name": "3Wheeled Car price service",
  "description": "you can inquire a price of a three wheeled car.",
  "domains": [
    {
      "name": "Educational",
      "url": "http://www.surf.scss.tcd.ie/cityOntology/#Educational"
    }
  ],
  "id": "retail/3wheeledcar_price_service",
  "state": true,
  "url": "http://surf.scss.tcd.ie/_provider_/retail/3wheeledcar_price_service"
}