{
  "outputs": [
    {
      "name": "_weatherseason",
      "type": "string",
      "desc": "Output of service GEWS Service"
    }
  ],
  "provider": {
    "type": "asp"
  },
  "inputs": [
    {
      "name": "_geopolitical-entity",
      "type": "string",
      "desc": "Input of service GEWS Service"
    }
  ],
  "name": "GEWS Service",
  "description": "GEWS service is used to get season report of a particular geogrphical entity.",
  "domains": [
    {
      "name": "Accommodation",
      "url": "http://www.surf.scss.tcd.ie/cityOntology/#Accommodation"
    }
  ],
  "id": "environmental/geopolitical-entity_weatherseason_service",
  "state": true,
  "url": "http://surf.scss.tcd.ie/_provider_/environmental/geopolitical-entity_weatherseason_service"
}