{
  "outputs": [
    {
      "name": "patientProfile",
      "type": "json"
    }
  ],
  "provider": {
    "type": "ws"
  },
  "inputs": [
    {
      "name": "patientId",
      "type": "long"
    }
  ],
  "name": "patient_profile",
  "description": "This is the service patient_profile",
  "domains": [
    {
      "name": "Health",
      "url": "http://www.surf.scss.tcd.ie/cityOntology/#Health"
    }
  ],
  "id": "88/patient_profile",
  "state": true,
  "url": "http://surf.scss.tcd.ie/_provider_/patient_profile"
}