{
  "outputs": [
    {
      "name": "studentActivityInfo",
      "type": "json"
    }
  ],
  "qos": [],
  "inputs": [
    {
      "name": "searchInfo",
      "type": "json"
    }
  ],
  "domains": [
    {
      "name": "Educational",
      "url": "http://www.surf.scss.tcd.ie/cityOntology/#Educational"
    },
    {
      "name": "Research_and_Science",
      "url": "http://www.surf.scss.tcd.ie/cityOntology/#Research_and_Science"
    }
  ],
  "location": {}
}