{
  "outputs": [
    {
      "name": "atmDashboard",
      "type": "interactive"
    }
  ],
  "qos": [],
  "inputs": [
    {
      "name": "historicPlaceInfo",
      "type": "xml"
    }
  ],
  "domains": [
    {
      "name": "Touristic_Place",
      "url": "http://www.surf.scss.tcd.ie/cityOntology/#Touristic_Place"
    },
    {
      "name": "History",
      "url": "http://www.surf.scss.tcd.ie/cityOntology/#History"
    },
    {
      "name": "Safety_and_Emergencies",
      "url": "http://www.surf.scss.tcd.ie/cityOntology/#Safety_and_Emergencies"
    },
    {
      "name": "Finance",
      "url": "http://www.surf.scss.tcd.ie/cityOntology/#Finance"
    }
  ],
  "location": {}
}