{
  "outputs": [
    {
      "name": "_price",
      "type": "string",
      "desc": "Output of service AuthorisedPersonBookPrice"
    }
  ],
  "provider": {
    "type": "webservice"
  },
  "inputs": [
    {
      "name": "_person",
      "type": "string",
      "desc": "Input of service AuthorisedPersonBookPrice"
    },
    {
      "name": "_book",
      "type": "string",
      "desc": "Input of service AuthorisedPersonBookPrice"
    },
    {
      "name": "_creditcardaccount",
      "type": "string",
      "desc": "Input of service AuthorisedPersonBookPrice"
    }
  ],
  "name": "AuthorisedPersonBookPrice",
  "description": "This service varify account of an authorised person andreturns current price of the book.",
  "domains": [
    {
      "name": "Research_and_Science",
      "url": "http://www.surf.scss.tcd.ie/cityOntology/#Research_and_Science"
    }
  ],
  "id": "retail/creditcardaccountbookperson_price_service",
  "state": true,
  "url": "http://surf.scss.tcd.ie/_provider_/retail/creditcardaccountbookperson_price_service"
}