{
  "outputs": [
    {
      "name": "products",
      "type": "json"
    }
  ],
  "qos": [],
  "inputs": [
    {
      "name": "homeSurveillanceParameters",
      "type": "json"
    }
  ],
  "domains": [
    {
      "name": "Safety_and_Emergencies",
      "url": "http://www.surf.scss.tcd.ie/cityOntology/#Safety_and_Emergencies"
    },
    {
      "name": "Technology",
      "url": "http://www.surf.scss.tcd.ie/cityOntology/#Technology"
    }
  ],
  "location": {}
}