{
  "outputs": [
    {
      "name": "touristicPath",
      "type": "json"
    }
  ],
  "qos": [],
  "inputs": [
    {
      "name": "courseParameters",
      "type": "xml"
    }
  ],
  "domains": [
    {
      "name": "Educational",
      "url": "http://www.surf.scss.tcd.ie/cityOntology/#Educational"
    },
    {
      "name": "Activity",
      "url": "http://www.surf.scss.tcd.ie/cityOntology/#Activity"
    }
  ],
  "location": {}
}