{
  "outputs": [
    {
      "name": "_price",
      "type": "string",
      "desc": "Output of service CheapCar RecommendedPrice Color service"
    },
    {
      "name": "_color",
      "type": "string",
      "desc": "Output of service CheapCar RecommendedPrice Color service"
    }
  ],
  "provider": {
    "type": "webservice"
  },
  "inputs": [
    {
      "name": "_cheapcar",
      "type": "string",
      "desc": "Input of service CheapCar RecommendedPrice Color service"
    }
  ],
  "name": "CheapCar RecommendedPrice Color service",
  "description": "This service provides a list of recommended price of cheapcar with its color.",
  "domains": [
    {
      "name": "Transport_and_Mobility",
      "url": "http://www.surf.scss.tcd.ie/cityOntology/#Transport_and_Mobility"
    }
  ],
  "id": "retail/cheapcar_pricecolor_service",
  "state": true,
  "url": "http://surf.scss.tcd.ie/_provider_/retail/cheapcar_pricecolor_service"
}