{
  "outputs": [
    {
      "name": "_address",
      "type": "string",
      "desc": "Output of service Visiting Researcher address  service"
    }
  ],
  "provider": {
    "type": "asp"
  },
  "inputs": [
    {
      "name": "_visiting-researcher",
      "type": "string",
      "desc": "Input of service Visiting Researcher address  service"
    }
  ],
  "name": "Visiting Researcher address  service",
  "description": "This service returns an address of a visiting researcher.",
  "domains": [
    {
      "name": "Safety_and_Emergencies",
      "url": "http://www.surf.scss.tcd.ie/cityOntology/#Safety_and_Emergencies"
    }
  ],
  "id": "educational/visiting-researcher_address_service",
  "state": true,
  "url": "http://surf.scss.tcd.ie/_provider_/educational/visiting-researcher_address_service"
}