{
  "outputs": [
    {
      "name": "patrolDashboard",
      "type": "interactive"
    }
  ],
  "qos": [],
  "inputs": [
    {
      "name": "productData",
      "type": "xml"
    }
  ],
  "domains": [
    {
      "name": "Tools",
      "url": "http://www.surf.scss.tcd.ie/cityOntology/#Tools"
    },
    {
      "name": "Safety_and_Emergencies",
      "url": "http://www.surf.scss.tcd.ie/cityOntology/#Safety_and_Emergencies"
    }
  ],
  "location": {}
}