{
  "outputs": [
    {
      "name": "acceptcostandhealingplan_costandhealingplanacceptanceanswer",
      "type": "string",
      "desc": "Output of service "
    }
  ],
  "provider": {
    "type": "asp"
  },
  "inputs": [
    {
      "name": "acceptcostandhealingplan_costandhealingplan",
      "type": "string",
      "desc": "Input of service "
    }
  ],
  "name": "",
  "description": "",
  "domains": [
    {
      "name": "House_Sale_and_Rent",
      "url": "http://www.surf.scss.tcd.ie/cityOntology/#House_Sale_and_Rent"
    }
  ],
  "id": "",
  "state": true,
  "url": ""
}