{
  "outputs": [
    {
      "name": "_novel",
      "type": "string",
      "desc": "Output of service author_novelmaxprice_service"
    },
    {
      "name": "_maxprice",
      "type": "string",
      "desc": "Output of service author_novelmaxprice_service"
    }
  ],
  "provider": {
    "type": "asp"
  },
  "inputs": [
    {
      "name": "_author",
      "type": "string",
      "desc": "Input of service author_novelmaxprice_service"
    }
  ],
  "name": "author_novelmaxprice_service",
  "description": "This service is about retail",
  "domains": [
    {
      "name": "Sport",
      "url": "http://www.surf.scss.tcd.ie/cityOntology/#Sport"
    }
  ],
  "id": "retail/author_novelmaxprice_service",
  "state": true,
  "url": "http://surf.scss.tcd.ie/_provider_/retail/author_novelmaxprice_service"
}