{
  "outputs": [
    {
      "name": "selectedAccommodation",
      "type": "json"
    }
  ],
  "qos": [],
  "inputs": [
    {
      "name": "bookedRoom",
      "type": "xml"
    }
  ],
  "domains": [
    {
      "name": "Educational",
      "url": "http://www.surf.scss.tcd.ie/cityOntology/#Educational"
    },
    {
      "name": "Accommodation",
      "url": "http://www.surf.scss.tcd.ie/cityOntology/#Accommodation"
    }
  ],
  "location": {}
}