{
  "outputs": [
    {
      "name": "selectedRoute",
      "type": "json"
    }
  ],
  "provider": {
    "type": "ws"
  },
  "inputs": [
    {
      "name": "trafficInfo",
      "type": "json"
    },
    {
      "name": "pollutionInfo",
      "type": "json"
    },
    {
      "name": "noiseInfo",
      "type": "json"
    },
    {
      "name": "floodingInfo",
      "type": "json"
    }
  ],
  "name": "route_selector",
  "description": "This is the service route_selector",
  "domains": [
    {
      "name": "Transport_and_Mobility",
      "url": "http://www.surf.scss.tcd.ie/cityOntology/#Transport_and_Mobility"
    }
  ],
  "id": "3/route_selector",
  "state": true,
  "url": "http://surf.scss.tcd.ie/_provider_/route_selector"
}