{
  "outputs": [
    {
      "name": "constructionInfo",
      "type": "xml"
    }
  ],
  "provider": {
    "type": "ws"
  },
  "inputs": [
    {
      "name": "constructionMonitoringParameters",
      "type": "xml"
    }
  ],
  "name": "construction_monitoring_configurator",
  "description": "This is the service construction_monitoring_configurator",
  "domains": [
    {
      "name": "Safety_and_Emergencies",
      "url": "http://www.surf.scss.tcd.ie/cityOntology/#Safety_and_Emergencies"
    },
    {
      "name": "Construction",
      "url": "http://www.surf.scss.tcd.ie/cityOntology/#Construction"
    }
  ],
  "id": "40/construction_monitoring_configurator",
  "state": true,
  "url": "http://surf.scss.tcd.ie/_provider_/construction_monitoring_configurator"
}