{
  "outputs": [
    {
      "name": "_recommendedpriceineuro",
      "type": "string",
      "desc": "Output of service BDe RecommendedPriceService"
    }
  ],
  "provider": {
    "type": "webservice"
  },
  "inputs": [
    {
      "name": "_monograph",
      "type": "string",
      "desc": "Input of service BDe RecommendedPriceService"
    }
  ],
  "name": "BDe RecommendedPriceService",
  "description": "BDe is a competitor web service to return recommended price of a monograph in Euro.",
  "domains": [
    {
      "name": "Food_and_Drinks",
      "url": "http://www.surf.scss.tcd.ie/cityOntology/#Food_and_Drinks"
    }
  ],
  "id": "retail/monograph_recommendedpriceineuro_service",
  "state": true,
  "url": "http://surf.scss.tcd.ie/_provider_/retail/monograph_recommendedpriceineuro_service"
}