{
  "outputs": [
    {
      "name": "products",
      "type": "json"
    }
  ],
  "qos": [],
  "inputs": [
    {
      "name": "binId",
      "type": "long"
    }
  ],
  "domains": [
    {
      "name": "Waste",
      "url": "http://www.surf.scss.tcd.ie/cityOntology/#Waste"
    },
    {
      "name": "Technology",
      "url": "http://www.surf.scss.tcd.ie/cityOntology/#Technology"
    }
  ],
  "location": {}
}