{
  "outputs": [
    {
      "name": "_taxedprice",
      "type": "string",
      "desc": "Output of service BookTaxedPriceService"
    }
  ],
  "provider": {
    "type": "asp"
  },
  "inputs": [
    {
      "name": "_book",
      "type": "string",
      "desc": "Input of service BookTaxedPriceService"
    }
  ],
  "name": "BookTaxedPriceService",
  "description": "This service informs the taxed price of a book.",
  "domains": [
    {
      "name": "Industry",
      "url": "http://www.surf.scss.tcd.ie/cityOntology/#Industry"
    }
  ],
  "id": "retail/book_taxedprice_service",
  "state": true,
  "url": "http://surf.scss.tcd.ie/_provider_/retail/book_taxedprice_service"
}