{
  "outputs": [
    {
      "name": "stadiumMap",
      "type": "interactive"
    }
  ],
  "qos": [],
  "inputs": [
    {
      "name": "accommodationList",
      "type": "xml"
    }
  ],
  "domains": [
    {
      "name": "Accommodation",
      "url": "http://www.surf.scss.tcd.ie/cityOntology/#Accommodation"
    },
    {
      "name": "Sport",
      "url": "http://www.surf.scss.tcd.ie/cityOntology/#Sport"
    },
    {
      "name": "Leisure",
      "url": "http://www.surf.scss.tcd.ie/cityOntology/#Leisure"
    }
  ],
  "location": {}
}