{
  "plans": [
    {
      "outputs": [
        {
          "name": "inventoryReport",
          "type": "pdf"
        }
      ],
      "inputs": [
        {
          "name": "productsStatus",
          "type": "json"
        }
      ],
      "domains": [
        {
          "name": "Clothing",
          "url": "http://www.surf.scss.tcd.ie/cityOntology/#Clothing"
        }
      ],
      "state": 1,
      "steps": [
        {
          "outputs": [
            {
              "name": "inventoryReport",
              "type": "pdf"
            }
          ],
          "inputs": [
            {
              "name": "productsStatus",
              "type": "json"
            }
          ],
          "serviceDescription": {
            "outputs": [
              {
                "name": "inventoryReport",
                "type": "pdf"
              }
            ],
            "provider": {
              "type": "ws"
            },
            "inputs": [
              {
                "name": "productsStatus",
                "type": "json"
              }
            ],
            "name": "inventory_report",
            "description": "This is the service inventory_report",
            "domains": [
              {
                "name": "Clothing",
                "url": "http://www.surf.scss.tcd.ie/cityOntology/#Clothing"
              }
            ],
            "id": "73/inventory_report",
            "state": true,
            "url": "http://surf.scss.tcd.ie/_provider_/inventory_report"
          },
          "type": "SimpleStep",
          "order": 0
        }
      ]
    }
  ]
}