{
  "outputs": [
    {
      "name": "_book",
      "type": "string",
      "desc": "Output of service BookSearchingService"
    },
    {
      "name": "_author",
      "type": "string",
      "desc": "Output of service BookSearchingService"
    }
  ],
  "provider": {
    "type": "wsdn"
  },
  "inputs": [
    {
      "name": "_publication-number",
      "type": "string",
      "desc": "Input of service BookSearchingService"
    }
  ],
  "name": "BookSearchingService",
  "description": "This service returns a book and its and authors, on the given publication number",
  "domains": [
    {
      "name": "Leisure",
      "url": "http://www.surf.scss.tcd.ie/cityOntology/#Leisure"
    }
  ],
  "id": "educational/publication-number_bookauthor_service",
  "state": true,
  "url": "http://surf.scss.tcd.ie/_provider_/educational/publication-number_bookauthor_service"
}