{
  "outputs": [
    {
      "name": "_author",
      "type": "string",
      "desc": "Output of service Science-Fiction-Novel Author TaxedPrice Service"
    },
    {
      "name": "_taxedprice",
      "type": "string",
      "desc": "Output of service Science-Fiction-Novel Author TaxedPrice Service"
    }
  ],
  "provider": "",
  "inputs": [
    {
      "name": "_science-fiction-novel",
      "type": "string",
      "desc": "Input of service Science-Fiction-Novel Author TaxedPrice Service"
    }
  ],
  "latitude": 0.0,
  "name": "Science-Fiction-Novel Author TaxedPrice Service",
  "description": "This service returns author and taxed price of a given science fiction novel.",
  "domains": [
    {
      "name": "retail",
      "uri": "http://www.disit.org/km4city/schema#Retail"
    }
  ],
  "id": "retail/science-fiction-novel_authortaxedprice_service",
  "state": true,
  "type": "wsdn",
  "url": "http://surf.scss.tcd.ie/_provider_/retail/science-fiction-novel_authortaxedprice_service",
  "longitude": 0.0
}