{
  "outputs": [
    {
      "name": "patrolDashboard",
      "type": "interactive"
    }
  ],
  "provider": {
    "type": "asp"
  },
  "inputs": [
    {
      "name": "broadcastVideo",
      "type": "streaming"
    }
  ],
  "name": "patrol_dashboard",
  "description": "This is the service patrol_dashboard",
  "domains": [
    {
      "name": "Safety_and_Emergencies",
      "url": "http://www.surf.scss.tcd.ie/cityOntology/#Safety_and_Emergencies"
    }
  ],
  "id": "28/patrol_dashboard",
  "state": true,
  "url": "http://surf.scss.tcd.ie/_provider_/patrol_dashboard"
}