{
  "outputs": [
    {
      "name": "historicPlaceInfo",
      "type": "xml"
    }
  ],
  "qos": [],
  "inputs": [
    {
      "name": "eventParameters",
      "type": "xml"
    }
  ],
  "domains": [
    {
      "name": "Sport",
      "url": "http://www.surf.scss.tcd.ie/cityOntology/#Sport"
    },
    {
      "name": "Leisure",
      "url": "http://www.surf.scss.tcd.ie/cityOntology/#Leisure"
    },
    {
      "name": "Touristic_Place",
      "url": "http://www.surf.scss.tcd.ie/cityOntology/#Touristic_Place"
    },
    {
      "name": "History",
      "url": "http://www.surf.scss.tcd.ie/cityOntology/#History"
    }
  ],
  "location": {}
}