{
  "outputs": [
    {
      "name": "subjectsList",
      "type": "json"
    }
  ],
  "qos": [],
  "inputs": [
    {
      "name": "from",
      "type": "long"
    },
    {
      "name": "to",
      "type": "long"
    }
  ],
  "domains": [
    {
      "name": "Transport_and_Mobility",
      "url": "http://www.surf.scss.tcd.ie/cityOntology/#Transport_and_Mobility"
    },
    {
      "name": "Educational",
      "url": "http://www.surf.scss.tcd.ie/cityOntology/#Educational"
    }
  ],
  "location": {}
}