{
  "outputs": [
    {
      "name": "_price",
      "type": "string",
      "desc": "Output of service Cheap car price service"
    }
  ],
  "provider": "",
  "inputs": [
    {
      "name": "_cheapcar",
      "type": "string",
      "desc": "Input of service Cheap car price service"
    }
  ],
  "latitude": 0.0,
  "name": "Cheap car price service",
  "description": "This service gives good opinion to buy a cheap car.",
  "domains": [
    {
      "name": "retail",
      "uri": "http://www.disit.org/km4city/schema#Retail"
    }
  ],
  "id": "retail/cheapcar_price_service",
  "state": true,
  "type": "wsdn",
  "url": "http://surf.scss.tcd.ie/_provider_/retail/cheapcar_price_service",
  "longitude": 0.0
}