{
  "outputs": [
    {
      "name": "homeInformation",
      "type": "json"
    }
  ],
  "qos": [],
  "inputs": [
    {
      "name": "industryId",
      "type": "int"
    }
  ],
  "domains": [
    {
      "name": "Industry",
      "url": "http://www.surf.scss.tcd.ie/cityOntology/#Industry"
    },
    {
      "name": "Nature",
      "url": "http://www.surf.scss.tcd.ie/cityOntology/#Nature"
    },
    {
      "name": "Safety_and_Emergencies",
      "url": "http://www.surf.scss.tcd.ie/cityOntology/#Safety_and_Emergencies"
    }
  ],
  "location": {}
}