{
  "outputs": [
    {
      "name": "_book",
      "type": "string",
      "desc": "Output of service AcademicBookNumberSearch"
    }
  ],
  "provider": {
    "type": "asp"
  },
  "inputs": [
    {
      "name": "_academic-item-number",
      "type": "string",
      "desc": "Input of service AcademicBookNumberSearch"
    }
  ],
  "name": "AcademicBookNumberSearch",
  "description": "Academic Book Number booksearch",
  "domains": [
    {
      "name": "Professional_Services",
      "url": "http://www.surf.scss.tcd.ie/cityOntology/#Professional_Services"
    }
  ],
  "id": "educational/academic-item-number_book_service",
  "state": true,
  "url": "http://surf.scss.tcd.ie/_provider_/educational/academic-item-number_book_service"
}