{
  "outputs": [
    {
      "name": "products",
      "type": "json"
    }
  ],
  "provider": {
    "type": "wsdn"
  },
  "inputs": [
    {
      "name": "productData",
      "type": "xml"
    }
  ],
  "name": "buy_tools_products",
  "description": "This is the service buy_tools_products",
  "domains": [
    {
      "name": "Tools",
      "url": "http://www.surf.scss.tcd.ie/cityOntology/#Tools"
    }
  ],
  "id": "132/buy_tools_products",
  "state": true,
  "url": "http://surf.scss.tcd.ie/_provider_/buy_tools_products"
}