{
  "outputs": [
    {
      "name": "constructionDashboard",
      "type": "interactive"
    }
  ],
  "provider": {
    "type": "asp"
  },
  "inputs": [
    {
      "name": "constructionInformation",
      "type": "xml"
    }
  ],
  "name": "construction_dashboard",
  "description": "This is the service construction_dashboard",
  "domains": [
    {
      "name": "Safety_and_Emergencies",
      "url": "http://www.surf.scss.tcd.ie/cityOntology/#Safety_and_Emergencies"
    },
    {
      "name": "Construction",
      "url": "http://www.surf.scss.tcd.ie/cityOntology/#Construction"
    }
  ],
  "id": "45/construction_dashboard",
  "state": true,
  "url": "http://surf.scss.tcd.ie/_provider_/construction_dashboard"
}