{
  "outputs": [
    {
      "name": "_arrowfigure",
      "type": "string",
      "desc": "Output of service citycity route finder Service"
    }
  ],
  "provider": {
    "type": "webservice"
  },
  "inputs": [
    {
      "name": "_city",
      "type": "string",
      "desc": "Input of service citycity route finder Service"
    },
    {
      "name": "_city",
      "type": "string",
      "desc": "Input of service citycity route finder Service"
    }
  ],
  "name": "citycity route finder Service",
  "description": "This service returns a nice arrow figure, a part of map, to indicate the target path between two cities",
  "domains": [
    {
      "name": "Foundations_and_Charity",
      "url": "http://www.surf.scss.tcd.ie/cityOntology/#Foundations_and_Charity"
    }
  ],
  "id": "mobility/citycity_arrowfigure_service",
  "state": true,
  "url": "http://surf.scss.tcd.ie/_provider_/mobility/citycity_arrowfigure_service"
}