{
  "outputs": [
    {
      "name": "_nationalpark",
      "type": "string",
      "desc": "Output of service Sightseeing Nationalpark Service"
    }
  ],
  "provider": {
    "type": "asp"
  },
  "inputs": [
    {
      "name": "_sightseeing",
      "type": "string",
      "desc": "Input of service Sightseeing Nationalpark Service"
    }
  ],
  "name": "Sightseeing Nationalpark Service",
  "description": "This service returns nationalpark for sightseeing.",
  "domains": [
    {
      "name": "Industry",
      "url": "http://www.surf.scss.tcd.ie/cityOntology/#Industry"
    }
  ],
  "id": "tourism/sightseeing_nationalpark_service",
  "state": true,
  "url": "http://surf.scss.tcd.ie/_provider_/tourism/sightseeing_nationalpark_service"
}