{
  "outputs": [
    {
      "name": "_author",
      "type": "string",
      "desc": "Output of service Science-Fiction-Novel Author TaxedPrice Service"
    },
    {
      "name": "_taxedprice",
      "type": "string",
      "desc": "Output of service Science-Fiction-Novel Author TaxedPrice Service"
    }
  ],
  "provider": {
    "type": "webservice"
  },
  "inputs": [
    {
      "name": "_science-fiction-novel",
      "type": "string",
      "desc": "Input of service Science-Fiction-Novel Author TaxedPrice Service"
    }
  ],
  "name": "Science-Fiction-Novel Author TaxedPrice Service",
  "description": "This service returns author and taxed price of a given science fiction novel.",
  "domains": [
    {
      "name": "Clothing",
      "url": "http://www.surf.scss.tcd.ie/cityOntology/#Clothing"
    }
  ],
  "id": "retail/science-fiction-novel_authortaxedprice_service",
  "state": true,
  "url": "http://surf.scss.tcd.ie/_provider_/retail/science-fiction-novel_authortaxedprice_service"
}