{
  "outputs": [
    {
      "name": "_town",
      "type": "string",
      "desc": "Output of service Sightseeing Town Service"
    }
  ],
  "provider": "",
  "inputs": [
    {
      "name": "_sightseeing",
      "type": "string",
      "desc": "Input of service Sightseeing Town Service"
    }
  ],
  "latitude": 0.0,
  "name": "Sightseeing Town Service",
  "description": "This service returns town for sightseeing.",
  "domains": [],
  "id": "tourism/sightseeing_town_service",
  "state": true,
  "type": "asp",
  "url": "http://surf.scss.tcd.ie/_provider_/tourism/sightseeing_town_service",
  "longitude": 0.0
}