{
  "outputs": [
    {
      "name": "placeVideo",
      "type": "streaming"
    }
  ],
  "qos": [],
  "inputs": [
    {
      "name": "inventoryData",
      "type": "json"
    }
  ],
  "domains": [
    {
      "name": "Clothing",
      "url": "http://www.surf.scss.tcd.ie/cityOntology/#Clothing"
    },
    {
      "name": "Safety_and_Emergencies",
      "url": "http://www.surf.scss.tcd.ie/cityOntology/#Safety_and_Emergencies"
    }
  ],
  "location": {}
}