{
  "outputs": [
    {
      "name": "_ruralarea",
      "type": "string",
      "desc": "Output of service Adventure RuralArea Service"
    }
  ],
  "provider": {
    "type": "webservice"
  },
  "inputs": [
    {
      "name": "_adventure",
      "type": "string",
      "desc": "Input of service Adventure RuralArea Service"
    }
  ],
  "name": "Adventure RuralArea Service",
  "description": "This service returns ruralarea for adventure.",
  "domains": [
    {
      "name": "Educational",
      "url": "http://www.surf.scss.tcd.ie/cityOntology/#Educational"
    }
  ],
  "id": "tourism/adventure_ruralarea_service",
  "state": true,
  "url": "http://surf.scss.tcd.ie/_provider_/tourism/adventure_ruralarea_service"
}