{
  "plans": [
    {
      "outputs": [
        {
          "name": "products",
          "type": "json"
        }
      ],
      "inputs": [
        {
          "name": "fridgeData",
          "type": "xml"
        }
      ],
      "domains": [
        {
          "name": "Food_and_Drinks",
          "url": "http://www.surf.scss.tcd.ie/cityOntology/#Food_and_Drinks"
        }
      ],
      "state": 1,
      "steps": [
        {
          "outputs": [
            {
              "name": "products",
              "type": "json"
            }
          ],
          "inputs": [
            {
              "name": "fridgeData",
              "type": "xml"
            }
          ],
          "serviceDescription": {
            "outputs": [
              {
                "name": "products",
                "type": "json"
              }
            ],
            "provider": {
              "type": "wsdn"
            },
            "inputs": [
              {
                "name": "fridgeData",
                "type": "xml"
              }
            ],
            "name": "check_fridge_products",
            "description": "This is the service check_fridge_products",
            "domains": [
              {
                "name": "Food_and_Drinks",
                "url": "http://www.surf.scss.tcd.ie/cityOntology/#Food_and_Drinks"
              }
            ],
            "id": "68/check_fridge_products",
            "state": true,
            "url": "http://surf.scss.tcd.ie/_provider_/check_fridge_products"
          },
          "type": "SimpleStep",
          "order": 0
        }
      ]
    }
  ]
}