{
  "outputs": [
    {
      "name": "_hotel",
      "type": "string",
      "desc": "Output of service HotelInfoService"
    }
  ],
  "provider": {
    "type": "wsdn"
  },
  "inputs": [
    {
      "name": "_country",
      "type": "string",
      "desc": "Input of service HotelInfoService"
    },
    {
      "name": "_city",
      "type": "string",
      "desc": "Input of service HotelInfoService"
    }
  ],
  "name": "HotelInfoService",
  "description": "It is the most used service for acknowledgement of the hotel in a city of a country.",
  "domains": [
    {
      "name": "Foundations_and_Charity",
      "url": "http://www.surf.scss.tcd.ie/cityOntology/#Foundations_and_Charity"
    }
  ],
  "id": "tourism/citycountry_hotel_service",
  "state": true,
  "url": "http://surf.scss.tcd.ie/_provider_/tourism/citycountry_hotel_service"
}