{
  "outputs": [
    {
      "name": "_price",
      "type": "string",
      "desc": "Output of service NovelPrice Service"
    }
  ],
  "provider": {
    "type": "asp"
  },
  "inputs": [
    {
      "name": "_novel",
      "type": "string",
      "desc": "Input of service NovelPrice Service"
    }
  ],
  "name": "NovelPrice Service",
  "description": "This service returns price of a novel.",
  "domains": [
    {
      "name": "Energy",
      "url": "http://www.surf.scss.tcd.ie/cityOntology/#Energy"
    }
  ],
  "id": "retail/novel_price_service",
  "state": true,
  "url": "http://surf.scss.tcd.ie/_provider_/retail/novel_price_service"
}