{
  "outputs": [
    {
      "name": "riverInfo",
      "type": "json"
    }
  ],
  "provider": {
    "type": "wsdn"
  },
  "inputs": [
    {
      "name": "riverConfig",
      "type": "json"
    }
  ],
  "name": "river_monitoring",
  "description": "This is the service river_monitoring",
  "domains": [
    {
      "name": "Nature",
      "url": "http://www.surf.scss.tcd.ie/cityOntology/#Nature"
    }
  ],
  "id": "129/river_monitoring",
  "state": true,
  "url": "http://surf.scss.tcd.ie/_provider_/river_monitoring"
}