{
  "outputs": [
    {
      "name": "_maxprice",
      "type": "string",
      "desc": "Output of service AldiFoodQuantityService"
    },
    {
      "name": "_quantity",
      "type": "string",
      "desc": "Output of service AldiFoodQuantityService"
    }
  ],
  "provider": {
    "type": "webservice"
  },
  "inputs": [
    {
      "name": "_food",
      "type": "string",
      "desc": "Input of service AldiFoodQuantityService"
    }
  ],
  "name": "AldiFoodQuantityService",
  "description": "The emphasis of this service to provide information of the quantity of thefood in Aldi, and also approximately the maximum price (not actual) of the food.",
  "domains": [
    {
      "name": "Construction",
      "url": "http://www.surf.scss.tcd.ie/cityOntology/#Construction"
    }
  ],
  "id": "retail/food_maxpricequantity_service",
  "state": true,
  "url": "http://surf.scss.tcd.ie/_provider_/retail/food_maxpricequantity_service"
}