{
  "outputs": [
    {
      "name": "_price",
      "type": "string",
      "desc": "Output of service 4WheeledCar price service"
    }
  ],
  "provider": {
    "type": "asp"
  },
  "inputs": [
    {
      "name": "_4wheeledcar",
      "type": "string",
      "desc": "Input of service 4WheeledCar price service"
    }
  ],
  "name": "4WheeledCar price service",
  "description": "Car is a motor vehicle with four wheels; usually propelled by an internal combustion engine.This service informs you price of a four wheeled car.",
  "domains": [
    {
      "name": "House_Sale_and_Rent",
      "url": "http://www.surf.scss.tcd.ie/cityOntology/#House_Sale_and_Rent"
    }
  ],
  "id": "retail/4wheeledcar_price_service",
  "state": true,
  "url": "http://surf.scss.tcd.ie/_provider_/retail/4wheeledcar_price_service"
}