{
  "outputs": [
    {
      "name": "_investigating",
      "type": "string",
      "desc": "Output of service InvestigatingFinding"
    }
  ],
  "provider": {
    "type": "asp"
  },
  "inputs": [
    {
      "name": "_hospital",
      "type": "string",
      "desc": "Input of service InvestigatingFinding"
    }
  ],
  "name": "InvestigatingFinding",
  "description": "This service the certain type investigating facility available in the certain hospital.",
  "domains": [
    {
      "name": "Safety_and_Emergencies",
      "url": "http://www.surf.scss.tcd.ie/cityOntology/#Safety_and_Emergencies"
    }
  ],
  "id": "health/hospital_investigating_service",
  "state": true,
  "url": "http://surf.scss.tcd.ie/_provider_/health/hospital_investigating_service"
}