{
  "outputs": [
    {
      "name": "_price",
      "type": "string",
      "desc": "Output of service TR NovelPrice Service"
    }
  ],
  "provider": {
    "type": "wsdn"
  },
  "inputs": [
    {
      "name": "_person",
      "type": "string",
      "desc": "Input of service TR NovelPrice Service"
    },
    {
      "name": "_novel",
      "type": "string",
      "desc": "Input of service TR NovelPrice Service"
    }
  ],
  "name": "TR NovelPrice Service",
  "description": "TR service returns price of a novel for a certain person.",
  "domains": [
    {
      "name": "Sport",
      "url": "http://www.surf.scss.tcd.ie/cityOntology/#Sport"
    }
  ],
  "id": "retail/novelperson_price_service",
  "state": true,
  "url": "http://surf.scss.tcd.ie/_provider_/retail/novelperson_price_service"
}