{
  "outputs": [
    {
      "name": "_drought",
      "type": "string",
      "desc": "Output of service Geographical-Region Drought Service"
    }
  ],
  "provider": {
    "type": "webservice"
  },
  "inputs": [
    {
      "name": "_geographical-region",
      "type": "string",
      "desc": "Input of service Geographical-Region Drought Service"
    }
  ],
  "name": "Geographical-Region Drought Service",
  "description": "This service informs about droughts of a given geogrphical region.",
  "domains": [
    {
      "name": "Government_and_Planning",
      "url": "http://www.surf.scss.tcd.ie/cityOntology/#Government_and_Planning"
    }
  ],
  "id": "environmental/geographical-region_drought_service",
  "state": true,
  "url": "http://surf.scss.tcd.ie/_provider_/environmental/geographical-region_drought_service"
}