{
  "outputs": [
    {
      "name": "displayVideo",
      "type": "multimedia"
    }
  ],
  "qos": [],
  "inputs": [
    {
      "name": "resourceParameters",
      "type": "xml"
    }
  ],
  "domains": [
    {
      "name": "Educational",
      "url": "http://www.surf.scss.tcd.ie/cityOntology/#Educational"
    }
  ],
  "location": {}
}