{
  "outputs": [
    {
      "name": "_weatherprocess",
      "type": "string",
      "desc": "Output of service GRW Service"
    }
  ],
  "provider": {
    "type": "webservice"
  },
  "inputs": [
    {
      "name": "_geographical-region",
      "type": "string",
      "desc": "Input of service GRW Service"
    }
  ],
  "name": "GRW Service",
  "description": "This service is used to get weather process condition of a particular geogrphical region.",
  "domains": [
    {
      "name": "Furniture_and_Housing",
      "url": "http://www.surf.scss.tcd.ie/cityOntology/#Furniture_and_Housing"
    }
  ],
  "id": "environmental/geographical-region_weatherprocess_service",
  "state": true,
  "url": "http://surf.scss.tcd.ie/_provider_/environmental/geographical-region_weatherprocess_service"
}