{
  "outputs": [
    {
      "name": "_SEARCHINFO",
      "type": "http://www.surf.scss.tcd.ie/IoTservices.owl#searchInfo",
      "desc": "Output of service book_search_presentation,Research_and_Science"
    }
  ],
  "expectedPlanLength": 3,
  "inputs": [
    {
      "name": "_BOOKSINFORMATION",
      "state": "used",
      "type": "http://www.surf.scss.tcd.ie/IoTservices.owl#booksInformation",
      "desc": "Input of service similar_books"
    }
  ],
  "domains": [
    {
      "name": "Educational",
      "url": "http://www.surf.scss.tcd.ie/cityOntology/#Educational"
    },
    {
      "name": "Research_and_Science",
      "url": "http://www.surf.scss.tcd.ie/cityOntology/#Research_and_Science"
    }
  ],
  "id": "57_similar_books_x_58_book_search_presentation,Research_and_Science_request",
  "type": "composed"
}