{
  "outputs": [
    {
      "name": "_BOOKACCOMMODATION",
      "type": "http://www.surf.scss.tcd.ie/IoTservices.owl#bookAccommodation",
      "desc": "Output of service book_accommodation"
    }
  ],
  "expectedPlanLength": 3,
  "inputs": [
    {
      "name": "_SELECTEDACCOMMODATION",
      "state": "used",
      "type": "http://www.surf.scss.tcd.ie/IoTservices.owl#selectedAccommodation",
      "desc": "Input of service activate_room_camera"
    }
  ],
  "domains": [
    {
      "name": "Accommodation",
      "url": "http://www.surf.scss.tcd.ie/cityOntology/#Accommodation"
    }
  ],
  "id": "84_activate_room_camera_x_86_book_accommodation_request",
  "type": "composed"
}