{
   "id": "57_similar_books_request",
   "domains": [
      {
         "name": "Educational",
         "url": "http://www.surf.scss.tcd.ie/cityOntology/#Educational"
      },
      {
         "name": "Research_and_Science",
         "url": "http://www.surf.scss.tcd.ie/cityOntology/#Research_and_Science"
      }
   ],
   "tasks": [
      {
         "outputs": [
            {
               "desc": "Output of service similar_books",
               "name": "_SIMILARBOOKS",
               "type": "http://www.surf.scss.tcd.ie/IoTservices.owl#similarBooks"
            }
         ],
         "name": "task-1",
         "inputs": [
            {
               "desc": "Input of service similar_books",
               "name": "_BOOKSINFORMATION",
               "type": "http://www.surf.scss.tcd.ie/IoTservices.owl#booksInformation"
            }
         ],
         "services": []
      }
   ]
}