{
   "matchingType": 0,
   "jobId": "RomanticNovel Author Price Service-NovelPrice Service-384",
   "domains": [
      {
         "name": "Entertainment_Products",
         "url": "http://www.surf.scss.tcd.ie/cityOntology/#Entertainment_Products"
      },
      {
         "name": "Entertainment_Products",
         "url": "http://www.surf.scss.tcd.ie/cityOntology/#Entertainment_Products"
      },
      {
         "name": "Entertainment_Products",
         "url": "http://www.surf.scss.tcd.ie/cityOntology/#Entertainment_Products"
      },
      {
         "name": "Entertainment_Products",
         "url": "http://www.surf.scss.tcd.ie/cityOntology/#Entertainment_Products"
      },
      {
         "name": "Entertainment_Products",
         "url": "http://www.surf.scss.tcd.ie/cityOntology/#Entertainment_Products"
      },
      {
         "name": "Entertainment_Products",
         "url": "http://www.surf.scss.tcd.ie/cityOntology/#Entertainment_Products"
      },
      {
         "name": "Entertainment_Products",
         "url": "http://www.surf.scss.tcd.ie/cityOntology/#Entertainment_Products"
      },
      {
         "name": "Entertainment_Products",
         "url": "http://www.surf.scss.tcd.ie/cityOntology/#Entertainment_Products"
      }
   ],
   "similarityThreshold": 0.5,
   "feedbackThreshold": 0.5,
   "inputs": [
      {
         "desc": "Input of service NovelPrice Service",
         "type": "http://127.0.0.1/ontology/books.owl#Person",
         "name": "_PERSON"
      },
      {
         "desc": "Input of service RomanticNovel Author Price Service",
         "type": "http://127.0.0.1/ontology/books.owl#RomanticNovel",
         "name": "_ROMANTICNOVEL"
      }
   ],
   "outputs": [
      {
         "desc": "Output of service NovelPrice Service",
         "type": "http://127.0.0.1/ontology/concept.owl#Price",
         "name": "_PRICE"
      }
   ]
}