{
  "outputs": [
    {
      "name": "_BUILDINGINFO",
      "domains": [
        {
          "name": "Safety_and_Emergencies",
          "url": "http://www.surf.scss.tcd.ie/cityOntology/#Safety_and_Emergencies"
        },
        {
          "name": "Buildings",
          "url": "http://www.surf.scss.tcd.ie/cityOntology/#Buildings"
        }
      ],
      "type": "http://www.surf.scss.tcd.ie/IoTservices.owl#buildingInfo",
      "desc": "Output of service building_monitoring_configurator"
    }
  ],
  "expectedPlanLength": 1,
  "inputs": [
    {
      "name": "_BUILDINGMONITORINGPARAMETERS",
      "domains": [
        {
          "name": "Safety_and_Emergencies",
          "url": "http://www.surf.scss.tcd.ie/cityOntology/#Safety_and_Emergencies"
        },
        {
          "name": "Buildings",
          "url": "http://www.surf.scss.tcd.ie/cityOntology/#Buildings"
        }
      ],
      "type": "http://www.surf.scss.tcd.ie/IoTservices.owl#buildingMonitoringParameters",
      "desc": "Input of service building_monitoring_configurator"
    }
  ],
  "domains": [
    {
      "name": "Buildings",
      "url": "http://www.surf.scss.tcd.ie/cityOntology/#Buildings"
    }
  ],
  "id": "36_building_monitoring_configurator_request",
  "type": "atomic"
}