{
   "jobId": "GroceryFoodService-GroceryStore Sandwich Quantity Service-264",
   "similarityThreshold": 0.5,
   "inputs": [
      {
         "name": "_GROCERYSTORE",
         "desc": "Input of service GroceryFoodService",
         "type": "http://127.0.0.1/ontology/Mid-level-ontology.owl#GroceryStore"
      }
   ],
   "outputs": [
      {
         "name": "_SANDWICH",
         "desc": "Output of service GroceryStore Sandwich Quantity Service",
         "type": "http://127.0.0.1/ontology/Mid-level-ontology.owl#Sandwich"
      },
      {
         "name": "_QUANTITY",
         "desc": "Output of service GroceryStore Sandwich Quantity Service",
         "type": "http://127.0.0.1/ontology/support.owl#Quantity"
      }
   ],
   "feedbackThreshold": 0.5,
   "matchingType": 0,
   "domains": [
      {
         "name": "Food_and_Drinks",
         "url": "http://www.surf.scss.tcd.ie/cityOntology/#Food_and_Drinks"
      },
      {
         "name": "Food_and_Drinks",
         "url": "http://www.surf.scss.tcd.ie/cityOntology/#Food_and_Drinks"
      },
      {
         "name": "Food_and_Drinks",
         "url": "http://www.surf.scss.tcd.ie/cityOntology/#Food_and_Drinks"
      }
   ]
}