{
  "outputs": [
    {
      "name": "_PAYMENTINFO",
      "type": "http://www.surf.scss.tcd.ie/IoTservices.owl#paymentInfo",
      "desc": "Output of service pay_order"
    }
  ],
  "expectedPlanLength": 3,
  "inputs": [
    {
      "name": "_PRODUCTDATA",
      "state": "used",
      "type": "http://www.surf.scss.tcd.ie/IoTservices.owl#productData",
      "desc": "Input of service buy_furniture_products"
    }
  ],
  "domains": [
    {
      "name": "Furniture_and_Housing",
      "url": "http://www.surf.scss.tcd.ie/cityOntology/#Furniture_and_Housing"
    },
    {
      "name": "Payment_and_Delivery",
      "url": "http://www.surf.scss.tcd.ie/cityOntology/#Payment_and_Delivery"
    }
  ],
  "id": "133_buy_furniture_products_x_135_pay_order_request",
  "type": "composed"
}