{
   "similarityThreshold": 0.5,
   "feedbackThreshold": 0.5,
   "outputs": [
      {
         "type": "http://127.0.0.1/ontology/my_ontology.owl#Coffee",
         "desc": "Output of service EuroPriceWhiskeyCoffee Service",
         "name": "_COFFEE"
      },
      {
         "type": "http://127.0.0.1/ontology/my_ontology.owl#Whiskey",
         "desc": "Output of service EuroPriceWhiskeyCoffee Service",
         "name": "_WHISKEY"
      }
   ],
   "jobId": "RetailStore BreadOrBiscuit Quantity Service-EuroPriceWhiskeyCoffee Service-38",
   "matchingType": 0,
   "domains": [
      {
         "url": "http://www.surf.scss.tcd.ie/cityOntology/#Food_and_Drinks",
         "name": "Food_and_Drinks"
      },
      {
         "url": "http://www.surf.scss.tcd.ie/cityOntology/#Food_and_Drinks",
         "name": "Food_and_Drinks"
      },
      {
         "url": "http://www.surf.scss.tcd.ie/cityOntology/#Food_and_Drinks",
         "name": "Food_and_Drinks"
      }
   ],
   "inputs": [
      {
         "type": "http://127.0.0.1/ontology/Mid-level-ontology.owl#RetailStore",
         "desc": "Input of service RetailStore BreadOrBiscuit Quantity Service",
         "name": "_RETAILSTORE"
      }
   ]
}