{
   "id": "89_patient_wereable_readings_request",
   "domains": [
      {
         "name": "Health",
         "url": "http://www.surf.scss.tcd.ie/cityOntology/#Health"
      },
      {
         "name": "Safety_and_Emergencies",
         "url": "http://www.surf.scss.tcd.ie/cityOntology/#Safety_and_Emergencies"
      }
   ],
   "tasks": [
      {
         "outputs": [
            {
               "desc": "Output of service patient_wereable_readings",
               "name": "_PATIENTREADINGS",
               "type": "http://www.surf.scss.tcd.ie/IoTservices.owl#patientReadings"
            }
         ],
         "name": "task-1",
         "inputs": [
            {
               "desc": "Input of service patient_wereable_readings",
               "name": "_PATIENTPROFILE",
               "type": "http://www.surf.scss.tcd.ie/IoTservices.owl#patientProfile"
            }
         ],
         "services": []
      }
   ]
}