{
   "id": "64_found_room_presentation_request",
   "domains": [
      {
         "name": "Educational",
         "url": "http://www.surf.scss.tcd.ie/cityOntology/#Educational"
      }
   ],
   "tasks": [
      {
         "outputs": [
            {
               "desc": "Output of service found_room_presentation",
               "name": "_DISPLAYROOMINFO",
               "type": "http://www.surf.scss.tcd.ie/IoTservices.owl#displayRoomInfo"
            }
         ],
         "name": "task-1",
         "inputs": [
            {
               "desc": "Input of service found_room_presentation",
               "name": "_ROOMINFO",
               "type": "http://www.surf.scss.tcd.ie/IoTservices.owl#roomInfo"
            }
         ],
         "services": []
      }
   ]
}