{
  "outputs": [
    {
      "name": "_PRISIONNOTIFICATION",
      "domains": [
        {
          "name": "Safety_and_Emergencies",
          "url": "http://www.surf.scss.tcd.ie/cityOntology/#Safety_and_Emergencies"
        }
      ],
      "type": "http://www.surf.scss.tcd.ie/IoTservices.owl#prisionNotification",
      "desc": "Output of service prision_anomaly_detection"
    }
  ],
  "inputs": [
    {
      "name": "_PRISIONSURVEILLANCEPARAMETERS",
      "domains": [
        {
          "name": "Safety_and_Emergencies",
          "url": "http://www.surf.scss.tcd.ie/cityOntology/#Safety_and_Emergencies"
        }
      ],
      "state": "notUsed",
      "type": "http://www.surf.scss.tcd.ie/IoTservices.owl#prisionSurveillanceParameters",
      "desc": "Input of service prision_surveillance_configurator"
    }
  ],
  "domains": [
    {
      "name": "Safety_and_Emergencies",
      "url": "http://www.surf.scss.tcd.ie/cityOntology/#Safety_and_Emergencies"
    }
  ],
  "id": "prision_surveillance_configurator_x_prision_anomaly_detection"
}