{
  "outputs": [
    {
      "name": "_TOURISTICPLAN",
      "domains": [
        {
          "name": "Activity",
          "url": "http://www.surf.scss.tcd.ie/cityOntology/#Activity"
        }
      ],
      "type": "http://www.surf.scss.tcd.ie/IoTservices.owl#touristicPlan",
      "desc": "Output of service present_touristic_plan"
    }
  ],
  "expectedPlanLength": 1,
  "inputs": [
    {
      "name": "_TOURISTICPATH",
      "domains": [
        {
          "name": "Activity",
          "url": "http://www.surf.scss.tcd.ie/cityOntology/#Activity"
        }
      ],
      "type": "http://www.surf.scss.tcd.ie/IoTservices.owl#touristicPath",
      "desc": "Input of service present_touristic_plan"
    },
    {
      "name": "_SUGGESTEDACTIVITIES",
      "domains": [
        {
          "name": "Activity",
          "url": "http://www.surf.scss.tcd.ie/cityOntology/#Activity"
        }
      ],
      "type": "http://www.surf.scss.tcd.ie/IoTservices.owl#suggestedActivities",
      "desc": "Input of service present_touristic_plan"
    },
    {
      "name": "_RELATEDCONTENT",
      "domains": [
        {
          "name": "Activity",
          "url": "http://www.surf.scss.tcd.ie/cityOntology/#Activity"
        }
      ],
      "type": "http://www.surf.scss.tcd.ie/IoTservices.owl#relatedContent",
      "desc": "Input of service present_touristic_plan"
    }
  ],
  "domains": [
    {
      "name": "Activity",
      "url": "http://www.surf.scss.tcd.ie/cityOntology/#Activity"
    }
  ],
  "id": "78_present_touristic_plan_request",
  "type": "atomic"
}