{
  "outputs": [
    {
      "name": "_PLACEVIDEO",
      "domains": [
        {
          "name": "Safety_and_Emergencies",
          "url": "http://www.surf.scss.tcd.ie/cityOntology/#Safety_and_Emergencies"
        }
      ],
      "type": "http://www.surf.scss.tcd.ie/IoTservices.owl#placeVideo",
      "desc": "Output of service city_video_camera"
    }
  ],
  "inputs": [
    {
      "name": "_STREETSURVEILLANCEPARAMETERS",
      "domains": [
        {
          "name": "Safety_and_Emergencies",
          "url": "http://www.surf.scss.tcd.ie/cityOntology/#Safety_and_Emergencies"
        }
      ],
      "state": "notUsed",
      "type": "http://www.surf.scss.tcd.ie/IoTservices.owl#streetSurveillanceParameters",
      "desc": "Input of service street_surveillance_configurator"
    }
  ],
  "domains": [
    {
      "name": "Safety_and_Emergencies",
      "url": "http://www.surf.scss.tcd.ie/cityOntology/#Safety_and_Emergencies"
    }
  ],
  "id": "street_surveillance_configurator_x_city_video_camera"
}