{
  "outputs": [
    {
      "name": "_DISPLAYVIDEO",
      "type": "http://www.surf.scss.tcd.ie/IoTservices.owl#displayVideo",
      "desc": "Output of service camera_room_activation"
    }
  ],
  "expectedPlanLength": 2,
  "inputs": [
    {
      "name": "_ROOMPARAMETERS",
      "state": "used",
      "type": "http://www.surf.scss.tcd.ie/IoTservices.owl#roomParameters",
      "desc": "Input of service search_campus_room"
    }
  ],
  "domains": [
    {
      "name": "Educational",
      "url": "http://www.surf.scss.tcd.ie/cityOntology/#Educational"
    }
  ],
  "id": "63_search_campus_room_x_65_camera_room_activation_request",
  "type": "composed"
}