{
  "outputs": [
    {
      "name": "_SENDNOTIFICATION",
      "type": "http://www.surf.scss.tcd.ie/IoTservices.owl#sendNotification",
      "desc": "Output of service notify_emergency"
    }
  ],
  "expectedPlanLength": 1,
  "inputs": [
    {
      "name": "_VEHICLECONFIGURED",
      "type": "http://www.surf.scss.tcd.ie/IoTservices.owl#vehicleConfigured",
      "desc": "Input of service notify_emergency"
    }
  ],
  "domains": [
    {
      "name": "Health",
      "url": "http://www.surf.scss.tcd.ie/cityOntology/#Health"
    },
    {
      "name": "Safety_and_Emergencies",
      "url": "http://www.surf.scss.tcd.ie/cityOntology/#Safety_and_Emergencies"
    }
  ],
  "id": "96_notify_emergency_request",
  "type": "atomic"
}