{
  "outputs": [
    {
      "name": "_STREETSDASHBOARD",
      "type": "http://www.surf.scss.tcd.ie/IoTservices.owl#streetsDashboard",
      "desc": "Output of service streets_dashboard"
    }
  ],
  "expectedPlanLength": 4,
  "inputs": [
    {
      "name": "_STREETSINFO",
      "state": "used",
      "type": "http://www.surf.scss.tcd.ie/IoTservices.owl#streetsInfo",
      "desc": "Input of service streets_camera"
    }
  ],
  "domains": [
    {
      "name": "Government_and_Planning",
      "url": "http://www.surf.scss.tcd.ie/cityOntology/#Government_and_Planning"
    }
  ],
  "id": "125_streets_camera_x_128_streets_dashboard_request",
  "type": "composed"
}