{
  "outputs": [
    {
      "name": "_CALLTAXI",
      "type": "http://www.surf.scss.tcd.ie/IoTservices.owl#callTaxi",
      "desc": "Output of service call_taxi"
    }
  ],
  "expectedPlanLength": 3,
  "inputs": [
    {
      "name": "_ROUTEPARAMETERS",
      "state": "used",
      "type": "http://www.surf.scss.tcd.ie/IoTservices.owl#routeParameters",
      "desc": "Input of service taxi_availability"
    }
  ],
  "domains": [
    {
      "name": "Transport_and_Mobility",
      "url": "http://www.surf.scss.tcd.ie/cityOntology/#Transport_and_Mobility"
    }
  ],
  "id": "11_taxi_availability_x_12_call_taxi_request",
  "type": "composed"
}