{
   "outputs": [
      {
         "desc": "Output of service city_video_camera",
         "name": "_PLACEVIDEO",
         "type": "http://www.surf.scss.tcd.ie/IoTservices.owl#placeVideo"
      }
   ],
   "inputs": [
      {
         "desc": "Input of service street_surveillance_configurator",
         "name": "_STREETSURVEILLANCEPARAMETERS",
         "type": "http://www.surf.scss.tcd.ie/IoTservices.owl#streetSurveillanceParameters",
         "state": "notUsed"
      }
   ],
   "id": "21_street_surveillance_configurator_x_26_city_video_camera_request",
   "domains": [
      {
         "name": "Safety_and_Emergencies",
         "url": "http://www.surf.scss.tcd.ie/cityOntology/#Safety_and_Emergencies"
      }
   ],
   "tasks": [
      {
         "outputs": [
            {
               "desc": "Output of service city_video_camera",
               "name": "_PLACEVIDEO",
               "type": "http://www.surf.scss.tcd.ie/IoTservices.owl#placeVideo"
            }
         ],
         "name": "task-1",
         "inputs": [
            {
               "desc": "Input of service city_video_camera",
               "name": "_PLACE",
               "type": "http://www.surf.scss.tcd.ie/IoTservices.owl#place"
            }
         ],
         "services": []
      },
      {
         "outputs": [
            {
               "desc": "Output of service street_anomaly_detection",
               "name": "_PLACE",
               "type": "http://www.surf.scss.tcd.ie/IoTservices.owl#place"
            }
         ],
         "name": "task-2",
         "inputs": [
            {
               "desc": "Input of service street_anomaly_detection",
               "name": "_GUNSHOTALERT",
               "type": "http://www.surf.scss.tcd.ie/IoTservices.owl#gunshotAlert"
            },
            {
               "desc": "Input of service street_anomaly_detection",
               "name": "_ZONEINTRUSIONALERT",
               "type": "http://www.surf.scss.tcd.ie/IoTservices.owl#zoneIntrusionAlert"
            },
            {
               "desc": "Input of service street_anomaly_detection",
               "name": "_REPORT",
               "type": "http://www.surf.scss.tcd.ie/IoTservices.owl#report"
            }
         ],
         "services": []
      },
      {
         "outputs": [
            {
               "desc": "Output of service gunshot_detection",
               "name": "_GUNSHOTALERT",
               "type": "http://www.surf.scss.tcd.ie/IoTservices.owl#gunshotAlert"
            }
         ],
         "name": "task-3",
         "inputs": [
            {
               "desc": "Input of service gunshot_detection",
               "name": "_CITYZONETOMONITOR",
               "type": "http://www.surf.scss.tcd.ie/IoTservices.owl#cityZoneToMonitor"
            }
         ],
         "services": []
      },
      {
         "outputs": [
            {
               "desc": "Output of service zone_intruder_detection",
               "name": "_ZONEINTRUSIONALERT",
               "type": "http://www.surf.scss.tcd.ie/IoTservices.owl#zoneIntrusionAlert"
            }
         ],
         "name": "task-4",
         "inputs": [
            {
               "desc": "Input of service zone_intruder_detection",
               "name": "_CITYZONETOMONITOR",
               "type": "http://www.surf.scss.tcd.ie/IoTservices.owl#cityZoneToMonitor"
            }
         ],
         "services": []
      },
      {
         "outputs": [
            {
               "desc": "Output of service criminal_history",
               "name": "_REPORT",
               "type": "http://www.surf.scss.tcd.ie/IoTservices.owl#report"
            }
         ],
         "name": "task-5",
         "inputs": [
            {
               "desc": "Input of service criminal_history",
               "name": "_CITYZONETOMONITOR",
               "type": "http://www.surf.scss.tcd.ie/IoTservices.owl#cityZoneToMonitor"
            }
         ],
         "services": []
      },
      {
         "outputs": [
            {
               "desc": "Output of service street_surveillance_configurator",
               "name": "_CITYZONETOMONITOR",
               "type": "http://www.surf.scss.tcd.ie/IoTservices.owl#cityZoneToMonitor"
            }
         ],
         "name": "task-6",
         "inputs": [
            {
               "desc": "Input of service street_surveillance_configurator",
               "name": "_STREETSURVEILLANCEPARAMETERS",
               "type": "http://www.surf.scss.tcd.ie/IoTservices.owl#streetSurveillanceParameters"
            }
         ],
         "services": []
      }
   ]
}