{
   "outputs": [
      {
         "desc": "Output of service streets_dashboard",
         "name": "_STREETSDASHBOARD",
         "type": "http://www.surf.scss.tcd.ie/IoTservices.owl#streetsDashboard"
      }
   ],
   "inputs": [
      {
         "desc": "Input of service streets_waterLevel",
         "name": "_STREETSINFO",
         "type": "http://www.surf.scss.tcd.ie/IoTservices.owl#streetsInfo",
         "state": "used"
      }
   ],
   "id": "127_streets_waterLevel_x_128_streets_dashboard_request",
   "domains": [
      {
         "name": "Government_and_Planning",
         "url": "http://www.surf.scss.tcd.ie/cityOntology/#Government_and_Planning"
      },
      {
         "name": "Nature",
         "url": "http://www.surf.scss.tcd.ie/cityOntology/#Nature"
      }
   ],
   "tasks": [
      {
         "outputs": [
            {
               "desc": "Output of service streets_dashboard",
               "name": "_STREETSDASHBOARD",
               "type": "http://www.surf.scss.tcd.ie/IoTservices.owl#streetsDashboard"
            }
         ],
         "name": "task-1",
         "inputs": [
            {
               "desc": "Input of service streets_dashboard",
               "name": "_STREETSVIDEO",
               "type": "http://www.surf.scss.tcd.ie/IoTservices.owl#streetsVideo"
            },
            {
               "desc": "Input of service streets_dashboard",
               "name": "_STREETSTEMPERATURE",
               "type": "http://www.surf.scss.tcd.ie/IoTservices.owl#streetsTemperature"
            },
            {
               "desc": "Input of service streets_dashboard",
               "name": "_STREETSWATERLEVEL",
               "type": "http://www.surf.scss.tcd.ie/IoTservices.owl#streetsWaterLevel"
            }
         ],
         "services": []
      },
      {
         "outputs": [
            {
               "desc": "Output of service streets_waterLevel",
               "name": "_STREETSWATERLEVEL",
               "type": "http://www.surf.scss.tcd.ie/IoTservices.owl#streetsWaterLevel"
            }
         ],
         "name": "task-2",
         "inputs": [
            {
               "desc": "Input of service streets_waterLevel",
               "name": "_STREETSINFO",
               "type": "http://www.surf.scss.tcd.ie/IoTservices.owl#streetsInfo"
            }
         ],
         "services": []
      },
      {
         "outputs": [
            {
               "desc": "Output of service streets_temperature",
               "name": "_STREETSTEMPERATURE",
               "type": "http://www.surf.scss.tcd.ie/IoTservices.owl#streetsTemperature"
            }
         ],
         "name": "task-3",
         "inputs": [
            {
               "desc": "Input of service streets_temperature",
               "name": "_STREETSINFO",
               "type": "http://www.surf.scss.tcd.ie/IoTservices.owl#streetsInfo"
            }
         ],
         "services": []
      },
      {
         "outputs": [
            {
               "desc": "Output of service streets_camera",
               "name": "_STREETSVIDEO",
               "type": "http://www.surf.scss.tcd.ie/IoTservices.owl#streetsVideo"
            }
         ],
         "name": "task-4",
         "inputs": [
            {
               "desc": "Input of service streets_camera",
               "name": "_STREETSINFO",
               "type": "http://www.surf.scss.tcd.ie/IoTservices.owl#streetsInfo"
            }
         ],
         "services": []
      }
   ]
}