{
   "inputs": [
      {
         "type": "http://127.0.0.1/ontology/geographydataset.owl#UniqueIdentifier",
         "name": "_USERID",
         "desc": "Input of service Traffic information service."
      },
      {
         "type": "http://127.0.0.1/ontology/protont.owl#Language",
         "name": "_LANGUAGE",
         "desc": "Input of service Traffic information service."
      },
      {
         "type": "http://127.0.0.1/ontology/geographydataset.owl#KilometerLengthUnit",
         "name": "_RANGE",
         "desc": "Input of service Traffic information service."
      },
      {
         "type": "http://127.0.0.1/ontology/geographydataset.owl#Code",
         "name": "_LICENSEKEY",
         "desc": "Input of service Postal Codes of Places Finder Service"
      },
      {
         "type": "http://127.0.0.1/ontology/geographydataset.owl#PostalCode",
         "name": "_POSTALCODE",
         "desc": "Input of service Postal Codes of Places Finder Service"
      },
      {
         "type": "http://127.0.0.1/ontology/protonu.owl#PopulatedPlace",
         "name": "_PLACENAME",
         "desc": "Input of service Postal Codes of Places Finder Service"
      },
      {
         "type": "http://127.0.0.1/ontology/geographydataset.owl#Code",
         "name": "_LICENSEKEY",
         "desc": "Input of service Check and Lookup address service"
      },
      {
         "type": "http://127.0.0.1/ontology/geographydataset.owl#Code",
         "name": "_LICENSEKEY",
         "desc": "Input of service Zip code info service."
      },
      {
         "type": "http://127.0.0.1/ontology/geographydataset.owl#UniqueIdentifier",
         "name": "_USERID",
         "desc": "Input of service Location of ZipCode finder Service."
      },
      {
         "type": "http://127.0.0.1/ontology/geographydataset.owl#ZipCode",
         "name": "_ZIPCODE",
         "desc": "Input of service Location of ZipCode finder Service."
      },
      {
         "type": "http://127.0.0.1/ontology/protonu.owl#City",
         "name": "_CITY",
         "desc": "Input of service Check and Lookup address service"
      },
      {
         "type": "http://127.0.0.1/ontology/protonu.owl#State",
         "name": "_STATE",
         "desc": "Input of service Check and Lookup address service"
      },
      {
         "type": "http://127.0.0.1/ontology/protonu.owl#Country",
         "name": "_COUNTRY",
         "desc": "Input of service Check and Lookup address service"
      },
      {
         "type": "http://127.0.0.1/ontology/geographydataset.owl#Code",
         "name": "_LICENSEKEY",
         "desc": "Input of service Zip Codes finder within distance from a city."
      },
      {
         "type": "http://127.0.0.1/ontology/protonu.owl#Country",
         "name": "_COUNTRY",
         "desc": "Input of service Zip Codes finder within distance from a city."
      },
      {
         "type": "http://127.0.0.1/ontology/geographydataset.owl#US5DigitZipCode",
         "name": "_ZIPCODE",
         "desc": "Input of service Zip code info service."
      },
      {
         "type": "http://127.0.0.1/ontology/protont.owl#latitude",
         "name": "_LATITUDE1",
         "desc": "Input of service Distance calculator between two locations"
      },
      {
         "type": "http://127.0.0.1/ontology/protont.owl#longitude",
         "name": "_LONGITUDE1",
         "desc": "Input of service Distance calculator between two locations"
      },
      {
         "type": "http://127.0.0.1/ontology/protont.owl#latitude",
         "name": "_LATITUDE2",
         "desc": "Input of service Distance calculator between two locations"
      },
      {
         "type": "http://127.0.0.1/ontology/protont.owl#longitude",
         "name": "_LONGITUDE2",
         "desc": "Input of service Distance calculator between two locations"
      }
   ],
   "similarityThreshold": 0.5,
   "domains": [
      {
         "name": "Geography",
         "url": "http://www.surf.scss.tcd.ie/cityOntology/#Geography"
      },
      {
         "name": "Geography",
         "url": "http://www.surf.scss.tcd.ie/cityOntology/#Geography"
      },
      {
         "name": "Geography",
         "url": "http://www.surf.scss.tcd.ie/cityOntology/#Geography"
      },
      {
         "name": "Geography",
         "url": "http://www.surf.scss.tcd.ie/cityOntology/#Geography"
      },
      {
         "name": "Geography",
         "url": "http://www.surf.scss.tcd.ie/cityOntology/#Geography"
      },
      {
         "name": "Geography",
         "url": "http://www.surf.scss.tcd.ie/cityOntology/#Geography"
      },
      {
         "name": "Geography",
         "url": "http://www.surf.scss.tcd.ie/cityOntology/#Geography"
      },
      {
         "name": "Geography",
         "url": "http://www.surf.scss.tcd.ie/cityOntology/#Geography"
      },
      {
         "name": "Geography",
         "url": "http://www.surf.scss.tcd.ie/cityOntology/#Geography"
      },
      {
         "name": "Geography",
         "url": "http://www.surf.scss.tcd.ie/cityOntology/#Geography"
      }
   ],
   "outputs": [
      {
         "type": "http://127.0.0.1/ontology/geographydataset.owl#TrafficIncident",
         "name": "_INCIDENTS",
         "desc": "Output of service Traffic information service."
      },
      {
         "type": "http://127.0.0.1/ontology/geographydataset.owl#Coordinate",
         "name": "_HOTSPOTS",
         "desc": "Output of service Traffic information service."
      },
      {
         "type": "http://127.0.0.1/ontology/geographydataset.owl#Map",
         "name": "_MAP",
         "desc": "Output of service Traffic information service."
      }
   ],
   "feedbackThreshold": 0.5,
   "jobId": "Distance calculator between two locations-Traffic information service.-64",
   "matchingType": 0
}