{
  "outputs": [
    {
      "name": "_TRAFFICINFO",
      "type": "http://www.surf.scss.tcd.ie/IoTservices.owl#trafficInfo",
      "desc": "Output of service traffic_detection"
    }
  ],
  "expectedPlanLength": 1,
  "inputs": [
    {
      "name": "_ROUTEPARAMETERS",
      "type": "http://www.surf.scss.tcd.ie/IoTservices.owl#routeParameters",
      "desc": "Input of service traffic_detection"
    }
  ],
  "domains": [
    {
      "name": "Transport_and_Mobility",
      "url": "http://www.surf.scss.tcd.ie/cityOntology/#Transport_and_Mobility"
    }
  ],
  "id": "2_traffic_detection_request",
  "type": "atomic"
}