{
   "outputs": [
      {
         "desc": "Output of service multimodal_service",
         "name": "_MULTIMODALROUTEMAP",
         "type": "http://www.surf.scss.tcd.ie/IoTservices.owl#multimodalRouteMap"
      }
   ],
   "inputs": [
      {
         "desc": "Input of service bus_availability",
         "name": "_ROUTEPARAMETERS",
         "type": "http://www.surf.scss.tcd.ie/IoTservices.owl#routeParameters",
         "state": "used"
      }
   ],
   "id": "8_bus_availability_x_9_multimodal_service_request",
   "domains": [
      {
         "name": "Transport_and_Mobility",
         "url": "http://www.surf.scss.tcd.ie/cityOntology/#Transport_and_Mobility"
      }
   ],
   "tasks": [
      {
         "outputs": [
            {
               "desc": "Output of service multimodal_service",
               "name": "_MULTIMODALROUTEMAP",
               "type": "http://www.surf.scss.tcd.ie/IoTservices.owl#multimodalRouteMap"
            }
         ],
         "name": "task-1",
         "inputs": [
            {
               "desc": "Input of service multimodal_service",
               "name": "_BIKEAVAILABILITY",
               "type": "http://www.surf.scss.tcd.ie/IoTservices.owl#bikeAvailability"
            },
            {
               "desc": "Input of service multimodal_service",
               "name": "_BUSAVAILABILITY",
               "type": "http://www.surf.scss.tcd.ie/IoTservices.owl#busAvailability"
            }
         ],
         "services": []
      },
      {
         "outputs": [
            {
               "desc": "Output of service bike_availability",
               "name": "_BIKEAVAILABILITY",
               "type": "http://www.surf.scss.tcd.ie/IoTservices.owl#bikeAvailability"
            }
         ],
         "name": "task-2",
         "inputs": [
            {
               "desc": "Input of service bike_availability",
               "name": "_ROUTEPARAMETERS",
               "type": "http://www.surf.scss.tcd.ie/IoTservices.owl#routeParameters"
            }
         ],
         "services": []
      },
      {
         "outputs": [
            {
               "desc": "Output of service bus_availability",
               "name": "_BUSAVAILABILITY",
               "type": "http://www.surf.scss.tcd.ie/IoTservices.owl#busAvailability"
            }
         ],
         "name": "task-3",
         "inputs": [
            {
               "desc": "Input of service bus_availability",
               "name": "_ROUTEPARAMETERS",
               "type": "http://www.surf.scss.tcd.ie/IoTservices.owl#routeParameters"
            }
         ],
         "services": []
      }
   ]
}