{
  "outputs": [
    {
      "name": "_RELATEDCONTENT",
      "type": "http://www.surf.scss.tcd.ie/IoTservices.owl#relatedContent",
      "desc": "Output of service related_content"
    }
  ],
  "expectedPlanLength": 2,
  "inputs": [
    {
      "name": "_ACTIVITYPARAMETERS",
      "state": "used",
      "type": "http://www.surf.scss.tcd.ie/IoTservices.owl#activityParameters",
      "desc": "Input of service activity_search"
    }
  ],
  "domains": [
    {
      "name": "Activity",
      "url": "http://www.surf.scss.tcd.ie/cityOntology/#Activity"
    }
  ],
  "id": "74_activity_search_x_77_related_content_request",
  "type": "composed"
}