{
  "outputs": [
    {
      "name": "_PRODUCTSDELIVERYPLAN",
      "domains": [
        {
          "name": "Payment_and_Delivery",
          "url": "http://www.surf.scss.tcd.ie/cityOntology/#Payment_and_Delivery"
        }
      ],
      "type": "http://www.surf.scss.tcd.ie/IoTservices.owl#productsDeliveryPlan",
      "desc": "Output of service products_delivery"
    }
  ],
  "inputs": [
    {
      "name": "_PRODUCTDATA",
      "domains": [
        {
          "name": "Sport",
          "url": "http://www.surf.scss.tcd.ie/cityOntology/#Sport"
        },
        {
          "name": "Leisure",
          "url": "http://www.surf.scss.tcd.ie/cityOntology/#Leisure"
        },
        {
          "name": "Activity",
          "url": "http://www.surf.scss.tcd.ie/cityOntology/#Activity"
        }
      ],
      "state": "used",
      "type": "http://www.surf.scss.tcd.ie/IoTservices.owl#productData",
      "desc": "Input of service buy_sport_products"
    }
  ],
  "domains": [
    {
      "name": "Sport",
      "url": "http://www.surf.scss.tcd.ie/cityOntology/#Sport"
    },
    {
      "name": "Leisure",
      "url": "http://www.surf.scss.tcd.ie/cityOntology/#Leisure"
    },
    {
      "name": "Activity",
      "url": "http://www.surf.scss.tcd.ie/cityOntology/#Activity"
    },
    {
      "name": "Payment_and_Delivery",
      "url": "http://www.surf.scss.tcd.ie/cityOntology/#Payment_and_Delivery"
    }
  ],
  "id": "buy_sport_products_x_products_delivery"
}