{
  "outputs": [
    {
      "name": "_DISTRIBUTION_MAP",
      "domains": [
        {
          "name": "Transport_and_Mobility",
          "url": "http://www.surf.scss.tcd.ie/cityOntology/#Transport_and_Mobility"
        }
      ],
      "type": "http://www.surf.scss.tcd.ie/IoTservices.owl#distribution_map",
      "desc": "Output of service vehicle_distribution"
    }
  ],
  "expectedPlanLength": 1,
  "inputs": [
    {
      "name": "_MONITOREDAREA",
      "domains": [
        {
          "name": "Transport_and_Mobility",
          "url": "http://www.surf.scss.tcd.ie/cityOntology/#Transport_and_Mobility"
        }
      ],
      "type": "http://www.surf.scss.tcd.ie/IoTservices.owl#monitoredArea",
      "desc": "Input of service vehicle_distribution"
    }
  ],
  "domains": [
    {
      "name": "Transport_and_Mobility",
      "url": "http://www.surf.scss.tcd.ie/cityOntology/#Transport_and_Mobility"
    }
  ],
  "id": "101_vehicle_distribution_request",
  "type": "atomic"
}