{
   "id": "12_call_taxi_request",
   "domains": [
      {
         "name": "Transport_and_Mobility",
         "url": "http://www.surf.scss.tcd.ie/cityOntology/#Transport_and_Mobility"
      }
   ],
   "tasks": [
      {
         "outputs": [
            {
               "desc": "Output of service call_taxi",
               "name": "_CALLTAXI",
               "type": "http://www.surf.scss.tcd.ie/IoTservices.owl#callTaxi"
            }
         ],
         "name": "task-1",
         "inputs": [
            {
               "desc": "Input of service call_taxi",
               "name": "_TAXILOCATION",
               "type": "http://www.surf.scss.tcd.ie/IoTservices.owl#taxiLocation"
            },
            {
               "desc": "Input of service call_taxi",
               "name": "_TAXIAVAILABILITY",
               "type": "http://www.surf.scss.tcd.ie/IoTservices.owl#taxiAvailability"
            }
         ],
         "services": []
      }
   ]
}