{
  "outputs": [
    {
      "name": "_STREETSDASHBOARD",
      "domains": [
        {
          "name": "Government_and_Planning",
          "url": "http://www.surf.scss.tcd.ie/cityOntology/#Government_and_Planning"
        }
      ],
      "type": "http://www.surf.scss.tcd.ie/IoTservices.owl#streetsDashboard",
      "desc": "Output of service streets_dashboard"
    }
  ],
  "expectedPlanLength": 1,
  "inputs": [
    {
      "name": "_STREETSVIDEO",
      "domains": [
        {
          "name": "Government_and_Planning",
          "url": "http://www.surf.scss.tcd.ie/cityOntology/#Government_and_Planning"
        }
      ],
      "type": "http://www.surf.scss.tcd.ie/IoTservices.owl#streetsVideo",
      "desc": "Input of service streets_dashboard"
    },
    {
      "name": "_STREETSTEMPERATURE",
      "domains": [
        {
          "name": "Government_and_Planning",
          "url": "http://www.surf.scss.tcd.ie/cityOntology/#Government_and_Planning"
        }
      ],
      "type": "http://www.surf.scss.tcd.ie/IoTservices.owl#streetsTemperature",
      "desc": "Input of service streets_dashboard"
    },
    {
      "name": "_STREETSWATERLEVEL",
      "domains": [
        {
          "name": "Government_and_Planning",
          "url": "http://www.surf.scss.tcd.ie/cityOntology/#Government_and_Planning"
        }
      ],
      "type": "http://www.surf.scss.tcd.ie/IoTservices.owl#streetsWaterLevel",
      "desc": "Input of service streets_dashboard"
    }
  ],
  "domains": [
    {
      "name": "Government_and_Planning",
      "url": "http://www.surf.scss.tcd.ie/cityOntology/#Government_and_Planning"
    }
  ],
  "id": "128_streets_dashboard_request",
  "type": "atomic"
}