{
   "outputs": [
      {
         "name": "_HOTEL",
         "desc": "Output of service HotelInfoService",
         "type": "http://127.0.0.1/ontology/travel.owl#Hotel"
      }
   ],
   "domains": [
      {
         "url": "http://www.surf.scss.tcd.ie/cityOntology/#Travel",
         "name": "Travel"
      }
   ],
   "inputs": [
      {
         "name": "_COUNTRY",
         "desc": "Input of service HotelInfoService",
         "type": "http://127.0.0.1/ontology/portal.owl#Country"
      },
      {
         "name": "_CITY",
         "desc": "Input of service HotelInfoService",
         "type": "http://127.0.0.1/ontology/portal.owl#City"
      }
   ],
   "id": "HotelInfoService_request"
}