{
   "id": "45_construction_dashboard_request",
   "domains": [
      {
         "name": "Safety_and_Emergencies",
         "url": "http://www.surf.scss.tcd.ie/cityOntology/#Safety_and_Emergencies"
      },
      {
         "name": "Construction",
         "url": "http://www.surf.scss.tcd.ie/cityOntology/#Construction"
      }
   ],
   "tasks": [
      {
         "outputs": [
            {
               "desc": "Output of service construction_dashboard",
               "name": "_CONSTRUCTIONDASHBOARD",
               "type": "http://www.surf.scss.tcd.ie/IoTservices.owl#constructionDashboard"
            }
         ],
         "name": "task-1",
         "inputs": [
            {
               "desc": "Input of service construction_dashboard",
               "name": "_CONSTRUCTIONINFORMATION",
               "type": "http://www.surf.scss.tcd.ie/IoTservices.owl#constructionInformation"
            }
         ],
         "services": []
      }
   ]
}