{
  "outputs": [
    {
      "name": "_BROADCASTVIDEO",
      "domains": [
        {
          "name": "Safety_and_Emergencies",
          "url": "http://www.surf.scss.tcd.ie/cityOntology/#Safety_and_Emergencies"
        }
      ],
      "type": "http://www.surf.scss.tcd.ie/IoTservices.owl#broadcastVideo",
      "desc": "Output of service broadcast_near_patrol"
    }
  ],
  "inputs": [
    {
      "name": "_CITYZONETOMONITOR",
      "domains": [
        {
          "name": "Safety_and_Emergencies",
          "url": "http://www.surf.scss.tcd.ie/cityOntology/#Safety_and_Emergencies"
        }
      ],
      "state": "used",
      "type": "http://www.surf.scss.tcd.ie/IoTservices.owl#cityZoneToMonitor",
      "desc": "Input of service zone_intruder_detection"
    }
  ],
  "domains": [
    {
      "name": "Safety_and_Emergencies",
      "url": "http://www.surf.scss.tcd.ie/cityOntology/#Safety_and_Emergencies"
    }
  ],
  "id": "zone_intruder_detection_x_broadcast_near_patrol"
}