{
   "id": "107_garbage_bin_status_request",
   "domains": [
      {
         "name": "Waste",
         "url": "http://www.surf.scss.tcd.ie/cityOntology/#Waste"
      }
   ],
   "tasks": [
      {
         "outputs": [
            {
               "desc": "Output of service garbage_bin_status",
               "name": "_BINSTATUS",
               "type": "http://www.surf.scss.tcd.ie/IoTservices.owl#binStatus"
            }
         ],
         "name": "task-1",
         "inputs": [
            {
               "desc": "Input of service garbage_bin_status",
               "name": "_BINID",
               "type": "http://www.surf.scss.tcd.ie/IoTservices.owl#binId"
            }
         ],
         "services": []
      }
   ]
}