{
   "outputs": [
      {
         "name": "_TAXEDPRICE",
         "type": "http://127.0.0.1/ontology/concept.owl#TaxedPrice",
         "desc": "Output of service Tea TaxedPrice Service"
      }
   ],
   "inputs": [
      {
         "name": "_SANDWICH",
         "type": "http://127.0.0.1/ontology/Mid-level-ontology.owl#Sandwich",
         "desc": "Input of service Sandwich RecommendedPrice Service"
      }
   ],
   "tasks": [
      {
         "services": [],
         "name": "task-1",
         "inputs": [
            {
               "name": "_COFFEE",
               "type": "http://127.0.0.1/ontology/Mid-level-ontology.owl#Coffee",
               "desc": "Input of service Coffee TaxedPrice Service"
            }
         ],
         "outputs": [
            {
               "name": "_TAXEDPRICE",
               "type": "http://127.0.0.1/ontology/concept.owl#TaxedPrice",
               "desc": "Output of service Coffee TaxedPrice Service"
            }
         ]
      },
      {
         "services": [],
         "name": "task-2",
         "inputs": [
            {
               "name": "_RETAILSTORE",
               "type": "http://127.0.0.1/ontology/Mid-level-ontology.owl#RetailStore",
               "desc": "Input of service RetailStore PreparedFood Quantity Service"
            }
         ],
         "outputs": [
            {
               "name": "_PREPAREDFOOD",
               "type": "http://127.0.0.1/ontology/Mid-level-ontology.owl#PreparedFood",
               "desc": "Output of service RetailStore PreparedFood Quantity Service"
            },
            {
               "name": "_QUANTITY",
               "type": "http://127.0.0.1/ontology/support.owl#Quantity",
               "desc": "Output of service RetailStore PreparedFood Quantity Service"
            }
         ]
      },
      {
         "services": [],
         "name": "task-3",
         "inputs": [
            {
               "name": "_PREPAREDFOOD",
               "type": "http://127.0.0.1/ontology/Mid-level-ontology.owl#PreparedFood",
               "desc": "Input of service GroceryStoreRecommendedPrice"
            }
         ],
         "outputs": [
            {
               "name": "_GROCERYSTORE",
               "type": "http://127.0.0.1/ontology/Mid-level-ontology.owl#GroceryStore",
               "desc": "Output of service GroceryStoreRecommendedPrice"
            },
            {
               "name": "_RECOMMENDEDPRICE",
               "type": "http://127.0.0.1/ontology/concept.owl#RecommendedPrice",
               "desc": "Output of service GroceryStoreRecommendedPrice"
            }
         ]
      }
   ],
   "id": "Sandwich RecommendedPrice Service_Tea TaxedPrice Service_request",
   "domains": [
      {
         "name": "Food_and_Drinks",
         "url": "http://www.surf.scss.tcd.ie/cityOntology/#Food_and_Drinks"
      }
   ]
}