{
   "inputs": [
      {
         "desc": "Input of service Science-Fiction-Novel Author TaxedPrice Service",
         "type": "http://127.0.0.1/ontology/books.owl#Science-Fiction-Novel",
         "name": "_SCIENCE-FICTION-NOVEL"
      }
   ],
   "similarityThreshold": 0.5,
   "jobId": "Science-Fiction-Novel Author TaxedPrice Service-Author Book TaxFreePrice Service-246",
   "matchingType": 0,
   "outputs": [
      {
         "desc": "Output of service Author Book TaxFreePrice Service",
         "type": "http://127.0.0.1/ontology/books.owl#Book",
         "name": "_BOOK"
      },
      {
         "desc": "Output of service Author Book TaxFreePrice Service",
         "type": "http://127.0.0.1/ontology/concept.owl#TaxFreePrice",
         "name": "_TAXFREEPRICE"
      }
   ],
   "domains": [
      {
         "url": "http://www.surf.scss.tcd.ie/cityOntology/#Entertainment_Products",
         "name": "Entertainment_Products"
      },
      {
         "url": "http://www.surf.scss.tcd.ie/cityOntology/#Entertainment_Products",
         "name": "Entertainment_Products"
      },
      {
         "url": "http://www.surf.scss.tcd.ie/cityOntology/#Entertainment_Products",
         "name": "Entertainment_Products"
      },
      {
         "url": "http://www.surf.scss.tcd.ie/cityOntology/#Entertainment_Products",
         "name": "Entertainment_Products"
      },
      {
         "url": "http://www.surf.scss.tcd.ie/cityOntology/#Entertainment_Products",
         "name": "Entertainment_Products"
      },
      {
         "url": "http://www.surf.scss.tcd.ie/cityOntology/#Entertainment_Products",
         "name": "Entertainment_Products"
      },
      {
         "url": "http://www.surf.scss.tcd.ie/cityOntology/#Entertainment_Products",
         "name": "Entertainment_Products"
      }
   ],
   "feedbackThreshold": 0.5
}