{
  "outputs": [
    {
      "name": "_ZONEINTRUSIONALERT",
      "domains": [
        {
          "name": "Safety_and_Emergencies",
          "url": "http://www.surf.scss.tcd.ie/cityOntology/#Safety_and_Emergencies"
        }
      ],
      "type": "http://www.surf.scss.tcd.ie/IoTservices.owl#zoneIntrusionAlert",
      "desc": "Output of service zone_intruder_detection"
    }
  ],
  "expectedPlanLength": 1,
  "inputs": [
    {
      "name": "_CITYZONETOMONITOR",
      "domains": [
        {
          "name": "Safety_and_Emergencies",
          "url": "http://www.surf.scss.tcd.ie/cityOntology/#Safety_and_Emergencies"
        }
      ],
      "type": "http://www.surf.scss.tcd.ie/IoTservices.owl#cityZoneToMonitor",
      "desc": "Input of service zone_intruder_detection"
    }
  ],
  "domains": [
    {
      "name": "Safety_and_Emergencies",
      "url": "http://www.surf.scss.tcd.ie/cityOntology/#Safety_and_Emergencies"
    }
  ],
  "id": "23_zone_intruder_detection_request",
  "type": "atomic"
}