{
   "tasks": [
      {
         "services": [],
         "name": "task-1",
         "inputs": [
            {
               "name": "_MP3PLAYER",
               "desc": "Input of service 2For 1 Price service",
               "type": "http://127.0.0.1/ontology/my_ontology.owl#MP3Player"
            },
            {
               "name": "_DVDPLAYER",
               "desc": "Input of service 2For 1 Price service",
               "type": "http://127.0.0.1/ontology/my_ontology.owl#DVDPlayer"
            }
         ],
         "outputs": [
            {
               "name": "_PRICE",
               "desc": "Output of service 2For 1 Price service",
               "type": "http://127.0.0.1/ontology/concept.owl#Price"
            }
         ]
      }
   ],
   "id": "2For 1 Price service_request",
   "domains": [
      {
         "name": "Technology",
         "url": "http://www.surf.scss.tcd.ie/cityOntology/#Technology"
      }
   ]
}