{
   "id": "35_start_home_alarm_request",
   "domains": [
      {
         "name": "Safety_and_Emergencies",
         "url": "http://www.surf.scss.tcd.ie/cityOntology/#Safety_and_Emergencies"
      }
   ],
   "tasks": [
      {
         "outputs": [
            {
               "desc": "Output of service start_home_alarm",
               "name": "_HOMEALARM",
               "type": "http://www.surf.scss.tcd.ie/IoTservices.owl#homeAlarm"
            }
         ],
         "name": "task-1",
         "inputs": [
            {
               "desc": "Input of service start_home_alarm",
               "name": "_STARTALARM",
               "type": "http://www.surf.scss.tcd.ie/IoTservices.owl#startAlarm"
            }
         ],
         "services": []
      }
   ]
}