{
   "outputs": [
      {
         "desc": "Output of service construction_dashboard",
         "name": "_CONSTRUCTIONDASHBOARD",
         "type": "http://www.surf.scss.tcd.ie/IoTservices.owl#constructionDashboard"
      }
   ],
   "inputs": [
      {
         "desc": "Input of service construction_monitoring_configurator",
         "name": "_CONSTRUCTIONMONITORINGPARAMETERS",
         "type": "http://www.surf.scss.tcd.ie/IoTservices.owl#constructionMonitoringParameters",
         "state": "used"
      }
   ],
   "id": "40_construction_monitoring_configurator_x_45_construction_dashboard_request",
   "domains": [
      {
         "name": "Safety_and_Emergencies",
         "url": "http://www.surf.scss.tcd.ie/cityOntology/#Safety_and_Emergencies"
      },
      {
         "name": "Construction",
         "url": "http://www.surf.scss.tcd.ie/cityOntology/#Construction"
      }
   ],
   "tasks": [
      {
         "outputs": [
            {
               "desc": "Output of service construction_dashboard",
               "name": "_CONSTRUCTIONDASHBOARD",
               "type": "http://www.surf.scss.tcd.ie/IoTservices.owl#constructionDashboard"
            }
         ],
         "name": "task-1",
         "inputs": [
            {
               "desc": "Input of service construction_dashboard",
               "name": "_CONSTRUCTIONINFORMATION",
               "type": "http://www.surf.scss.tcd.ie/IoTservices.owl#constructionInformation"
            }
         ],
         "services": []
      },
      {
         "outputs": [
            {
               "desc": "Output of service construction_anomaly_detection",
               "name": "_CONSTRUCTIONINFORMATION",
               "type": "http://www.surf.scss.tcd.ie/IoTservices.owl#constructionInformation"
            }
         ],
         "name": "task-2",
         "inputs": [
            {
               "desc": "Input of service construction_anomaly_detection",
               "name": "_MACHINESTATUS",
               "type": "http://www.surf.scss.tcd.ie/IoTservices.owl#machineStatus"
            },
            {
               "desc": "Input of service construction_anomaly_detection",
               "name": "_GASDETECTION",
               "type": "http://www.surf.scss.tcd.ie/IoTservices.owl#gasDetection"
            }
         ],
         "services": []
      },
      {
         "outputs": [
            {
               "desc": "Output of service monitoring_machines",
               "name": "_MACHINESTATUS",
               "type": "http://www.surf.scss.tcd.ie/IoTservices.owl#machineStatus"
            }
         ],
         "name": "task-3",
         "inputs": [
            {
               "desc": "Input of service monitoring_machines",
               "name": "_CONSTRUCTIONSTATUS",
               "type": "http://www.surf.scss.tcd.ie/IoTservices.owl#constructionStatus"
            }
         ],
         "services": []
      },
      {
         "outputs": [
            {
               "desc": "Output of service hazardous_gases_detection",
               "name": "_GASDETECTION",
               "type": "http://www.surf.scss.tcd.ie/IoTservices.owl#gasDetection"
            }
         ],
         "name": "task-4",
         "inputs": [
            {
               "desc": "Input of service hazardous_gases_detection",
               "name": "_CONSTRUCTIONSTATUS",
               "type": "http://www.surf.scss.tcd.ie/IoTservices.owl#constructionStatus"
            }
         ],
         "services": []
      },
      {
         "outputs": [
            {
               "desc": "Output of service construction_status",
               "name": "_CONSTRUCTIONSTATUS",
               "type": "http://www.surf.scss.tcd.ie/IoTservices.owl#constructionStatus"
            }
         ],
         "name": "task-5",
         "inputs": [
            {
               "desc": "Input of service construction_status",
               "name": "_CONSTRUCTIONINFO",
               "type": "http://www.surf.scss.tcd.ie/IoTservices.owl#constructionInfo"
            }
         ],
         "services": []
      },
      {
         "outputs": [
            {
               "desc": "Output of service construction_monitoring_configurator",
               "name": "_CONSTRUCTIONINFO",
               "type": "http://www.surf.scss.tcd.ie/IoTservices.owl#constructionInfo"
            }
         ],
         "name": "task-6",
         "inputs": [
            {
               "desc": "Input of service construction_monitoring_configurator",
               "name": "_CONSTRUCTIONMONITORINGPARAMETERS",
               "type": "http://www.surf.scss.tcd.ie/IoTservices.owl#constructionMonitoringParameters"
            }
         ],
         "services": []
      }
   ]
}