{
   "feedbackThreshold": 0.5,
   "domains": [
      {
         "name": "Food_and_Drinks",
         "url": "http://www.surf.scss.tcd.ie/cityOntology/#Food_and_Drinks"
      },
      {
         "name": "Food_and_Drinks",
         "url": "http://www.surf.scss.tcd.ie/cityOntology/#Food_and_Drinks"
      }
   ],
   "matchingType": 0,
   "inputs": [
      {
         "name": "_MAXPRICE",
         "type": "http://127.0.0.1/ontology/concept.owl#MaxPrice",
         "desc": "Input of service BreadProviderService"
      }
   ],
   "similarityThreshold": 0.5,
   "jobId": "BreadProviderService-BreadBiscuitPriceService-202",
   "outputs": [
      {
         "name": "_RECOMMENDEDPRICEINEURO",
         "type": "http://127.0.0.1/ontology/concept.owl#RecommendedPriceInEuro",
         "desc": "Output of service BreadBiscuitPriceService"
      },
      {
         "name": "_TAXEDPRICEINEURO",
         "type": "http://127.0.0.1/ontology/concept.owl#TaxedPriceInEuro",
         "desc": "Output of service BreadBiscuitPriceService"
      }
   ]
}