{
   "outputs": [
      {
         "desc": "Output of service configure_vehicle_communication",
         "name": "_VEHICLECONFIGURED",
         "type": "http://www.surf.scss.tcd.ie/IoTservices.owl#vehicleConfigured"
      }
   ],
   "inputs": [
      {
         "desc": "Input of service calculate_ambulance_path",
         "name": "_AMBULANCEINFO",
         "type": "http://www.surf.scss.tcd.ie/IoTservices.owl#ambulanceInfo",
         "state": "used"
      }
   ],
   "id": "94_calculate_ambulance_path_x_95_configure_vehicle_communication_request",
   "domains": [
      {
         "name": "Transport_and_Mobility",
         "url": "http://www.surf.scss.tcd.ie/cityOntology/#Transport_and_Mobility"
      },
      {
         "name": "Communications",
         "url": "http://www.surf.scss.tcd.ie/cityOntology/#Communications"
      }
   ],
   "tasks": [
      {
         "outputs": [
            {
               "desc": "Output of service configure_vehicle_communication",
               "name": "_VEHICLECONFIGURED",
               "type": "http://www.surf.scss.tcd.ie/IoTservices.owl#vehicleConfigured"
            }
         ],
         "name": "task-1",
         "inputs": [
            {
               "desc": "Input of service configure_vehicle_communication",
               "name": "_AMBULANCEROUTE",
               "type": "http://www.surf.scss.tcd.ie/IoTservices.owl#ambulanceRoute"
            }
         ],
         "services": []
      },
      {
         "outputs": [
            {
               "desc": "Output of service calculate_ambulance_path",
               "name": "_AMBULANCEROUTE",
               "type": "http://www.surf.scss.tcd.ie/IoTservices.owl#ambulanceRoute"
            }
         ],
         "name": "task-2",
         "inputs": [
            {
               "desc": "Input of service calculate_ambulance_path",
               "name": "_AMBULANCEINFO",
               "type": "http://www.surf.scss.tcd.ie/IoTservices.owl#ambulanceInfo"
            }
         ],
         "services": []
      }
   ]
}