{
   "similarityThreshold": 0.5,
   "outputs": [
      {
         "name": "_COFFEE",
         "type": "http://127.0.0.1/ontology/my_ontology.owl#Coffee",
         "desc": "Output of service RecommendedPriceCoffeeWhiskey Service"
      },
      {
         "name": "_WHISKEY",
         "type": "http://127.0.0.1/ontology/my_ontology.owl#Whiskey",
         "desc": "Output of service RecommendedPriceCoffeeWhiskey Service"
      }
   ],
   "feedbackThreshold": 0.5,
   "matchingType": 0,
   "domains": [
      {
         "name": "Food_and_Drinks",
         "url": "http://www.surf.scss.tcd.ie/cityOntology/#Food_and_Drinks"
      },
      {
         "name": "Food_and_Drinks",
         "url": "http://www.surf.scss.tcd.ie/cityOntology/#Food_and_Drinks"
      }
   ],
   "jobId": "GroceryStoreRecommendedPrice-RecommendedPriceCoffeeWhiskey Service-426",
   "inputs": [
      {
         "name": "_PREPAREDFOOD",
         "type": "http://127.0.0.1/ontology/Mid-level-ontology.owl#PreparedFood",
         "desc": "Input of service GroceryStoreRecommendedPrice"
      }
   ]
}