{
  "outputs": [
    {
      "name": "_BOOKNOTIFICATION",
      "domains": [
        {
          "name": "Accommodation",
          "url": "http://www.surf.scss.tcd.ie/cityOntology/#Accommodation"
        }
      ],
      "type": "http://www.surf.scss.tcd.ie/IoTservices.owl#bookNotification",
      "desc": "Output of service notify_booking"
    }
  ],
  "inputs": [
    {
      "name": "_SELECTEDACCOMMODATION",
      "domains": [
        {
          "name": "Accommodation",
          "url": "http://www.surf.scss.tcd.ie/cityOntology/#Accommodation"
        }
      ],
      "state": "used",
      "type": "http://www.surf.scss.tcd.ie/IoTservices.owl#selectedAccommodation",
      "desc": "Input of service activate_room_camera"
    }
  ],
  "domains": [
    {
      "name": "Accommodation",
      "url": "http://www.surf.scss.tcd.ie/cityOntology/#Accommodation"
    }
  ],
  "id": "activate_room_camera_x_notify_booking"
}