{
   "similarityThreshold": 0.5,
   "feedbackThreshold": 0.5,
   "outputs": [
      {
         "type": "http://127.0.0.1/ontology/my_ontology.owl#Coffee",
         "desc": "Output of service TheBest service",
         "name": "_COFFEE"
      },
      {
         "type": "http://127.0.0.1/ontology/my_ontology.owl#Whiskey",
         "desc": "Output of service TheBest service",
         "name": "_WHISKEY"
      }
   ],
   "jobId": "PTP service-TheBest service-29",
   "matchingType": 0,
   "domains": [
      {
         "url": "http://www.surf.scss.tcd.ie/cityOntology/#Food_and_Drinks",
         "name": "Food_and_Drinks"
      },
      {
         "url": "http://www.surf.scss.tcd.ie/cityOntology/#Food_and_Drinks",
         "name": "Food_and_Drinks"
      }
   ],
   "inputs": [
      {
         "type": "http://127.0.0.1/ontology/Mid-level-ontology.owl#PreparedFood",
         "desc": "Input of service PTP service",
         "name": "_PREPAREDFOOD"
      }
   ]
}