{
  "outputs": [
    {
      "name": "_BOOKACCOMMODATION",
      "domains": [
        {
          "name": "Accommodation",
          "url": "http://www.surf.scss.tcd.ie/cityOntology/#Accommodation"
        }
      ],
      "type": "http://www.surf.scss.tcd.ie/IoTservices.owl#bookAccommodation",
      "desc": "Output of service book_accommodation"
    }
  ],
  "inputs": [
    {
      "name": "_ACCOMMODATIONPARAMETERS",
      "domains": [
        {
          "name": "Accommodation",
          "url": "http://www.surf.scss.tcd.ie/cityOntology/#Accommodation"
        }
      ],
      "state": "used",
      "type": "http://www.surf.scss.tcd.ie/IoTservices.owl#accommodationParameters",
      "desc": "Input of service search_accommodation"
    }
  ],
  "domains": [
    {
      "name": "Accommodation",
      "url": "http://www.surf.scss.tcd.ie/cityOntology/#Accommodation"
    }
  ],
  "id": "search_accommodation_x_book_accommodation"
}