{
  "outputs": [
    {
      "name": "_ROOMINFO",
      "domains": [
        {
          "name": "Educational",
          "url": "http://www.surf.scss.tcd.ie/cityOntology/#Educational"
        }
      ],
      "type": "http://www.surf.scss.tcd.ie/IoTservices.owl#roomInfo",
      "desc": "Output of service search_campus_room"
    }
  ],
  "expectedPlanLength": 1,
  "inputs": [
    {
      "name": "_ROOMPARAMETERS",
      "domains": [
        {
          "name": "Educational",
          "url": "http://www.surf.scss.tcd.ie/cityOntology/#Educational"
        }
      ],
      "type": "http://www.surf.scss.tcd.ie/IoTservices.owl#roomParameters",
      "desc": "Input of service search_campus_room"
    }
  ],
  "domains": [
    {
      "name": "Educational",
      "url": "http://www.surf.scss.tcd.ie/cityOntology/#Educational"
    }
  ],
  "id": "63_search_campus_room_request",
  "type": "atomic"
}