{
   "outputs": [
      {
         "desc": "Output of service pay_order",
         "name": "_PAYMENTINFO",
         "type": "http://www.surf.scss.tcd.ie/IoTservices.owl#paymentInfo"
      }
   ],
   "inputs": [
      {
         "desc": "Input of service present_offers_mirror",
         "name": "_OFFERSINFO",
         "type": "http://www.surf.scss.tcd.ie/IoTservices.owl#offersInfo",
         "state": "used"
      }
   ],
   "id": "69_present_offers_mirror_x_135_pay_order_request",
   "domains": [
      {
         "name": "Clothing",
         "url": "http://www.surf.scss.tcd.ie/cityOntology/#Clothing"
      },
      {
         "name": "Payment_and_Delivery",
         "url": "http://www.surf.scss.tcd.ie/cityOntology/#Payment_and_Delivery"
      }
   ],
   "tasks": [
      {
         "outputs": [
            {
               "desc": "Output of service pay_order",
               "name": "_PAYMENTINFO",
               "type": "http://www.surf.scss.tcd.ie/IoTservices.owl#paymentInfo"
            }
         ],
         "name": "task-1",
         "inputs": [
            {
               "desc": "Input of service pay_order",
               "name": "_PURCHASEORDER",
               "type": "http://www.surf.scss.tcd.ie/IoTservices.owl#purchaseOrder"
            }
         ],
         "services": []
      },
      {
         "outputs": [
            {
               "desc": "Output of service shopping_order",
               "name": "_PURCHASEORDER",
               "type": "http://www.surf.scss.tcd.ie/IoTservices.owl#purchaseOrder"
            }
         ],
         "name": "task-2",
         "inputs": [
            {
               "desc": "Input of service shopping_order",
               "name": "_PRODUCTS",
               "type": "http://www.surf.scss.tcd.ie/IoTservices.owl#products"
            }
         ],
         "services": []
      },
      {
         "outputs": [
            {
               "desc": "Output of service clothes_selection",
               "name": "_PRODUCTS",
               "type": "http://www.surf.scss.tcd.ie/IoTservices.owl#products"
            }
         ],
         "name": "task-3",
         "inputs": [
            {
               "desc": "Input of service clothes_selection",
               "name": "_PRESENTOFFERS",
               "type": "http://www.surf.scss.tcd.ie/IoTservices.owl#presentOffers"
            }
         ],
         "services": []
      },
      {
         "outputs": [
            {
               "desc": "Output of service present_offers_mirror",
               "name": "_PRESENTOFFERS",
               "type": "http://www.surf.scss.tcd.ie/IoTservices.owl#presentOffers"
            }
         ],
         "name": "task-4",
         "inputs": [
            {
               "desc": "Input of service present_offers_mirror",
               "name": "_OFFERSINFO",
               "type": "http://www.surf.scss.tcd.ie/IoTservices.owl#offersInfo"
            }
         ],
         "services": []
      }
   ]
}