{
  "outputs": [
    {
      "name": "_CONFIGUREDGRID",
      "domains": [
        {
          "name": "Energy",
          "url": "http://www.surf.scss.tcd.ie/cityOntology/#Energy"
        }
      ],
      "type": "http://www.surf.scss.tcd.ie/IoTservices.owl#configuredGrid",
      "desc": "Output of service grid_configuration"
    }
  ],
  "expectedPlanLength": 1,
  "inputs": [
    {
      "name": "_GRIDREPORT",
      "domains": [
        {
          "name": "Energy",
          "url": "http://www.surf.scss.tcd.ie/cityOntology/#Energy"
        }
      ],
      "type": "http://www.surf.scss.tcd.ie/IoTservices.owl#gridReport",
      "desc": "Input of service grid_configuration"
    }
  ],
  "domains": [
    {
      "name": "Energy",
      "url": "http://www.surf.scss.tcd.ie/cityOntology/#Energy"
    }
  ],
  "id": "110_grid_configuration_request",
  "type": "atomic"
}