{
   "similarityThreshold": 0.5,
   "matchingType": 0,
   "domains": [
      {
         "name": "Entertainment_Products",
         "url": "http://www.surf.scss.tcd.ie/cityOntology/#Entertainment_Products"
      },
      {
         "name": "Entertainment_Products",
         "url": "http://www.surf.scss.tcd.ie/cityOntology/#Entertainment_Products"
      },
      {
         "name": "Entertainment_Products",
         "url": "http://www.surf.scss.tcd.ie/cityOntology/#Entertainment_Products"
      },
      {
         "name": "Entertainment_Products",
         "url": "http://www.surf.scss.tcd.ie/cityOntology/#Entertainment_Products"
      },
      {
         "name": "Entertainment_Products",
         "url": "http://www.surf.scss.tcd.ie/cityOntology/#Entertainment_Products"
      },
      {
         "name": "Entertainment_Products",
         "url": "http://www.surf.scss.tcd.ie/cityOntology/#Entertainment_Products"
      },
      {
         "name": "Entertainment_Products",
         "url": "http://www.surf.scss.tcd.ie/cityOntology/#Entertainment_Products"
      }
   ],
   "jobId": "RomanticNovel Author TaxedPrice Service-BookPriceService-413",
   "feedbackThreshold": 0.5,
   "inputs": [
      {
         "name": "_ROMANTICNOVEL",
         "type": "http://127.0.0.1/ontology/books.owl#RomanticNovel",
         "desc": "Input of service RomanticNovel Author TaxedPrice Service"
      }
   ],
   "outputs": [
      {
         "name": "_PRICE",
         "type": "http://127.0.0.1/ontology/concept.owl#Price",
         "desc": "Output of service BookPriceService"
      },
      {
         "name": "_REVIEW",
         "type": "http://127.0.0.1/ontology/books.owl#Review",
         "desc": "Output of service BookPriceService"
      },
      {
         "name": "_BOOK1",
         "type": "http://127.0.0.1/ontology/books.owl#Book",
         "desc": "Output of service BookPriceService"
      }
   ]
}