{
  "outputs": [
    {
      "name": "_TOURISTICPATH",
      "domains": [
        {
          "name": "Activity",
          "url": "http://www.surf.scss.tcd.ie/cityOntology/#Activity"
        },
        {
          "name": "Travel",
          "url": "http://www.surf.scss.tcd.ie/cityOntology/#Travel"
        },
        {
          "name": "Geography",
          "url": "http://www.surf.scss.tcd.ie/cityOntology/#Geography"
        }
      ],
      "type": "http://www.surf.scss.tcd.ie/IoTservices.owl#touristicPath",
      "desc": "Output of service touristic_path_calculator"
    }
  ],
  "expectedPlanLength": 1,
  "inputs": [
    {
      "name": "_ACTIVITYINFO",
      "domains": [
        {
          "name": "Activity",
          "url": "http://www.surf.scss.tcd.ie/cityOntology/#Activity"
        },
        {
          "name": "Travel",
          "url": "http://www.surf.scss.tcd.ie/cityOntology/#Travel"
        },
        {
          "name": "Geography",
          "url": "http://www.surf.scss.tcd.ie/cityOntology/#Geography"
        }
      ],
      "type": "http://www.surf.scss.tcd.ie/IoTservices.owl#activityInfo",
      "desc": "Input of service touristic_path_calculator"
    }
  ],
  "domains": [
    {
      "name": "Activity",
      "url": "http://www.surf.scss.tcd.ie/cityOntology/#Activity"
    },
    {
      "name": "Travel",
      "url": "http://www.surf.scss.tcd.ie/cityOntology/#Travel"
    },
    {
      "name": "Geography",
      "url": "http://www.surf.scss.tcd.ie/cityOntology/#Geography"
    }
  ],
  "id": "75_touristic_path_calculator_request",
  "type": "atomic"
}