{
  "outputs": [
    {
      "name": "_MONITORLOG",
      "domains": [
        {
          "name": "Educational",
          "url": "http://www.surf.scss.tcd.ie/cityOntology/#Educational"
        },
        {
          "name": "Research_and_Science",
          "url": "http://www.surf.scss.tcd.ie/cityOntology/#Research_and_Science"
        }
      ],
      "type": "http://www.surf.scss.tcd.ie/IoTservices.owl#monitorLog",
      "desc": "Output of service book_monitoring"
    }
  ],
  "inputs": [
    {
      "name": "_BOOKSTATUS",
      "domains": [
        {
          "name": "Educational",
          "url": "http://www.surf.scss.tcd.ie/cityOntology/#Educational"
        },
        {
          "name": "Research_and_Science",
          "url": "http://www.surf.scss.tcd.ie/cityOntology/#Research_and_Science"
        }
      ],
      "state": "used",
      "type": "http://www.surf.scss.tcd.ie/IoTservices.owl#bookStatus",
      "desc": "Input of service book_search_presentation,Research_and_Science"
    },
    {
      "name": "_SIMILARBOOKS",
      "domains": [
        {
          "name": "Educational",
          "url": "http://www.surf.scss.tcd.ie/cityOntology/#Educational"
        },
        {
          "name": "Research_and_Science",
          "url": "http://www.surf.scss.tcd.ie/cityOntology/#Research_and_Science"
        }
      ],
      "state": "used",
      "type": "http://www.surf.scss.tcd.ie/IoTservices.owl#similarBooks",
      "desc": "Input of service book_search_presentation,Research_and_Science"
    }
  ],
  "domains": [
    {
      "name": "Educational",
      "url": "http://www.surf.scss.tcd.ie/cityOntology/#Educational"
    },
    {
      "name": "Research_and_Science",
      "url": "http://www.surf.scss.tcd.ie/cityOntology/#Research_and_Science"
    }
  ],
  "id": "book_search_presentation,Research_and_Science_x_book_monitoring"
}