{
   "similarityThreshold": 0.5,
   "matchingType": 0,
   "domains": [
      {
         "name": "Travel",
         "url": "http://www.surf.scss.tcd.ie/cityOntology/#Travel"
      },
      {
         "name": "Travel",
         "url": "http://www.surf.scss.tcd.ie/cityOntology/#Travel"
      }
   ],
   "jobId": "SURFINGHIKINGCityService-Time-Measure Geopolitical-Entity City Hotel InfoService-399",
   "feedbackThreshold": 0.5,
   "inputs": [
      {
         "name": "_GEOPOLITICAL-ENTITY",
         "type": "http://127.0.0.1/ontology/portal.owl#Geopolitical-Entity",
         "desc": "Input of service Time-Measure Geopolitical-Entity City Hotel InfoService"
      },
      {
         "name": "_TIME-MEASURE",
         "type": "http://127.0.0.1/ontology/support.owl#Time-Measure",
         "desc": "Input of service Time-Measure Geopolitical-Entity City Hotel InfoService"
      },
      {
         "name": "_SURFING",
         "type": "http://127.0.0.1/ontology/travel.owl#Surfing",
         "desc": "Input of service SURFINGHIKINGCityService"
      },
      {
         "name": "_HIKING",
         "type": "http://127.0.0.1/ontology/travel.owl#Hiking",
         "desc": "Input of service SURFINGHIKINGCityService"
      }
   ],
   "outputs": [
      {
         "name": "_HOTEL",
         "type": "http://127.0.0.1/ontology/travel.owl#Hotel",
         "desc": "Output of service Time-Measure Geopolitical-Entity City Hotel InfoService"
      }
   ]
}