{
   "similarityThreshold": 0.5,
   "outputs": [
      {
         "name": "_CITY",
         "type": "http://127.0.0.1/ontology/protonu.owl#City",
         "desc": "Output of service Zip code info service."
      },
      {
         "name": "_STATE",
         "type": "http://127.0.0.1/ontology/protonu.owl#State",
         "desc": "Output of service Zip code info service."
      },
      {
         "name": "_TIMEZONE",
         "type": "http://127.0.0.1/ontology/protonu.owl#TimeZone",
         "desc": "Output of service Zip code info service."
      },
      {
         "name": "_DAYLIGHTSAVINGTIME",
         "type": "http://127.0.0.1/ontology/geographydataset.owl#daylightSavingTime",
         "desc": "Output of service Zip code info service."
      }
   ],
   "feedbackThreshold": 0.5,
   "matchingType": 0,
   "domains": [
      {
         "name": "Geography",
         "url": "http://www.surf.scss.tcd.ie/cityOntology/#Geography"
      },
      {
         "name": "Geography",
         "url": "http://www.surf.scss.tcd.ie/cityOntology/#Geography"
      },
      {
         "name": "Geography",
         "url": "http://www.surf.scss.tcd.ie/cityOntology/#Geography"
      },
      {
         "name": "Geography",
         "url": "http://www.surf.scss.tcd.ie/cityOntology/#Geography"
      },
      {
         "name": "Geography",
         "url": "http://www.surf.scss.tcd.ie/cityOntology/#Geography"
      }
   ],
   "jobId": "Address location finder service.-Zip code info service.-452",
   "inputs": [
      {
         "name": "_LICENSEKEY",
         "type": "http://127.0.0.1/ontology/geographydataset.owl#Code",
         "desc": "Input of service Zip code info service."
      },
      {
         "name": "_LICENSEKEY",
         "type": "http://127.0.0.1/ontology/geographydataset.owl#Code",
         "desc": "Input of service Zip Codes finder within distance from a city."
      },
      {
         "name": "_COUNTRY",
         "type": "http://127.0.0.1/ontology/protonu.owl#Country",
         "desc": "Input of service Zip Codes finder within distance from a city."
      },
      {
         "name": "_ZIPCODE",
         "type": "http://127.0.0.1/ontology/geographydataset.owl#US5DigitZipCode",
         "desc": "Input of service Zip code info service."
      },
      {
         "name": "_USERID",
         "type": "http://127.0.0.1/ontology/geographydataset.owl#UniqueIdentifier",
         "desc": "Input of service Address location finder service."
      },
      {
         "name": "_ADDRESS",
         "type": "http://127.0.0.1/ontology/protonu.owl#Address",
         "desc": "Input of service Address location finder service."
      },
      {
         "name": "_CITY",
         "type": "http://127.0.0.1/ontology/protonu.owl#City",
         "desc": "Input of service Address location finder service."
      },
      {
         "name": "_COUNTRY",
         "type": "http://127.0.0.1/ontology/protonu.owl#Country",
         "desc": "Input of service Address location finder service."
      }
   ]
}