{
   "outputs": [
      {
         "desc": "Output of service notify_booking",
         "name": "_BOOKNOTIFICATION",
         "type": "http://www.surf.scss.tcd.ie/IoTservices.owl#bookNotification"
      }
   ],
   "inputs": [
      {
         "desc": "Input of service activate_room_camera",
         "name": "_SELECTEDACCOMMODATION",
         "type": "http://www.surf.scss.tcd.ie/IoTservices.owl#selectedAccommodation",
         "state": "used"
      }
   ],
   "id": "84_activate_room_camera_x_87_notify_booking_request",
   "domains": [
      {
         "name": "Accommodation",
         "url": "http://www.surf.scss.tcd.ie/cityOntology/#Accommodation"
      }
   ],
   "tasks": [
      {
         "outputs": [
            {
               "desc": "Output of service notify_booking",
               "name": "_BOOKNOTIFICATION",
               "type": "http://www.surf.scss.tcd.ie/IoTservices.owl#bookNotification"
            }
         ],
         "name": "task-1",
         "inputs": [
            {
               "desc": "Input of service notify_booking",
               "name": "_BOOKACCOMMODATION",
               "type": "http://www.surf.scss.tcd.ie/IoTservices.owl#bookAccommodation"
            }
         ],
         "services": []
      },
      {
         "outputs": [
            {
               "desc": "Output of service book_accommodation",
               "name": "_BOOKACCOMMODATION",
               "type": "http://www.surf.scss.tcd.ie/IoTservices.owl#bookAccommodation"
            }
         ],
         "name": "task-2",
         "inputs": [
            {
               "desc": "Input of service book_accommodation",
               "name": "_ACCOMMODATIONCONFIRMATION",
               "type": "http://www.surf.scss.tcd.ie/IoTservices.owl#accommodationConfirmation"
            }
         ],
         "services": []
      },
      {
         "outputs": [
            {
               "desc": "Output of service accommodation_confirmation",
               "name": "_ACCOMMODATIONCONFIRMATION",
               "type": "http://www.surf.scss.tcd.ie/IoTservices.owl#accommodationConfirmation"
            }
         ],
         "name": "task-3",
         "inputs": [
            {
               "desc": "Input of service accommodation_confirmation",
               "name": "_ROOMVIDEO",
               "type": "http://www.surf.scss.tcd.ie/IoTservices.owl#roomVideo"
            }
         ],
         "services": []
      },
      {
         "outputs": [
            {
               "desc": "Output of service activate_room_camera",
               "name": "_ROOMVIDEO",
               "type": "http://www.surf.scss.tcd.ie/IoTservices.owl#roomVideo"
            }
         ],
         "name": "task-4",
         "inputs": [
            {
               "desc": "Input of service activate_room_camera",
               "name": "_SELECTEDACCOMMODATION",
               "type": "http://www.surf.scss.tcd.ie/IoTservices.owl#selectedAccommodation"
            }
         ],
         "services": []
      }
   ]
}