{
   "similarityThreshold": 0.5,
   "outputs": [
      {
         "name": "_CITY",
         "type": "http://127.0.0.1/ontology/protonu.owl#City",
         "desc": "Output of service Zip code info service."
      },
      {
         "name": "_STATE",
         "type": "http://127.0.0.1/ontology/protonu.owl#State",
         "desc": "Output of service Zip code info service."
      },
      {
         "name": "_TIMEZONE",
         "type": "http://127.0.0.1/ontology/protonu.owl#TimeZone",
         "desc": "Output of service Zip code info service."
      },
      {
         "name": "_DAYLIGHTSAVINGTIME",
         "type": "http://127.0.0.1/ontology/geographydataset.owl#daylightSavingTime",
         "desc": "Output of service Zip code info service."
      }
   ],
   "feedbackThreshold": 0.5,
   "matchingType": 0,
   "domains": [
      {
         "name": "Geography",
         "url": "http://www.surf.scss.tcd.ie/cityOntology/#Geography"
      },
      {
         "name": "Geography",
         "url": "http://www.surf.scss.tcd.ie/cityOntology/#Geography"
      },
      {
         "name": "Geography",
         "url": "http://www.surf.scss.tcd.ie/cityOntology/#Geography"
      },
      {
         "name": "Geography",
         "url": "http://www.surf.scss.tcd.ie/cityOntology/#Geography"
      }
   ],
   "jobId": "Distance calculator between two locations-Zip code info service.-450",
   "inputs": [
      {
         "name": "_LICENSEKEY",
         "type": "http://127.0.0.1/ontology/geographydataset.owl#Code",
         "desc": "Input of service Zip code info service."
      },
      {
         "name": "_LICENSEKEY",
         "type": "http://127.0.0.1/ontology/geographydataset.owl#Code",
         "desc": "Input of service Zip Codes finder within distance from a city."
      },
      {
         "name": "_COUNTRY",
         "type": "http://127.0.0.1/ontology/protonu.owl#Country",
         "desc": "Input of service Zip Codes finder within distance from a city."
      },
      {
         "name": "_ZIPCODE",
         "type": "http://127.0.0.1/ontology/geographydataset.owl#US5DigitZipCode",
         "desc": "Input of service Zip code info service."
      },
      {
         "name": "_LATITUDE1",
         "type": "http://127.0.0.1/ontology/protont.owl#latitude",
         "desc": "Input of service Distance calculator between two locations"
      },
      {
         "name": "_LONGITUDE1",
         "type": "http://127.0.0.1/ontology/protont.owl#longitude",
         "desc": "Input of service Distance calculator between two locations"
      },
      {
         "name": "_LATITUDE2",
         "type": "http://127.0.0.1/ontology/protont.owl#latitude",
         "desc": "Input of service Distance calculator between two locations"
      },
      {
         "name": "_LONGITUDE2",
         "type": "http://127.0.0.1/ontology/protont.owl#longitude",
         "desc": "Input of service Distance calculator between two locations"
      }
   ]
}