{
   "tasks": [
      {
         "services": [],
         "name": "task-1",
         "inputs": [
            {
               "name": "_LICENSEKEY",
               "desc": "Input of service Sunrise and Sunset Time Calcutator Service.",
               "type": "http://127.0.0.1/ontology/geographydataset.owl#Code"
            },
            {
               "name": "_DATE",
               "desc": "Input of service Sunrise and Sunset Time Calcutator Service.",
               "type": "http://127.0.0.1/ontology/protonu.owl#Date"
            },
            {
               "name": "_LATITUDE",
               "desc": "Input of service Sunrise and Sunset Time Calcutator Service.",
               "type": "http://127.0.0.1/ontology/protont.owl#latitude"
            },
            {
               "name": "_LONGITUDE",
               "desc": "Input of service Sunrise and Sunset Time Calcutator Service.",
               "type": "http://127.0.0.1/ontology/protont.owl#longitude"
            }
         ],
         "outputs": [
            {
               "name": "_SUNSET",
               "desc": "Output of service Sunrise and Sunset Time Calcutator Service.",
               "type": "http://127.0.0.1/ontology/geographydataset.owl#Sunset"
            },
            {
               "name": "_SUNRISE",
               "desc": "Output of service Sunrise and Sunset Time Calcutator Service.",
               "type": "http://127.0.0.1/ontology/geographydataset.owl#Sunrise"
            }
         ]
      }
   ],
   "id": "Sunrise and Sunset Time Calcutator Service._request",
   "domains": [
      {
         "name": "Geography",
         "url": "http://www.surf.scss.tcd.ie/cityOntology/#Geography"
      }
   ]
}