{
   "outputs": [
      {
         "desc": "Output of service route_selector",
         "name": "_SELECTEDROUTE",
         "type": "http://www.surf.scss.tcd.ie/IoTservices.owl#selectedRoute"
      }
   ],
   "inputs": [
      {
         "desc": "Input of service route_air_pollution",
         "name": "_ROUTEPARAMETERS",
         "type": "http://www.surf.scss.tcd.ie/IoTservices.owl#routeParameters",
         "state": "used"
      }
   ],
   "id": "4_route_air_pollution_x_3_route_selector_request",
   "domains": [
      {
         "name": "Transport_and_Mobility",
         "url": "http://www.surf.scss.tcd.ie/cityOntology/#Transport_and_Mobility"
      }
   ],
   "tasks": [
      {
         "outputs": [
            {
               "desc": "Output of service route_selector",
               "name": "_SELECTEDROUTE",
               "type": "http://www.surf.scss.tcd.ie/IoTservices.owl#selectedRoute"
            }
         ],
         "name": "task-1",
         "inputs": [
            {
               "desc": "Input of service route_selector",
               "name": "_TRAFFICINFO",
               "type": "http://www.surf.scss.tcd.ie/IoTservices.owl#trafficInfo"
            },
            {
               "desc": "Input of service route_selector",
               "name": "_POLLUTIONINFO",
               "type": "http://www.surf.scss.tcd.ie/IoTservices.owl#pollutionInfo"
            },
            {
               "desc": "Input of service route_selector",
               "name": "_NOISEINFO",
               "type": "http://www.surf.scss.tcd.ie/IoTservices.owl#noiseInfo"
            },
            {
               "desc": "Input of service route_selector",
               "name": "_FLOODINGINFO",
               "type": "http://www.surf.scss.tcd.ie/IoTservices.owl#floodingInfo"
            }
         ],
         "services": []
      },
      {
         "outputs": [
            {
               "desc": "Output of service traffic_detection",
               "name": "_TRAFFICINFO",
               "type": "http://www.surf.scss.tcd.ie/IoTservices.owl#trafficInfo"
            }
         ],
         "name": "task-2",
         "inputs": [
            {
               "desc": "Input of service traffic_detection",
               "name": "_ROUTEPARAMETERS",
               "type": "http://www.surf.scss.tcd.ie/IoTservices.owl#routeParameters"
            }
         ],
         "services": []
      },
      {
         "outputs": [
            {
               "desc": "Output of service route_air_pollution",
               "name": "_POLLUTIONINFO",
               "type": "http://www.surf.scss.tcd.ie/IoTservices.owl#pollutionInfo"
            }
         ],
         "name": "task-3",
         "inputs": [
            {
               "desc": "Input of service route_air_pollution",
               "name": "_ROUTEPARAMETERS",
               "type": "http://www.surf.scss.tcd.ie/IoTservices.owl#routeParameters"
            }
         ],
         "services": []
      },
      {
         "outputs": [
            {
               "desc": "Output of service route_noise_service",
               "name": "_NOISEINFO",
               "type": "http://www.surf.scss.tcd.ie/IoTservices.owl#noiseInfo"
            }
         ],
         "name": "task-4",
         "inputs": [
            {
               "desc": "Input of service route_noise_service",
               "name": "_ROUTEPARAMETERS",
               "type": "http://www.surf.scss.tcd.ie/IoTservices.owl#routeParameters"
            }
         ],
         "services": []
      },
      {
         "outputs": [
            {
               "desc": "Output of service route_water_level",
               "name": "_FLOODINGINFO",
               "type": "http://www.surf.scss.tcd.ie/IoTservices.owl#floodingInfo"
            }
         ],
         "name": "task-5",
         "inputs": [
            {
               "desc": "Input of service route_water_level",
               "name": "_ROUTEPARAMETERS",
               "type": "http://www.surf.scss.tcd.ie/IoTservices.owl#routeParameters"
            }
         ],
         "services": []
      }
   ]
}