{
  "outputs": [
    {
      "name": "_BOOKEDBOOK",
      "domains": [
        {
          "name": "Educational",
          "url": "http://www.surf.scss.tcd.ie/cityOntology/#Educational"
        },
        {
          "name": "Research_and_Science",
          "url": "http://www.surf.scss.tcd.ie/cityOntology/#Research_and_Science"
        }
      ],
      "type": "http://www.surf.scss.tcd.ie/IoTservices.owl#bookedBook",
      "desc": "Output of service book_booking"
    }
  ],
  "expectedPlanLength": 1,
  "inputs": [
    {
      "name": "_SEARCHINFO",
      "domains": [
        {
          "name": "Educational",
          "url": "http://www.surf.scss.tcd.ie/cityOntology/#Educational"
        },
        {
          "name": "Research_and_Science",
          "url": "http://www.surf.scss.tcd.ie/cityOntology/#Research_and_Science"
        }
      ],
      "type": "http://www.surf.scss.tcd.ie/IoTservices.owl#searchInfo",
      "desc": "Input of service book_booking"
    }
  ],
  "domains": [
    {
      "name": "Research_and_Science",
      "url": "http://www.surf.scss.tcd.ie/cityOntology/#Research_and_Science"
    }
  ],
  "id": "59_book_booking_request",
  "type": "atomic"
}