{
  "outputs": [
    {
      "name": "_CONSTRUCTIONDASHBOARD",
      "domains": [
        {
          "name": "Safety_and_Emergencies",
          "url": "http://www.surf.scss.tcd.ie/cityOntology/#Safety_and_Emergencies"
        },
        {
          "name": "Construction",
          "url": "http://www.surf.scss.tcd.ie/cityOntology/#Construction"
        }
      ],
      "type": "http://www.surf.scss.tcd.ie/IoTservices.owl#constructionDashboard",
      "desc": "Output of service construction_dashboard"
    }
  ],
  "inputs": [
    {
      "name": "_CONSTRUCTIONMONITORINGPARAMETERS",
      "domains": [
        {
          "name": "Safety_and_Emergencies",
          "url": "http://www.surf.scss.tcd.ie/cityOntology/#Safety_and_Emergencies"
        },
        {
          "name": "Construction",
          "url": "http://www.surf.scss.tcd.ie/cityOntology/#Construction"
        }
      ],
      "state": "used",
      "type": "http://www.surf.scss.tcd.ie/IoTservices.owl#constructionMonitoringParameters",
      "desc": "Input of service construction_monitoring_configurator"
    }
  ],
  "domains": [
    {
      "name": "Safety_and_Emergencies",
      "url": "http://www.surf.scss.tcd.ie/cityOntology/#Safety_and_Emergencies"
    },
    {
      "name": "Construction",
      "url": "http://www.surf.scss.tcd.ie/cityOntology/#Construction"
    }
  ],
  "id": "construction_monitoring_configurator_x_construction_dashboard"
}