{
   "inputs": [
      {
         "desc": "Input of service Postal Codes of Places Finder Service",
         "type": "http://127.0.0.1/ontology/geographydataset.owl#Code",
         "name": "_LICENSEKEY"
      },
      {
         "desc": "Input of service Address Place finder service.",
         "type": "http://127.0.0.1/ontology/protonu.owl#County",
         "name": "_COUNTY"
      },
      {
         "desc": "Input of service Address Place finder service.",
         "type": "http://127.0.0.1/ontology/protonu.owl#UrbanDistrict",
         "name": "_DISTRICT"
      },
      {
         "desc": "Input of service Postal Codes of Places Finder Service",
         "type": "http://127.0.0.1/ontology/protonu.owl#PopulatedPlace",
         "name": "_PLACENAME"
      },
      {
         "desc": "Input of service Postal Codes of Places Finder Service",
         "type": "http://127.0.0.1/ontology/geographydataset.owl#PostalCode",
         "name": "_POSTALCODE"
      },
      {
         "desc": "Input of service Postal Codes of Places Finder Service",
         "type": "http://127.0.0.1/ontology/geographydataset.owl#ISOCountryCode",
         "name": "_COUNTRYCODE"
      },
      {
         "desc": "Input of service Zip code info service.",
         "type": "http://127.0.0.1/ontology/geographydataset.owl#Code",
         "name": "_LICENSEKEY"
      },
      {
         "desc": "Input of service Location of ZipCode finder Service.",
         "type": "http://127.0.0.1/ontology/geographydataset.owl#UniqueIdentifier",
         "name": "_USERID"
      },
      {
         "desc": "Input of service Location of ZipCode finder Service.",
         "type": "http://127.0.0.1/ontology/geographydataset.owl#ZipCode",
         "name": "_ZIPCODE"
      },
      {
         "desc": "Input of service Check and Lookup address service",
         "type": "http://127.0.0.1/ontology/geographydataset.owl#Code",
         "name": "_LICENSEKEY"
      },
      {
         "desc": "Input of service Check and Lookup address service",
         "type": "http://127.0.0.1/ontology/protonu.owl#City",
         "name": "_CITY"
      },
      {
         "desc": "Input of service Check and Lookup address service",
         "type": "http://127.0.0.1/ontology/protonu.owl#State",
         "name": "_STATE"
      },
      {
         "desc": "Input of service Check and Lookup address service",
         "type": "http://127.0.0.1/ontology/protonu.owl#Country",
         "name": "_COUNTRY"
      },
      {
         "desc": "Input of service Zip Codes finder within distance from a city.",
         "type": "http://127.0.0.1/ontology/geographydataset.owl#Code",
         "name": "_LICENSEKEY"
      },
      {
         "desc": "Input of service Zip code info service.",
         "type": "http://127.0.0.1/ontology/geographydataset.owl#US5DigitZipCode",
         "name": "_ZIPCODE"
      }
   ],
   "feedbackThreshold": 0.5,
   "outputs": [
      {
         "desc": "Output of service Postal Codes of Places Finder Service",
         "type": "http://127.0.0.1/ontology/protont.owl#longitude",
         "name": "_LONGITUDE"
      },
      {
         "desc": "Output of service Postal Codes of Places Finder Service",
         "type": "http://127.0.0.1/ontology/protont.owl#latitude",
         "name": "_LATITUDE"
      },
      {
         "desc": "Output of service Postal Codes of Places Finder Service",
         "type": "http://127.0.0.1/ontology/geographydataset.owl#PostalCode",
         "name": "_POSTALCODE_OUT"
      },
      {
         "desc": "Output of service Postal Codes of Places Finder Service",
         "type": "http://127.0.0.1/ontology/protonu.owl#PopulatedPlace",
         "name": "_PLACENAME_OUT"
      },
      {
         "desc": "Output of service Postal Codes of Places Finder Service",
         "type": "http://127.0.0.1/ontology/geographydataset.owl#ISOCountryCode",
         "name": "_COUNTRYCODE_OUT"
      }
   ],
   "matchingType": 0,
   "similarityThreshold": 0.5,
   "jobId": "Location of ZipCode finder Service.-Postal Codes of Places Finder Service-328",
   "domains": [
      {
         "url": "http://www.surf.scss.tcd.ie/cityOntology/#Geography",
         "name": "Geography"
      },
      {
         "url": "http://www.surf.scss.tcd.ie/cityOntology/#Geography",
         "name": "Geography"
      },
      {
         "url": "http://www.surf.scss.tcd.ie/cityOntology/#Geography",
         "name": "Geography"
      },
      {
         "url": "http://www.surf.scss.tcd.ie/cityOntology/#Geography",
         "name": "Geography"
      },
      {
         "url": "http://www.surf.scss.tcd.ie/cityOntology/#Geography",
         "name": "Geography"
      },
      {
         "url": "http://www.surf.scss.tcd.ie/cityOntology/#Geography",
         "name": "Geography"
      },
      {
         "url": "http://www.surf.scss.tcd.ie/cityOntology/#Geography",
         "name": "Geography"
      },
      {
         "url": "http://www.surf.scss.tcd.ie/cityOntology/#Geography",
         "name": "Geography"
      },
      {
         "url": "http://www.surf.scss.tcd.ie/cityOntology/#Geography",
         "name": "Geography"
      },
      {
         "url": "http://www.surf.scss.tcd.ie/cityOntology/#Geography",
         "name": "Geography"
      },
      {
         "url": "http://www.surf.scss.tcd.ie/cityOntology/#Geography",
         "name": "Geography"
      },
      {
         "url": "http://www.surf.scss.tcd.ie/cityOntology/#Geography",
         "name": "Geography"
      },
      {
         "url": "http://www.surf.scss.tcd.ie/cityOntology/#Geography",
         "name": "Geography"
      },
      {
         "url": "http://www.surf.scss.tcd.ie/cityOntology/#Geography",
         "name": "Geography"
      }
   ]
}