{
  "outputs": [
    {
      "name": "_BOOKNOTIFICATION",
      "type": "http://www.surf.scss.tcd.ie/IoTservices.owl#bookNotification",
      "desc": "Output of service notify_booking"
    }
  ],
  "expectedPlanLength": 2,
  "inputs": [
    {
      "name": "_ACCOMMODATIONCONFIRMATION",
      "state": "used",
      "type": "http://www.surf.scss.tcd.ie/IoTservices.owl#accommodationConfirmation",
      "desc": "Input of service book_accommodation"
    }
  ],
  "domains": [
    {
      "name": "Accommodation",
      "url": "http://www.surf.scss.tcd.ie/cityOntology/#Accommodation"
    }
  ],
  "id": "86_book_accommodation_x_87_notify_booking_request",
  "type": "composed"
}