{
   "outputs": [
      {
         "desc": "Output of service broadcast_near_patrol",
         "name": "_BROADCASTVIDEO",
         "type": "http://www.surf.scss.tcd.ie/IoTservices.owl#broadcastVideo"
      }
   ],
   "inputs": [
      {
         "desc": "Input of service street_anomaly_detection",
         "name": "_GUNSHOTALERT",
         "type": "http://www.surf.scss.tcd.ie/IoTservices.owl#gunshotAlert",
         "state": "used"
      },
      {
         "desc": "Input of service street_anomaly_detection",
         "name": "_ZONEINTRUSIONALERT",
         "type": "http://www.surf.scss.tcd.ie/IoTservices.owl#zoneIntrusionAlert",
         "state": "used"
      },
      {
         "desc": "Input of service street_anomaly_detection",
         "name": "_REPORT",
         "type": "http://www.surf.scss.tcd.ie/IoTservices.owl#report",
         "state": "used"
      }
   ],
   "id": "25_street_anomaly_detection_x_27_broadcast_near_patrol_request",
   "domains": [
      {
         "name": "Safety_and_Emergencies",
         "url": "http://www.surf.scss.tcd.ie/cityOntology/#Safety_and_Emergencies"
      }
   ],
   "tasks": [
      {
         "outputs": [
            {
               "desc": "Output of service broadcast_near_patrol",
               "name": "_BROADCASTVIDEO",
               "type": "http://www.surf.scss.tcd.ie/IoTservices.owl#broadcastVideo"
            }
         ],
         "name": "task-1",
         "inputs": [
            {
               "desc": "Input of service broadcast_near_patrol",
               "name": "_PLACEVIDEO",
               "type": "http://www.surf.scss.tcd.ie/IoTservices.owl#placeVideo"
            }
         ],
         "services": []
      },
      {
         "outputs": [
            {
               "desc": "Output of service city_video_camera",
               "name": "_PLACEVIDEO",
               "type": "http://www.surf.scss.tcd.ie/IoTservices.owl#placeVideo"
            }
         ],
         "name": "task-2",
         "inputs": [
            {
               "desc": "Input of service city_video_camera",
               "name": "_PLACE",
               "type": "http://www.surf.scss.tcd.ie/IoTservices.owl#place"
            }
         ],
         "services": []
      },
      {
         "outputs": [
            {
               "desc": "Output of service street_anomaly_detection",
               "name": "_PLACE",
               "type": "http://www.surf.scss.tcd.ie/IoTservices.owl#place"
            }
         ],
         "name": "task-3",
         "inputs": [
            {
               "desc": "Input of service street_anomaly_detection",
               "name": "_GUNSHOTALERT",
               "type": "http://www.surf.scss.tcd.ie/IoTservices.owl#gunshotAlert"
            },
            {
               "desc": "Input of service street_anomaly_detection",
               "name": "_ZONEINTRUSIONALERT",
               "type": "http://www.surf.scss.tcd.ie/IoTservices.owl#zoneIntrusionAlert"
            },
            {
               "desc": "Input of service street_anomaly_detection",
               "name": "_REPORT",
               "type": "http://www.surf.scss.tcd.ie/IoTservices.owl#report"
            }
         ],
         "services": []
      }
   ]
}