{
   "inputs": [
      {
         "desc": "Input of service RomanticNovel Author Price Service",
         "type": "http://127.0.0.1/ontology/books.owl#RomanticNovel",
         "name": "_ROMANTICNOVEL"
      }
   ],
   "similarityThreshold": 0.5,
   "jobId": "RomanticNovel Author Price Service-Author Book TaxFreePrice Service-245",
   "matchingType": 0,
   "outputs": [
      {
         "desc": "Output of service Author Book TaxFreePrice Service",
         "type": "http://127.0.0.1/ontology/books.owl#Book",
         "name": "_BOOK"
      },
      {
         "desc": "Output of service Author Book TaxFreePrice Service",
         "type": "http://127.0.0.1/ontology/concept.owl#TaxFreePrice",
         "name": "_TAXFREEPRICE"
      }
   ],
   "domains": [
      {
         "url": "http://www.surf.scss.tcd.ie/cityOntology/#Entertainment_Products",
         "name": "Entertainment_Products"
      },
      {
         "url": "http://www.surf.scss.tcd.ie/cityOntology/#Entertainment_Products",
         "name": "Entertainment_Products"
      },
      {
         "url": "http://www.surf.scss.tcd.ie/cityOntology/#Entertainment_Products",
         "name": "Entertainment_Products"
      },
      {
         "url": "http://www.surf.scss.tcd.ie/cityOntology/#Entertainment_Products",
         "name": "Entertainment_Products"
      },
      {
         "url": "http://www.surf.scss.tcd.ie/cityOntology/#Entertainment_Products",
         "name": "Entertainment_Products"
      },
      {
         "url": "http://www.surf.scss.tcd.ie/cityOntology/#Entertainment_Products",
         "name": "Entertainment_Products"
      },
      {
         "url": "http://www.surf.scss.tcd.ie/cityOntology/#Entertainment_Products",
         "name": "Entertainment_Products"
      }
   ],
   "feedbackThreshold": 0.5
}