{
  "outputs": [
    {
      "name": "_MACHINESTATUS",
      "type": "http://www.surf.scss.tcd.ie/IoTservices.owl#machineStatus",
      "desc": "Output of service monitoring_machines"
    }
  ],
  "expectedPlanLength": 2,
  "inputs": [
    {
      "name": "_CONSTRUCTIONINFO",
      "state": "used",
      "type": "http://www.surf.scss.tcd.ie/IoTservices.owl#constructionInfo",
      "desc": "Input of service construction_status"
    }
  ],
  "domains": [
    {
      "name": "Safety_and_Emergencies",
      "url": "http://www.surf.scss.tcd.ie/cityOntology/#Safety_and_Emergencies"
    },
    {
      "name": "Construction",
      "url": "http://www.surf.scss.tcd.ie/cityOntology/#Construction"
    }
  ],
  "id": "41_construction_status_x_42_monitoring_machines_request",
  "type": "composed"
}