{
  "outputs": [
    {
      "name": "_ATMID",
      "domains": [
        {
          "name": "Safety_and_Emergencies",
          "url": "http://www.surf.scss.tcd.ie/cityOntology/#Safety_and_Emergencies"
        },
        {
          "name": "Finance",
          "url": "http://www.surf.scss.tcd.ie/cityOntology/#Finance"
        }
      ],
      "type": "http://www.surf.scss.tcd.ie/IoTservices.owl#atmId",
      "desc": "Output of service atm_detect_intruder"
    }
  ],
  "expectedPlanLength": 1,
  "inputs": [
    {
      "name": "_ATMCONFIG",
      "domains": [
        {
          "name": "Safety_and_Emergencies",
          "url": "http://www.surf.scss.tcd.ie/cityOntology/#Safety_and_Emergencies"
        },
        {
          "name": "Finance",
          "url": "http://www.surf.scss.tcd.ie/cityOntology/#Finance"
        }
      ],
      "type": "http://www.surf.scss.tcd.ie/IoTservices.owl#atmConfig",
      "desc": "Input of service atm_detect_intruder"
    }
  ],
  "domains": [
    {
      "name": "Safety_and_Emergencies",
      "url": "http://www.surf.scss.tcd.ie/cityOntology/#Safety_and_Emergencies"
    },
    {
      "name": "Finance",
      "url": "http://www.surf.scss.tcd.ie/cityOntology/#Finance"
    }
  ],
  "id": "114_atm_detect_intruder_request",
  "type": "atomic"
}