{
  "outputs": [
    {
      "name": "_STREETSTEMPERATURE",
      "domains": [
        {
          "name": "Government_and_Planning",
          "url": "http://www.surf.scss.tcd.ie/cityOntology/#Government_and_Planning"
        },
        {
          "name": "Nature",
          "url": "http://www.surf.scss.tcd.ie/cityOntology/#Nature"
        }
      ],
      "type": "http://www.surf.scss.tcd.ie/IoTservices.owl#streetsTemperature",
      "desc": "Output of service streets_temperature"
    }
  ],
  "expectedPlanLength": 1,
  "inputs": [
    {
      "name": "_STREETSINFO",
      "domains": [
        {
          "name": "Government_and_Planning",
          "url": "http://www.surf.scss.tcd.ie/cityOntology/#Government_and_Planning"
        },
        {
          "name": "Nature",
          "url": "http://www.surf.scss.tcd.ie/cityOntology/#Nature"
        }
      ],
      "type": "http://www.surf.scss.tcd.ie/IoTservices.owl#streetsInfo",
      "desc": "Input of service streets_temperature"
    }
  ],
  "domains": [
    {
      "name": "Government_and_Planning",
      "url": "http://www.surf.scss.tcd.ie/cityOntology/#Government_and_Planning"
    }
  ],
  "id": "126_streets_temperature_request",
  "type": "atomic"
}