{
  "outputs": [
    {
      "name": "_PATIENTPROFILE",
      "domains": [
        {
          "name": "Health",
          "url": "http://www.surf.scss.tcd.ie/cityOntology/#Health"
        },
        {
          "name": "Safety_and_Emergencies",
          "url": "http://www.surf.scss.tcd.ie/cityOntology/#Safety_and_Emergencies"
        }
      ],
      "type": "http://www.surf.scss.tcd.ie/IoTservices.owl#patientProfile",
      "desc": "Output of service patient_profile"
    }
  ],
  "expectedPlanLength": 1,
  "inputs": [
    {
      "name": "_PATIENTID",
      "domains": [
        {
          "name": "Health",
          "url": "http://www.surf.scss.tcd.ie/cityOntology/#Health"
        },
        {
          "name": "Safety_and_Emergencies",
          "url": "http://www.surf.scss.tcd.ie/cityOntology/#Safety_and_Emergencies"
        }
      ],
      "type": "http://www.surf.scss.tcd.ie/IoTservices.owl#patientId",
      "desc": "Input of service patient_profile"
    }
  ],
  "domains": [
    {
      "name": "Health",
      "url": "http://www.surf.scss.tcd.ie/cityOntology/#Health"
    }
  ],
  "id": "88_patient_profile_request",
  "type": "atomic"
}