{
  "outputs": [
    {
      "name": "_PARENTNOTIFICATION",
      "domains": [
        {
          "name": "Educational",
          "url": "http://www.surf.scss.tcd.ie/cityOntology/#Educational"
        }
      ],
      "type": "http://www.surf.scss.tcd.ie/IoTservices.owl#parentNotification",
      "desc": "Output of service parent_notification"
    }
  ],
  "expectedPlanLength": 1,
  "inputs": [
    {
      "name": "_STUDENTACTIVITYINFO",
      "domains": [
        {
          "name": "Educational",
          "url": "http://www.surf.scss.tcd.ie/cityOntology/#Educational"
        }
      ],
      "type": "http://www.surf.scss.tcd.ie/IoTservices.owl#studentActivityInfo",
      "desc": "Input of service parent_notification"
    },
    {
      "name": "_ATTENDANCEINFO",
      "domains": [
        {
          "name": "Educational",
          "url": "http://www.surf.scss.tcd.ie/cityOntology/#Educational"
        }
      ],
      "type": "http://www.surf.scss.tcd.ie/IoTservices.owl#attendanceInfo",
      "desc": "Input of service parent_notification"
    }
  ],
  "domains": [
    {
      "name": "Educational",
      "url": "http://www.surf.scss.tcd.ie/cityOntology/#Educational"
    }
  ],
  "id": "54_parent_notification_request",
  "type": "atomic"
}