{
   "inputs": [
      {
         "desc": "Input of service MerchantService",
         "name": "_STORE",
         "type": "http://127.0.0.1/ontology/Mid-level-ontology.owl#Store"
      }
   ],
   "matchingType": 0,
   "outputs": [
      {
         "desc": "Output of service DFKI service",
         "name": "_COFFEE",
         "type": "http://127.0.0.1/ontology/my_ontology.owl#Coffee"
      },
      {
         "desc": "Output of service DFKI service",
         "name": "_WHISKEY",
         "type": "http://127.0.0.1/ontology/my_ontology.owl#Whiskey"
      }
   ],
   "jobId": "MerchantService-DFKI service-374",
   "domains": [
      {
         "url": "http://www.surf.scss.tcd.ie/cityOntology/#Food_and_Drinks",
         "name": "Food_and_Drinks"
      },
      {
         "url": "http://www.surf.scss.tcd.ie/cityOntology/#Food_and_Drinks",
         "name": "Food_and_Drinks"
      },
      {
         "url": "http://www.surf.scss.tcd.ie/cityOntology/#Food_and_Drinks",
         "name": "Food_and_Drinks"
      },
      {
         "url": "http://www.surf.scss.tcd.ie/cityOntology/#Food_and_Drinks",
         "name": "Food_and_Drinks"
      },
      {
         "url": "http://www.surf.scss.tcd.ie/cityOntology/#Food_and_Drinks",
         "name": "Food_and_Drinks"
      }
   ],
   "similarityThreshold": 0.5,
   "feedbackThreshold": 0.5
}