{
   "jobId": "Author Monograph TaxFreePrice Service-Monograph Publisher Service-214",
   "inputs": [
      {
         "name": "_AUTHOR",
         "desc": "Input of service Author Monograph TaxFreePrice Service",
         "type": "http://127.0.0.1/ontology/books.owl#Author"
      }
   ],
   "feedbackThreshold": 0.5,
   "domains": [
      {
         "name": "Entertainment_Products",
         "url": "http://www.surf.scss.tcd.ie/cityOntology/#Entertainment_Products"
      },
      {
         "name": "Entertainment_Products",
         "url": "http://www.surf.scss.tcd.ie/cityOntology/#Entertainment_Products"
      }
   ],
   "outputs": [
      {
         "name": "_PUBLISHER",
         "desc": "Output of service Monograph Publisher Service",
         "type": "http://127.0.0.1/ontology/books.owl#Publisher"
      }
   ],
   "matchingType": 0,
   "similarityThreshold": 0.5
}