{
   "outputs": [
      {
         "desc": "Output of service book_monitoring",
         "name": "_MONITORLOG",
         "type": "http://www.surf.scss.tcd.ie/IoTservices.owl#monitorLog"
      }
   ],
   "inputs": [
      {
         "desc": "Input of service search_book",
         "name": "_SEARCHKEYWORDS",
         "type": "http://www.surf.scss.tcd.ie/IoTservices.owl#searchKeywords",
         "state": "used"
      }
   ],
   "id": "55_search_book_x_60_book_monitoring_request",
   "domains": [
      {
         "name": "Educational",
         "url": "http://www.surf.scss.tcd.ie/cityOntology/#Educational"
      },
      {
         "name": "Research_and_Science",
         "url": "http://www.surf.scss.tcd.ie/cityOntology/#Research_and_Science"
      }
   ],
   "tasks": [
      {
         "outputs": [
            {
               "desc": "Output of service book_monitoring",
               "name": "_MONITORLOG",
               "type": "http://www.surf.scss.tcd.ie/IoTservices.owl#monitorLog"
            }
         ],
         "name": "task-1",
         "inputs": [
            {
               "desc": "Input of service book_monitoring",
               "name": "_BOOKEDBOOK",
               "type": "http://www.surf.scss.tcd.ie/IoTservices.owl#bookedBook"
            }
         ],
         "services": []
      },
      {
         "outputs": [
            {
               "desc": "Output of service book_booking",
               "name": "_BOOKEDBOOK",
               "type": "http://www.surf.scss.tcd.ie/IoTservices.owl#bookedBook"
            }
         ],
         "name": "task-2",
         "inputs": [
            {
               "desc": "Input of service book_booking",
               "name": "_SEARCHINFO",
               "type": "http://www.surf.scss.tcd.ie/IoTservices.owl#searchInfo"
            }
         ],
         "services": []
      },
      {
         "outputs": [
            {
               "desc": "Output of service book_search_presentation,Research_and_Science",
               "name": "_SEARCHINFO",
               "type": "http://www.surf.scss.tcd.ie/IoTservices.owl#searchInfo"
            }
         ],
         "name": "task-3",
         "inputs": [
            {
               "desc": "Input of service book_search_presentation,Research_and_Science",
               "name": "_BOOKSTATUS",
               "type": "http://www.surf.scss.tcd.ie/IoTservices.owl#bookStatus"
            },
            {
               "desc": "Input of service book_search_presentation,Research_and_Science",
               "name": "_SIMILARBOOKS",
               "type": "http://www.surf.scss.tcd.ie/IoTservices.owl#similarBooks"
            }
         ],
         "services": []
      },
      {
         "outputs": [
            {
               "desc": "Output of service book_status",
               "name": "_BOOKSTATUS",
               "type": "http://www.surf.scss.tcd.ie/IoTservices.owl#bookStatus"
            }
         ],
         "name": "task-4",
         "inputs": [
            {
               "desc": "Input of service book_status",
               "name": "_BOOKSINFORMATION",
               "type": "http://www.surf.scss.tcd.ie/IoTservices.owl#booksInformation"
            }
         ],
         "services": []
      },
      {
         "outputs": [
            {
               "desc": "Output of service similar_books",
               "name": "_SIMILARBOOKS",
               "type": "http://www.surf.scss.tcd.ie/IoTservices.owl#similarBooks"
            }
         ],
         "name": "task-5",
         "inputs": [
            {
               "desc": "Input of service similar_books",
               "name": "_BOOKSINFORMATION",
               "type": "http://www.surf.scss.tcd.ie/IoTservices.owl#booksInformation"
            }
         ],
         "services": []
      },
      {
         "outputs": [
            {
               "desc": "Output of service search_book",
               "name": "_BOOKSINFORMATION",
               "type": "http://www.surf.scss.tcd.ie/IoTservices.owl#booksInformation"
            }
         ],
         "name": "task-6",
         "inputs": [
            {
               "desc": "Input of service search_book",
               "name": "_SEARCHKEYWORDS",
               "type": "http://www.surf.scss.tcd.ie/IoTservices.owl#searchKeywords"
            }
         ],
         "services": []
      }
   ]
}