{
   "id": "53_student_activity_monitoring_request",
   "domains": [
      {
         "name": "Educational",
         "url": "http://www.surf.scss.tcd.ie/cityOntology/#Educational"
      }
   ],
   "tasks": [
      {
         "outputs": [
            {
               "desc": "Output of service student_activity_monitoring",
               "name": "_STUDENTACTIVITYINFO",
               "type": "http://www.surf.scss.tcd.ie/IoTservices.owl#studentActivityInfo"
            }
         ],
         "name": "task-1",
         "inputs": [
            {
               "desc": "Input of service student_activity_monitoring",
               "name": "_STUDENTSINFO",
               "type": "http://www.surf.scss.tcd.ie/IoTservices.owl#studentsInfo"
            }
         ],
         "services": []
      }
   ]
}