{
  "outputs": [
    {
      "name": "_SELECTEDROUTE",
      "type": "http://www.surf.scss.tcd.ie/IoTservices.owl#selectedRoute",
      "desc": "Output of service route_selector"
    }
  ],
  "expectedPlanLength": 6,
  "inputs": [
    {
      "name": "_FROM",
      "state": "notUsed",
      "type": "http://www.surf.scss.tcd.ie/IoTservices.owl#from",
      "desc": "Input of service route_configurator"
    },
    {
      "name": "_TO",
      "state": "notUsed",
      "type": "http://www.surf.scss.tcd.ie/IoTservices.owl#to",
      "desc": "Input of service route_configurator"
    }
  ],
  "domains": [
    {
      "name": "Transport_and_Mobility",
      "url": "http://www.surf.scss.tcd.ie/cityOntology/#Transport_and_Mobility"
    }
  ],
  "id": "1_route_configurator_x_3_route_selector_request",
  "type": "composed"
}