{
  "outputs": [
    {
      "name": "_CONSTRUCTIONINFORMATION",
      "domains": [
        {
          "name": "Safety_and_Emergencies",
          "url": "http://www.surf.scss.tcd.ie/cityOntology/#Safety_and_Emergencies"
        },
        {
          "name": "Construction",
          "url": "http://www.surf.scss.tcd.ie/cityOntology/#Construction"
        }
      ],
      "type": "http://www.surf.scss.tcd.ie/IoTservices.owl#constructionInformation",
      "desc": "Output of service construction_anomaly_detection"
    }
  ],
  "inputs": [
    {
      "name": "_CONSTRUCTIONSTATUS",
      "domains": [
        {
          "name": "Safety_and_Emergencies",
          "url": "http://www.surf.scss.tcd.ie/cityOntology/#Safety_and_Emergencies"
        },
        {
          "name": "Construction",
          "url": "http://www.surf.scss.tcd.ie/cityOntology/#Construction"
        }
      ],
      "state": "used",
      "type": "http://www.surf.scss.tcd.ie/IoTservices.owl#constructionStatus",
      "desc": "Input of service monitoring_machines"
    }
  ],
  "domains": [
    {
      "name": "Safety_and_Emergencies",
      "url": "http://www.surf.scss.tcd.ie/cityOntology/#Safety_and_Emergencies"
    },
    {
      "name": "Construction",
      "url": "http://www.surf.scss.tcd.ie/cityOntology/#Construction"
    }
  ],
  "id": "monitoring_machines_x_construction_anomaly_detection"
}