{
   "inputs": [
      {
         "type": "http://127.0.0.1/ontology/SUMO.owl#Meat",
         "name": "_MEAT",
         "desc": "Input of service Meat MaxPrice Physical-Quantity Service"
      }
   ],
   "domains": [
      {
         "name": "Educational",
         "url": "http://www.surf.scss.tcd.ie/cityOntology/#Educational"
      }
   ],
   "outputs": [
      {
         "type": "http://127.0.0.1/ontology/concept.owl#MaxPrice",
         "name": "_MAXPRICE",
         "desc": "Output of service AldiFoodQuantityService"
      },
      {
         "type": "http://127.0.0.1/ontology/support.owl#Quantity",
         "name": "_QUANTITY",
         "desc": "Output of service AldiFoodQuantityService"
      }
   ],
   "id": "Meat MaxPrice Physical-Quantity Service_AldiFoodQuantityService_request"
}