{
  "outputs": [
    {
      "name": "_CONSTRUCTIONINFORMATION",
      "type": "http://www.surf.scss.tcd.ie/IoTservices.owl#constructionInformation",
      "desc": "Output of service construction_anomaly_detection"
    }
  ],
  "expectedPlanLength": 5,
  "inputs": [
    {
      "name": "_CONSTRUCTIONMONITORINGPARAMETERS",
      "state": "used",
      "type": "http://www.surf.scss.tcd.ie/IoTservices.owl#constructionMonitoringParameters",
      "desc": "Input of service construction_monitoring_configurator"
    }
  ],
  "domains": [
    {
      "name": "Safety_and_Emergencies",
      "url": "http://www.surf.scss.tcd.ie/cityOntology/#Safety_and_Emergencies"
    },
    {
      "name": "Construction",
      "url": "http://www.surf.scss.tcd.ie/cityOntology/#Construction"
    }
  ],
  "id": "40_construction_monitoring_configurator_x_44_construction_anomaly_detection_request",
  "type": "composed"
}