{
   "jobId": "RomanticNovel Author TaxedPrice Service-Monograph Publisher Service-222",
   "inputs": [
      {
         "name": "_ROMANTICNOVEL",
         "desc": "Input of service RomanticNovel Author TaxedPrice Service",
         "type": "http://127.0.0.1/ontology/books.owl#RomanticNovel"
      }
   ],
   "feedbackThreshold": 0.5,
   "domains": [
      {
         "name": "Entertainment_Products",
         "url": "http://www.surf.scss.tcd.ie/cityOntology/#Entertainment_Products"
      },
      {
         "name": "Entertainment_Products",
         "url": "http://www.surf.scss.tcd.ie/cityOntology/#Entertainment_Products"
      },
      {
         "name": "Entertainment_Products",
         "url": "http://www.surf.scss.tcd.ie/cityOntology/#Entertainment_Products"
      },
      {
         "name": "Entertainment_Products",
         "url": "http://www.surf.scss.tcd.ie/cityOntology/#Entertainment_Products"
      },
      {
         "name": "Entertainment_Products",
         "url": "http://www.surf.scss.tcd.ie/cityOntology/#Entertainment_Products"
      },
      {
         "name": "Entertainment_Products",
         "url": "http://www.surf.scss.tcd.ie/cityOntology/#Entertainment_Products"
      },
      {
         "name": "Entertainment_Products",
         "url": "http://www.surf.scss.tcd.ie/cityOntology/#Entertainment_Products"
      }
   ],
   "outputs": [
      {
         "name": "_PUBLISHER",
         "desc": "Output of service Monograph Publisher Service",
         "type": "http://127.0.0.1/ontology/books.owl#Publisher"
      }
   ],
   "matchingType": 0,
   "similarityThreshold": 0.5
}