{
   "similarityThreshold": 0.5,
   "jobId": "RetailStoreFoodService-IrishCoffeeforPrice Service-281",
   "outputs": [
      {
         "type": "http://127.0.0.1/ontology/my_ontology.owl#IrishCoffee",
         "name": "_IRISHCOFFEE",
         "desc": "Output of service IrishCoffeeforPrice Service"
      }
   ],
   "domains": [
      {
         "url": "http://www.surf.scss.tcd.ie/cityOntology/#Food_and_Drinks",
         "name": "Food_and_Drinks"
      },
      {
         "url": "http://www.surf.scss.tcd.ie/cityOntology/#Food_and_Drinks",
         "name": "Food_and_Drinks"
      },
      {
         "url": "http://www.surf.scss.tcd.ie/cityOntology/#Food_and_Drinks",
         "name": "Food_and_Drinks"
      }
   ],
   "matchingType": 0,
   "feedbackThreshold": 0.5,
   "inputs": [
      {
         "name": "_RETAILSTORE",
         "type": "http://127.0.0.1/ontology/Mid-level-ontology.owl#RetailStore",
         "desc": "Input of service RetailStoreFoodService"
      }
   ]
}