{
   "inputs": [
      {
         "type": "http://127.0.0.1/ontology/geographydataset.owl#UniqueIdentifier",
         "name": "_USERID",
         "desc": "Input of service Traffic information service."
      },
      {
         "type": "http://127.0.0.1/ontology/protont.owl#Language",
         "name": "_LANGUAGE",
         "desc": "Input of service Traffic information service."
      },
      {
         "type": "http://127.0.0.1/ontology/geographydataset.owl#Code",
         "name": "_LICENSEKEY",
         "desc": "Input of service Postal Codes of Places Finder Service"
      },
      {
         "type": "http://127.0.0.1/ontology/geographydataset.owl#PostalCode",
         "name": "_POSTALCODE",
         "desc": "Input of service Postal Codes of Places Finder Service"
      },
      {
         "type": "http://127.0.0.1/ontology/protonu.owl#PopulatedPlace",
         "name": "_PLACENAME",
         "desc": "Input of service Postal Codes of Places Finder Service"
      },
      {
         "type": "http://127.0.0.1/ontology/geographydataset.owl#Code",
         "name": "_LICENSEKEY",
         "desc": "Input of service Check and Lookup address service"
      },
      {
         "type": "http://127.0.0.1/ontology/geographydataset.owl#Code",
         "name": "_LICENSEKEY",
         "desc": "Input of service Zip code info service."
      },
      {
         "type": "http://127.0.0.1/ontology/geographydataset.owl#UniqueIdentifier",
         "name": "_USERID",
         "desc": "Input of service Location of ZipCode finder Service."
      },
      {
         "type": "http://127.0.0.1/ontology/geographydataset.owl#ZipCode",
         "name": "_ZIPCODE",
         "desc": "Input of service Location of ZipCode finder Service."
      },
      {
         "type": "http://127.0.0.1/ontology/protonu.owl#City",
         "name": "_CITY",
         "desc": "Input of service Check and Lookup address service"
      },
      {
         "type": "http://127.0.0.1/ontology/protonu.owl#State",
         "name": "_STATE",
         "desc": "Input of service Check and Lookup address service"
      },
      {
         "type": "http://127.0.0.1/ontology/protonu.owl#Country",
         "name": "_COUNTRY",
         "desc": "Input of service Check and Lookup address service"
      },
      {
         "type": "http://127.0.0.1/ontology/geographydataset.owl#Code",
         "name": "_LICENSEKEY",
         "desc": "Input of service Zip Codes finder within distance from a city."
      },
      {
         "type": "http://127.0.0.1/ontology/geographydataset.owl#US5DigitZipCode",
         "name": "_ZIPCODE",
         "desc": "Input of service Zip code info service."
      },
      {
         "type": "http://127.0.0.1/ontology/geographydataset.owl#ISOCountryCode",
         "name": "_COUNTRYCODE",
         "desc": "Input of service Postal Codes of Places Finder Service"
      },
      {
         "type": "http://127.0.0.1/ontology/geographydataset.owl#UniqueIdentifier",
         "name": "_USERID",
         "desc": "Input of service Addrees Finder Service."
      },
      {
         "type": "http://127.0.0.1/ontology/geographydataset.owl#UniqueIdentifier",
         "name": "_USERID",
         "desc": "Input of service Address location finder service."
      },
      {
         "type": "http://127.0.0.1/ontology/protonu.owl#Street",
         "name": "_STREET",
         "desc": "Input of service Address coordinates finder service."
      },
      {
         "type": "http://127.0.0.1/ontology/geographydataset.owl#Code",
         "name": "_LICENSEKEY",
         "desc": "Input of service Zip code location finder service."
      },
      {
         "type": "http://127.0.0.1/ontology/geographydataset.owl#US5DigitZipCode",
         "name": "_ZIPCODE",
         "desc": "Input of service Zip code location finder service."
      },
      {
         "type": "http://127.0.0.1/ontology/geographydataset.owl#InternationalMileLengthUnit",
         "name": "_MILES",
         "desc": "Input of service Mile to Kilometer converter service."
      },
      {
         "type": "http://127.0.0.1/ontology/geographydataset.owl#UniqueIdentifier",
         "name": "_USERID",
         "desc": "Input of service Geographic area of ZipCode finder Service."
      },
      {
         "type": "http://127.0.0.1/ontology/geographydataset.owl#ZipCode",
         "name": "_ZIPCODE",
         "desc": "Input of service Geographic area of ZipCode finder Service."
      }
   ],
   "similarityThreshold": 0.5,
   "domains": [
      {
         "name": "Geography",
         "url": "http://www.surf.scss.tcd.ie/cityOntology/#Geography"
      },
      {
         "name": "Geography",
         "url": "http://www.surf.scss.tcd.ie/cityOntology/#Geography"
      },
      {
         "name": "Geography",
         "url": "http://www.surf.scss.tcd.ie/cityOntology/#Geography"
      },
      {
         "name": "Geography",
         "url": "http://www.surf.scss.tcd.ie/cityOntology/#Geography"
      },
      {
         "name": "Geography",
         "url": "http://www.surf.scss.tcd.ie/cityOntology/#Geography"
      },
      {
         "name": "Geography",
         "url": "http://www.surf.scss.tcd.ie/cityOntology/#Geography"
      },
      {
         "name": "Geography",
         "url": "http://www.surf.scss.tcd.ie/cityOntology/#Geography"
      },
      {
         "name": "Geography",
         "url": "http://www.surf.scss.tcd.ie/cityOntology/#Geography"
      },
      {
         "name": "Geography",
         "url": "http://www.surf.scss.tcd.ie/cityOntology/#Geography"
      },
      {
         "name": "Geography",
         "url": "http://www.surf.scss.tcd.ie/cityOntology/#Geography"
      },
      {
         "name": "Geography",
         "url": "http://www.surf.scss.tcd.ie/cityOntology/#Geography"
      },
      {
         "name": "Geography",
         "url": "http://www.surf.scss.tcd.ie/cityOntology/#Geography"
      },
      {
         "name": "Geography",
         "url": "http://www.surf.scss.tcd.ie/cityOntology/#Geography"
      },
      {
         "name": "Geography",
         "url": "http://www.surf.scss.tcd.ie/cityOntology/#Geography"
      },
      {
         "name": "Geography",
         "url": "http://www.surf.scss.tcd.ie/cityOntology/#Geography"
      },
      {
         "name": "Geography",
         "url": "http://www.surf.scss.tcd.ie/cityOntology/#Geography"
      },
      {
         "name": "Geography",
         "url": "http://www.surf.scss.tcd.ie/cityOntology/#Geography"
      },
      {
         "name": "Geography",
         "url": "http://www.surf.scss.tcd.ie/cityOntology/#Geography"
      },
      {
         "name": "Geography",
         "url": "http://www.surf.scss.tcd.ie/cityOntology/#Geography"
      },
      {
         "name": "Geography",
         "url": "http://www.surf.scss.tcd.ie/cityOntology/#Geography"
      },
      {
         "name": "Geography",
         "url": "http://www.surf.scss.tcd.ie/cityOntology/#Geography"
      },
      {
         "name": "Geography",
         "url": "http://www.surf.scss.tcd.ie/cityOntology/#Geography"
      },
      {
         "name": "Geography",
         "url": "http://www.surf.scss.tcd.ie/cityOntology/#Geography"
      },
      {
         "name": "Geography",
         "url": "http://www.surf.scss.tcd.ie/cityOntology/#Geography"
      }
   ],
   "outputs": [
      {
         "type": "http://127.0.0.1/ontology/geographydataset.owl#TrafficIncident",
         "name": "_INCIDENTS",
         "desc": "Output of service Traffic information service."
      },
      {
         "type": "http://127.0.0.1/ontology/geographydataset.owl#Coordinate",
         "name": "_HOTSPOTS",
         "desc": "Output of service Traffic information service."
      },
      {
         "type": "http://127.0.0.1/ontology/geographydataset.owl#Map",
         "name": "_MAP",
         "desc": "Output of service Traffic information service."
      }
   ],
   "feedbackThreshold": 0.5,
   "jobId": "Geographic area of ZipCode finder Service.-Traffic information service.-117",
   "matchingType": 0
}