{
   "outputs": [
      {
         "desc": "Output of service streets_temperature",
         "name": "_STREETSTEMPERATURE",
         "type": "http://www.surf.scss.tcd.ie/IoTservices.owl#streetsTemperature"
      }
   ],
   "inputs": [
      {
         "desc": "Input of service check_streets",
         "name": "_MONITORINGCONFIGURATION",
         "type": "http://www.surf.scss.tcd.ie/IoTservices.owl#monitoringConfiguration",
         "state": "used"
      }
   ],
   "id": "124_check_streets_x_126_streets_temperature_request",
   "domains": [
      {
         "name": "Safety_and_Emergencies",
         "url": "http://www.surf.scss.tcd.ie/cityOntology/#Safety_and_Emergencies"
      },
      {
         "name": "Transport_and_Mobility",
         "url": "http://www.surf.scss.tcd.ie/cityOntology/#Transport_and_Mobility"
      },
      {
         "name": "Government_and_Planning",
         "url": "http://www.surf.scss.tcd.ie/cityOntology/#Government_and_Planning"
      },
      {
         "name": "Nature",
         "url": "http://www.surf.scss.tcd.ie/cityOntology/#Nature"
      }
   ],
   "tasks": [
      {
         "outputs": [
            {
               "desc": "Output of service streets_temperature",
               "name": "_STREETSTEMPERATURE",
               "type": "http://www.surf.scss.tcd.ie/IoTservices.owl#streetsTemperature"
            }
         ],
         "name": "task-1",
         "inputs": [
            {
               "desc": "Input of service streets_temperature",
               "name": "_STREETSINFO",
               "type": "http://www.surf.scss.tcd.ie/IoTservices.owl#streetsInfo"
            }
         ],
         "services": []
      },
      {
         "outputs": [
            {
               "desc": "Output of service check_streets",
               "name": "_STREETSINFO",
               "type": "http://www.surf.scss.tcd.ie/IoTservices.owl#streetsInfo"
            }
         ],
         "name": "task-2",
         "inputs": [
            {
               "desc": "Input of service check_streets",
               "name": "_MONITORINGCONFIGURATION",
               "type": "http://www.surf.scss.tcd.ie/IoTservices.owl#monitoringConfiguration"
            }
         ],
         "services": []
      }
   ]
}