{
   "id": "19_prision_video_camera_request",
   "domains": [
      {
         "name": "Safety_and_Emergencies",
         "url": "http://www.surf.scss.tcd.ie/cityOntology/#Safety_and_Emergencies"
      }
   ],
   "tasks": [
      {
         "outputs": [
            {
               "desc": "Output of service prision_video_camera",
               "name": "_PRISIONVIDEO",
               "type": "http://www.surf.scss.tcd.ie/IoTservices.owl#prisionVideo"
            }
         ],
         "name": "task-1",
         "inputs": [
            {
               "desc": "Input of service prision_video_camera",
               "name": "_PRISIONZONE",
               "type": "http://www.surf.scss.tcd.ie/IoTservices.owl#prisionZone"
            }
         ],
         "services": []
      }
   ]
}