{
  "outputs": [
    {
      "name": "_STUDENTSINFO",
      "domains": [
        {
          "name": "Educational",
          "url": "http://www.surf.scss.tcd.ie/cityOntology/#Educational"
        }
      ],
      "type": "http://www.surf.scss.tcd.ie/IoTservices.owl#studentsInfo",
      "desc": "Output of service student_monitoring_configurator"
    }
  ],
  "expectedPlanLength": 1,
  "inputs": [
    {
      "name": "_COURSEINFO",
      "domains": [
        {
          "name": "Educational",
          "url": "http://www.surf.scss.tcd.ie/cityOntology/#Educational"
        }
      ],
      "type": "http://www.surf.scss.tcd.ie/IoTservices.owl#courseInfo",
      "desc": "Input of service student_monitoring_configurator"
    }
  ],
  "domains": [
    {
      "name": "Educational",
      "url": "http://www.surf.scss.tcd.ie/cityOntology/#Educational"
    }
  ],
  "id": "51_student_monitoring_configurator_request",
  "type": "atomic"
}