{
   "inputs": [
      {
         "desc": "Input of service BookFinder",
         "type": "http://127.0.0.1/ontology/books.owl#Title",
         "name": "_TITLE"
      }
   ],
   "similarityThreshold": 0.5,
   "jobId": "BookFinder-BookRRPService-235",
   "matchingType": 0,
   "outputs": [
      {
         "desc": "Output of service BookRRPService",
         "type": "http://127.0.0.1/ontology/books.owl#Reader",
         "name": "_READER"
      },
      {
         "desc": "Output of service BookRRPService",
         "type": "http://127.0.0.1/ontology/books.owl#Review",
         "name": "_REVIEW"
      },
      {
         "desc": "Output of service BookRRPService",
         "type": "http://127.0.0.1/ontology/books.owl#Person",
         "name": "_PERSON"
      }
   ],
   "domains": [
      {
         "url": "http://www.surf.scss.tcd.ie/cityOntology/#Educational",
         "name": "Educational"
      },
      {
         "url": "http://www.surf.scss.tcd.ie/cityOntology/#Educational",
         "name": "Educational"
      }
   ],
   "feedbackThreshold": 0.5
}