{
  "outputs": [
    {
      "name": "_AMBULANCEROUTE",
      "domains": [
        {
          "name": "Transport_and_Mobility",
          "url": "http://www.surf.scss.tcd.ie/cityOntology/#Transport_and_Mobility"
        }
      ],
      "type": "http://www.surf.scss.tcd.ie/IoTservices.owl#ambulanceRoute",
      "desc": "Output of service calculate_ambulance_path"
    }
  ],
  "expectedPlanLength": 1,
  "inputs": [
    {
      "name": "_AMBULANCEINFO",
      "domains": [
        {
          "name": "Transport_and_Mobility",
          "url": "http://www.surf.scss.tcd.ie/cityOntology/#Transport_and_Mobility"
        }
      ],
      "type": "http://www.surf.scss.tcd.ie/IoTservices.owl#ambulanceInfo",
      "desc": "Input of service calculate_ambulance_path"
    }
  ],
  "domains": [
    {
      "name": "Transport_and_Mobility",
      "url": "http://www.surf.scss.tcd.ie/cityOntology/#Transport_and_Mobility"
    }
  ],
  "id": "94_calculate_ambulance_path_request",
  "type": "atomic"
}