{
   "jobId": "Science-Fiction-Novel Author Price Service-Author Publication TaxFreePrice Service-334",
   "feedbackThreshold": 0.5,
   "inputs": [
      {
         "type": "http://127.0.0.1/ontology/books.owl#Science-Fiction-Novel",
         "name": "_SCIENCE-FICTION-NOVEL",
         "desc": "Input of service Science-Fiction-Novel Author Price Service"
      }
   ],
   "domains": [
      {
         "url": "http://www.surf.scss.tcd.ie/cityOntology/#Entertainment_Products",
         "name": "Entertainment_Products"
      },
      {
         "url": "http://www.surf.scss.tcd.ie/cityOntology/#Entertainment_Products",
         "name": "Entertainment_Products"
      },
      {
         "url": "http://www.surf.scss.tcd.ie/cityOntology/#Entertainment_Products",
         "name": "Entertainment_Products"
      },
      {
         "url": "http://www.surf.scss.tcd.ie/cityOntology/#Entertainment_Products",
         "name": "Entertainment_Products"
      },
      {
         "url": "http://www.surf.scss.tcd.ie/cityOntology/#Entertainment_Products",
         "name": "Entertainment_Products"
      },
      {
         "url": "http://www.surf.scss.tcd.ie/cityOntology/#Entertainment_Products",
         "name": "Entertainment_Products"
      },
      {
         "url": "http://www.surf.scss.tcd.ie/cityOntology/#Entertainment_Products",
         "name": "Entertainment_Products"
      },
      {
         "url": "http://www.surf.scss.tcd.ie/cityOntology/#Entertainment_Products",
         "name": "Entertainment_Products"
      },
      {
         "url": "http://www.surf.scss.tcd.ie/cityOntology/#Entertainment_Products",
         "name": "Entertainment_Products"
      },
      {
         "url": "http://www.surf.scss.tcd.ie/cityOntology/#Entertainment_Products",
         "name": "Entertainment_Products"
      },
      {
         "url": "http://www.surf.scss.tcd.ie/cityOntology/#Entertainment_Products",
         "name": "Entertainment_Products"
      }
   ],
   "matchingType": 0,
   "outputs": [
      {
         "type": "http://127.0.0.1/ontology/books.owl#Publication",
         "name": "_PUBLICATION",
         "desc": "Output of service Author Publication TaxFreePrice Service"
      },
      {
         "type": "http://127.0.0.1/ontology/concept.owl#TaxFreePrice",
         "name": "_TAXFREEPRICE",
         "desc": "Output of service Author Publication TaxFreePrice Service"
      }
   ],
   "similarityThreshold": 0.5
}