{
   "matchingType": 0,
   "jobId": "BookAuthorPriceService-NovelPrice Service-378",
   "domains": [
      {
         "name": "Entertainment_Products",
         "url": "http://www.surf.scss.tcd.ie/cityOntology/#Entertainment_Products"
      },
      {
         "name": "Entertainment_Products",
         "url": "http://www.surf.scss.tcd.ie/cityOntology/#Entertainment_Products"
      },
      {
         "name": "Entertainment_Products",
         "url": "http://www.surf.scss.tcd.ie/cityOntology/#Entertainment_Products"
      }
   ],
   "similarityThreshold": 0.5,
   "feedbackThreshold": 0.5,
   "inputs": [
      {
         "desc": "Input of service NovelPrice Service",
         "type": "http://127.0.0.1/ontology/books.owl#Person",
         "name": "_PERSON"
      },
      {
         "desc": "Input of service BookAuthorPriceService",
         "type": "http://127.0.0.1/ontology/books.owl#Book",
         "name": "_BOOK"
      }
   ],
   "outputs": [
      {
         "desc": "Output of service NovelPrice Service",
         "type": "http://127.0.0.1/ontology/concept.owl#Price",
         "name": "_PRICE"
      }
   ]
}