{
  "outputs": [
    {
      "name": "_ATMSTATUS",
      "type": "http://www.surf.scss.tcd.ie/IoTservices.owl#atmStatus",
      "desc": "Output of service atm_intruder_service"
    }
  ],
  "expectedPlanLength": 1,
  "inputs": [
    {
      "name": "_ATMID",
      "type": "http://www.surf.scss.tcd.ie/IoTservices.owl#atmId",
      "desc": "Input of service atm_intruder_service"
    }
  ],
  "domains": [
    {
      "name": "Safety_and_Emergencies",
      "url": "http://www.surf.scss.tcd.ie/cityOntology/#Safety_and_Emergencies"
    },
    {
      "name": "Finance",
      "url": "http://www.surf.scss.tcd.ie/cityOntology/#Finance"
    }
  ],
  "id": "116_atm_intruder_service_request",
  "type": "atomic"
}