{
  "outputs": [
    {
      "name": "_PATIENTPRESENTATION",
      "type": "http://www.surf.scss.tcd.ie/IoTservices.owl#patientPresentation",
      "desc": "Output of service presentation_patient_status"
    }
  ],
  "expectedPlanLength": 4,
  "inputs": [
    {
      "name": "_PATIENTID",
      "state": "notUsed",
      "type": "http://www.surf.scss.tcd.ie/IoTservices.owl#patientId",
      "desc": "Input of service patient_profile"
    }
  ],
  "domains": [
    {
      "name": "Health",
      "url": "http://www.surf.scss.tcd.ie/cityOntology/#Health"
    },
    {
      "name": "Safety_and_Emergencies",
      "url": "http://www.surf.scss.tcd.ie/cityOntology/#Safety_and_Emergencies"
    }
  ],
  "id": "88_patient_profile_x_91_presentation_patient_status_request",
  "type": "composed"
}