{
  "outputs": [
    {
      "name": "_PRISIONVIDEO",
      "domains": [
        {
          "name": "Safety_and_Emergencies",
          "url": "http://www.surf.scss.tcd.ie/cityOntology/#Safety_and_Emergencies"
        }
      ],
      "type": "http://www.surf.scss.tcd.ie/IoTservices.owl#prisionVideo",
      "desc": "Output of service prision_video_camera"
    }
  ],
  "expectedPlanLength": 1,
  "inputs": [
    {
      "name": "_PRISIONZONE",
      "domains": [
        {
          "name": "Safety_and_Emergencies",
          "url": "http://www.surf.scss.tcd.ie/cityOntology/#Safety_and_Emergencies"
        }
      ],
      "type": "http://www.surf.scss.tcd.ie/IoTservices.owl#prisionZone",
      "desc": "Input of service prision_video_camera"
    }
  ],
  "domains": [
    {
      "name": "Safety_and_Emergencies",
      "url": "http://www.surf.scss.tcd.ie/cityOntology/#Safety_and_Emergencies"
    }
  ],
  "id": "19_prision_video_camera_request",
  "type": "atomic"
}