{
  "outputs": [
    {
      "name": "_PLACEVIDEO",
      "type": "http://www.surf.scss.tcd.ie/IoTservices.owl#placeVideo",
      "desc": "Output of service city_video_camera"
    }
  ],
  "expectedPlanLength": 2,
  "inputs": [
    {
      "name": "_GUNSHOTALERT",
      "state": "used",
      "type": "http://www.surf.scss.tcd.ie/IoTservices.owl#gunshotAlert",
      "desc": "Input of service street_anomaly_detection"
    },
    {
      "name": "_ZONEINTRUSIONALERT",
      "state": "used",
      "type": "http://www.surf.scss.tcd.ie/IoTservices.owl#zoneIntrusionAlert",
      "desc": "Input of service street_anomaly_detection"
    },
    {
      "name": "_REPORT",
      "state": "used",
      "type": "http://www.surf.scss.tcd.ie/IoTservices.owl#report",
      "desc": "Input of service street_anomaly_detection"
    }
  ],
  "domains": [
    {
      "name": "Safety_and_Emergencies",
      "url": "http://www.surf.scss.tcd.ie/cityOntology/#Safety_and_Emergencies"
    }
  ],
  "id": "25_street_anomaly_detection_x_26_city_video_camera_request",
  "type": "composed"
}