{
   "similarityThreshold": 0.5,
   "outputs": [
      {
         "name": "_CITY",
         "type": "http://127.0.0.1/ontology/protonu.owl#City",
         "desc": "Output of service Zip code info service."
      },
      {
         "name": "_STATE",
         "type": "http://127.0.0.1/ontology/protonu.owl#State",
         "desc": "Output of service Zip code info service."
      },
      {
         "name": "_TIMEZONE",
         "type": "http://127.0.0.1/ontology/protonu.owl#TimeZone",
         "desc": "Output of service Zip code info service."
      },
      {
         "name": "_DAYLIGHTSAVINGTIME",
         "type": "http://127.0.0.1/ontology/geographydataset.owl#daylightSavingTime",
         "desc": "Output of service Zip code info service."
      }
   ],
   "feedbackThreshold": 0.5,
   "matchingType": 0,
   "domains": [
      {
         "name": "Geography",
         "url": "http://www.surf.scss.tcd.ie/cityOntology/#Geography"
      },
      {
         "name": "Geography",
         "url": "http://www.surf.scss.tcd.ie/cityOntology/#Geography"
      },
      {
         "name": "Geography",
         "url": "http://www.surf.scss.tcd.ie/cityOntology/#Geography"
      },
      {
         "name": "Geography",
         "url": "http://www.surf.scss.tcd.ie/cityOntology/#Geography"
      },
      {
         "name": "Geography",
         "url": "http://www.surf.scss.tcd.ie/cityOntology/#Geography"
      },
      {
         "name": "Geography",
         "url": "http://www.surf.scss.tcd.ie/cityOntology/#Geography"
      },
      {
         "name": "Geography",
         "url": "http://www.surf.scss.tcd.ie/cityOntology/#Geography"
      },
      {
         "name": "Geography",
         "url": "http://www.surf.scss.tcd.ie/cityOntology/#Geography"
      },
      {
         "name": "Geography",
         "url": "http://www.surf.scss.tcd.ie/cityOntology/#Geography"
      },
      {
         "name": "Geography",
         "url": "http://www.surf.scss.tcd.ie/cityOntology/#Geography"
      },
      {
         "name": "Geography",
         "url": "http://www.surf.scss.tcd.ie/cityOntology/#Geography"
      },
      {
         "name": "Geography",
         "url": "http://www.surf.scss.tcd.ie/cityOntology/#Geography"
      },
      {
         "name": "Geography",
         "url": "http://www.surf.scss.tcd.ie/cityOntology/#Geography"
      },
      {
         "name": "Geography",
         "url": "http://www.surf.scss.tcd.ie/cityOntology/#Geography"
      },
      {
         "name": "Geography",
         "url": "http://www.surf.scss.tcd.ie/cityOntology/#Geography"
      },
      {
         "name": "Geography",
         "url": "http://www.surf.scss.tcd.ie/cityOntology/#Geography"
      },
      {
         "name": "Geography",
         "url": "http://www.surf.scss.tcd.ie/cityOntology/#Geography"
      },
      {
         "name": "Geography",
         "url": "http://www.surf.scss.tcd.ie/cityOntology/#Geography"
      },
      {
         "name": "Geography",
         "url": "http://www.surf.scss.tcd.ie/cityOntology/#Geography"
      },
      {
         "name": "Geography",
         "url": "http://www.surf.scss.tcd.ie/cityOntology/#Geography"
      },
      {
         "name": "Geography",
         "url": "http://www.surf.scss.tcd.ie/cityOntology/#Geography"
      },
      {
         "name": "Geography",
         "url": "http://www.surf.scss.tcd.ie/cityOntology/#Geography"
      },
      {
         "name": "Geography",
         "url": "http://www.surf.scss.tcd.ie/cityOntology/#Geography"
      }
   ],
   "jobId": "Location of ZipCode finder Service.-Zip code info service.-592",
   "inputs": [
      {
         "name": "_LICENSEKEY",
         "type": "http://127.0.0.1/ontology/geographydataset.owl#Code",
         "desc": "Input of service Zip code info service."
      },
      {
         "name": "_LICENSEKEY",
         "type": "http://127.0.0.1/ontology/geographydataset.owl#Code",
         "desc": "Input of service Zip Codes finder within distance from a city."
      },
      {
         "name": "_ZIPCODE",
         "type": "http://127.0.0.1/ontology/geographydataset.owl#US5DigitZipCode",
         "desc": "Input of service Zip code info service."
      },
      {
         "name": "_USERID",
         "type": "http://127.0.0.1/ontology/geographydataset.owl#UniqueIdentifier",
         "desc": "Input of service Address location finder service."
      },
      {
         "name": "_USERID",
         "type": "http://127.0.0.1/ontology/geographydataset.owl#UniqueIdentifier",
         "desc": "Input of service Location of ZipCode finder Service."
      },
      {
         "name": "_ZIPCODE",
         "type": "http://127.0.0.1/ontology/geographydataset.owl#ZipCode",
         "desc": "Input of service Location of ZipCode finder Service."
      },
      {
         "name": "_LICENSEKEY",
         "type": "http://127.0.0.1/ontology/geographydataset.owl#Code",
         "desc": "Input of service Check and Lookup address service"
      },
      {
         "name": "_USERID",
         "type": "http://127.0.0.1/ontology/geographydataset.owl#UniqueIdentifier",
         "desc": "Input of service Addrees Finder Service."
      },
      {
         "name": "_COUNTY",
         "type": "http://127.0.0.1/ontology/protonu.owl#County",
         "desc": "Input of service Address Place finder service."
      },
      {
         "name": "_DISTRICT",
         "type": "http://127.0.0.1/ontology/protonu.owl#UrbanDistrict",
         "desc": "Input of service Address Place finder service."
      },
      {
         "name": "_ADDRESS",
         "type": "http://127.0.0.1/ontology/protonu.owl#Address",
         "desc": "Input of service Check and Lookup address service"
      },
      {
         "name": "_CITY",
         "type": "http://127.0.0.1/ontology/protonu.owl#City",
         "desc": "Input of service Check and Lookup address service"
      },
      {
         "name": "_STATE",
         "type": "http://127.0.0.1/ontology/protonu.owl#State",
         "desc": "Input of service Check and Lookup address service"
      },
      {
         "name": "_COUNTRY",
         "type": "http://127.0.0.1/ontology/protonu.owl#Country",
         "desc": "Input of service Check and Lookup address service"
      },
      {
         "name": "_LICENSEKEY",
         "type": "http://127.0.0.1/ontology/geographydataset.owl#Code",
         "desc": "Input of service Nearby Postal Codes Finder Service."
      },
      {
         "name": "_RADIUS",
         "type": "http://127.0.0.1/ontology/geographydataset.owl#GeographicDistanceKilometerLengthUnit",
         "desc": "Input of service Nearby Postal Codes Finder Service."
      },
      {
         "name": "_MAX-RESULTS",
         "type": "http://127.0.0.1/ontology/protont.owl#Number",
         "desc": "Input of service Nearby Postal Codes Finder Service."
      },
      {
         "name": "_STREET",
         "type": "http://127.0.0.1/ontology/protonu.owl#Street",
         "desc": "Input of service Address coordinates finder service."
      },
      {
         "name": "_POSTALCODE",
         "type": "http://127.0.0.1/ontology/geographydataset.owl#PostalCode",
         "desc": "Input of service Address coordinates finder service."
      },
      {
         "name": "_LICENSEKEY",
         "type": "http://127.0.0.1/ontology/geographydataset.owl#Code",
         "desc": "Input of service Zip code location finder service."
      },
      {
         "name": "_LATITUDE",
         "type": "http://127.0.0.1/ontology/protont.owl#latitude",
         "desc": "Input of service Addrees Finder Service."
      },
      {
         "name": "_LONGITUDE",
         "type": "http://127.0.0.1/ontology/protont.owl#longitude",
         "desc": "Input of service Addrees Finder Service."
      },
      {
         "name": "_STATE",
         "type": "http://127.0.0.1/ontology/protonu.owl#State",
         "desc": "Input of service City State Location Geocoder service."
      }
   ]
}