{
   "id": "42_monitoring_machines_request",
   "domains": [
      {
         "name": "Safety_and_Emergencies",
         "url": "http://www.surf.scss.tcd.ie/cityOntology/#Safety_and_Emergencies"
      },
      {
         "name": "Construction",
         "url": "http://www.surf.scss.tcd.ie/cityOntology/#Construction"
      }
   ],
   "tasks": [
      {
         "outputs": [
            {
               "desc": "Output of service monitoring_machines",
               "name": "_MACHINESTATUS",
               "type": "http://www.surf.scss.tcd.ie/IoTservices.owl#machineStatus"
            }
         ],
         "name": "task-1",
         "inputs": [
            {
               "desc": "Input of service monitoring_machines",
               "name": "_CONSTRUCTIONSTATUS",
               "type": "http://www.surf.scss.tcd.ie/IoTservices.owl#constructionStatus"
            }
         ],
         "services": []
      }
   ]
}