{
  "outputs": [
    {
      "name": "_DISPLAYVIDEO",
      "domains": [
        {
          "name": "Educational",
          "url": "http://www.surf.scss.tcd.ie/cityOntology/#Educational"
        }
      ],
      "type": "http://www.surf.scss.tcd.ie/IoTservices.owl#displayVideo",
      "desc": "Output of service camera_room_activation"
    }
  ],
  "expectedPlanLength": 1,
  "inputs": [
    {
      "name": "_ROOMINFO",
      "domains": [
        {
          "name": "Educational",
          "url": "http://www.surf.scss.tcd.ie/cityOntology/#Educational"
        }
      ],
      "type": "http://www.surf.scss.tcd.ie/IoTservices.owl#roomInfo",
      "desc": "Input of service camera_room_activation"
    }
  ],
  "domains": [
    {
      "name": "Educational",
      "url": "http://www.surf.scss.tcd.ie/cityOntology/#Educational"
    }
  ],
  "id": "65_camera_room_activation_request",
  "type": "atomic"
}