{
   "inputs": [
      {
         "type": "http://127.0.0.1/ontology/books.owl#Author",
         "name": "_AUTHOR",
         "desc": "Input of service Author ScienceFictionBook RecommendedPrice Service"
      }
   ],
   "domains": [
      {
         "name": "Entertainment_Products",
         "url": "http://www.surf.scss.tcd.ie/cityOntology/#Entertainment_Products"
      }
   ],
   "outputs": [
      {
         "type": "http://127.0.0.1/ontology/books.owl#Monograph",
         "name": "_MONOGRAPH",
         "desc": "Output of service Author Monograph MaxPrice Service"
      },
      {
         "type": "http://127.0.0.1/ontology/concept.owl#MaxPrice",
         "name": "_MAXPRICE",
         "desc": "Output of service Author Monograph MaxPrice Service"
      }
   ],
   "id": "Author ScienceFictionBook RecommendedPrice Service_Author Monograph MaxPrice Service_request"
}