{
  "outputs": [
    {
      "name": "_SELECTEDROUTE",
      "type": "http://www.surf.scss.tcd.ie/IoTservices.owl#selectedRoute",
      "desc": "Output of service route_selector"
    }
  ],
  "expectedPlanLength": 1,
  "inputs": [
    {
      "name": "_TRAFFICINFO",
      "type": "http://www.surf.scss.tcd.ie/IoTservices.owl#trafficInfo",
      "desc": "Input of service route_selector"
    },
    {
      "name": "_POLLUTIONINFO",
      "type": "http://www.surf.scss.tcd.ie/IoTservices.owl#pollutionInfo",
      "desc": "Input of service route_selector"
    },
    {
      "name": "_NOISEINFO",
      "type": "http://www.surf.scss.tcd.ie/IoTservices.owl#noiseInfo",
      "desc": "Input of service route_selector"
    },
    {
      "name": "_FLOODINGINFO",
      "type": "http://www.surf.scss.tcd.ie/IoTservices.owl#floodingInfo",
      "desc": "Input of service route_selector"
    }
  ],
  "domains": [
    {
      "name": "Transport_and_Mobility",
      "url": "http://www.surf.scss.tcd.ie/cityOntology/#Transport_and_Mobility"
    }
  ],
  "id": "3_route_selector_request",
  "type": "atomic"
}