{
  "outputs": [
    {
      "name": "_MONITORLOG",
      "domains": [
        {
          "name": "Educational",
          "url": "http://www.surf.scss.tcd.ie/cityOntology/#Educational"
        },
        {
          "name": "Research_and_Science",
          "url": "http://www.surf.scss.tcd.ie/cityOntology/#Research_and_Science"
        }
      ],
      "type": "http://www.surf.scss.tcd.ie/IoTservices.owl#monitorLog",
      "desc": "Output of service book_monitoring"
    }
  ],
  "inputs": [
    {
      "name": "_SEARCHKEYWORDS",
      "domains": [
        {
          "name": "Educational",
          "url": "http://www.surf.scss.tcd.ie/cityOntology/#Educational"
        },
        {
          "name": "Research_and_Science",
          "url": "http://www.surf.scss.tcd.ie/cityOntology/#Research_and_Science"
        }
      ],
      "state": "used",
      "type": "http://www.surf.scss.tcd.ie/IoTservices.owl#searchKeywords",
      "desc": "Input of service search_book"
    }
  ],
  "domains": [
    {
      "name": "Educational",
      "url": "http://www.surf.scss.tcd.ie/cityOntology/#Educational"
    },
    {
      "name": "Research_and_Science",
      "url": "http://www.surf.scss.tcd.ie/cityOntology/#Research_and_Science"
    }
  ],
  "id": "search_book_x_book_monitoring"
}