{
   "outputs": [
      {
         "name": "_DESTINATION",
         "desc": "Output of service HikingSurfingDestination",
         "type": "http://127.0.0.1/ontology/travel.owl#Destination"
      }
   ],
   "domains": [
      {
         "url": "http://www.surf.scss.tcd.ie/cityOntology/#Travel",
         "name": "Travel"
      }
   ],
   "inputs": [
      {
         "name": "_HIKING",
         "desc": "Input of service HikingSurfingDestination",
         "type": "http://127.0.0.1/ontology/travel.owl#Hiking"
      },
      {
         "name": "_SURFING",
         "desc": "Input of service HikingSurfingDestination",
         "type": "http://127.0.0.1/ontology/travel.owl#Surfing"
      }
   ],
   "id": "HikingSurfingDestination_request"
}