{
   "outputs": [
      {
         "desc": "Output of service book_room_campus",
         "name": "_BOOKEDROOM",
         "type": "http://www.surf.scss.tcd.ie/IoTservices.owl#bookedRoom"
      }
   ],
   "inputs": [
      {
         "desc": "Input of service search_campus_room",
         "name": "_ROOMPARAMETERS",
         "type": "http://www.surf.scss.tcd.ie/IoTservices.owl#roomParameters",
         "state": "notUsed"
      }
   ],
   "id": "63_search_campus_room_x_66_book_room_campus_request",
   "domains": [
      {
         "name": "Educational",
         "url": "http://www.surf.scss.tcd.ie/cityOntology/#Educational"
      }
   ],
   "tasks": [
      {
         "outputs": [
            {
               "desc": "Output of service book_room_campus",
               "name": "_BOOKEDROOM",
               "type": "http://www.surf.scss.tcd.ie/IoTservices.owl#bookedRoom"
            }
         ],
         "name": "task-1",
         "inputs": [
            {
               "desc": "Input of service book_room_campus",
               "name": "_DISPLAYROOMINFO",
               "type": "http://www.surf.scss.tcd.ie/IoTservices.owl#displayRoomInfo"
            },
            {
               "desc": "Input of service book_room_campus",
               "name": "_DISPLAYVIDEO",
               "type": "http://www.surf.scss.tcd.ie/IoTservices.owl#displayVideo"
            }
         ],
         "services": []
      },
      {
         "outputs": [
            {
               "desc": "Output of service camera_room_activation",
               "name": "_DISPLAYVIDEO",
               "type": "http://www.surf.scss.tcd.ie/IoTservices.owl#displayVideo"
            }
         ],
         "name": "task-2",
         "inputs": [
            {
               "desc": "Input of service camera_room_activation",
               "name": "_ROOMINFO",
               "type": "http://www.surf.scss.tcd.ie/IoTservices.owl#roomInfo"
            }
         ],
         "services": []
      },
      {
         "outputs": [
            {
               "desc": "Output of service found_room_presentation",
               "name": "_DISPLAYROOMINFO",
               "type": "http://www.surf.scss.tcd.ie/IoTservices.owl#displayRoomInfo"
            }
         ],
         "name": "task-3",
         "inputs": [
            {
               "desc": "Input of service found_room_presentation",
               "name": "_ROOMINFO",
               "type": "http://www.surf.scss.tcd.ie/IoTservices.owl#roomInfo"
            }
         ],
         "services": []
      },
      {
         "outputs": [
            {
               "desc": "Output of service search_campus_room",
               "name": "_ROOMINFO",
               "type": "http://www.surf.scss.tcd.ie/IoTservices.owl#roomInfo"
            }
         ],
         "name": "task-4",
         "inputs": [
            {
               "desc": "Input of service search_campus_room",
               "name": "_ROOMPARAMETERS",
               "type": "http://www.surf.scss.tcd.ie/IoTservices.owl#roomParameters"
            }
         ],
         "services": []
      }
   ]
}