{
   "outputs": [
      {
         "desc": "Output of service presentation_patient_status",
         "name": "_PATIENTPRESENTATION",
         "type": "http://www.surf.scss.tcd.ie/IoTservices.owl#patientPresentation"
      }
   ],
   "inputs": [
      {
         "desc": "Input of service patient_camera",
         "name": "_PATIENTPROFILE",
         "type": "http://www.surf.scss.tcd.ie/IoTservices.owl#patientProfile",
         "state": "used"
      }
   ],
   "id": "90_patient_camera_x_91_presentation_patient_status_request",
   "domains": [
      {
         "name": "Health",
         "url": "http://www.surf.scss.tcd.ie/cityOntology/#Health"
      },
      {
         "name": "Safety_and_Emergencies",
         "url": "http://www.surf.scss.tcd.ie/cityOntology/#Safety_and_Emergencies"
      }
   ],
   "tasks": [
      {
         "outputs": [
            {
               "desc": "Output of service presentation_patient_status",
               "name": "_PATIENTPRESENTATION",
               "type": "http://www.surf.scss.tcd.ie/IoTservices.owl#patientPresentation"
            }
         ],
         "name": "task-1",
         "inputs": [
            {
               "desc": "Input of service presentation_patient_status",
               "name": "_PATIENTREADINGS",
               "type": "http://www.surf.scss.tcd.ie/IoTservices.owl#patientReadings"
            },
            {
               "desc": "Input of service presentation_patient_status",
               "name": "_PATIENTVIDEO",
               "type": "http://www.surf.scss.tcd.ie/IoTservices.owl#patientVideo"
            }
         ],
         "services": []
      },
      {
         "outputs": [
            {
               "desc": "Output of service patient_wereable_readings",
               "name": "_PATIENTREADINGS",
               "type": "http://www.surf.scss.tcd.ie/IoTservices.owl#patientReadings"
            }
         ],
         "name": "task-2",
         "inputs": [
            {
               "desc": "Input of service patient_wereable_readings",
               "name": "_PATIENTPROFILE",
               "type": "http://www.surf.scss.tcd.ie/IoTservices.owl#patientProfile"
            }
         ],
         "services": []
      },
      {
         "outputs": [
            {
               "desc": "Output of service patient_camera",
               "name": "_PATIENTVIDEO",
               "type": "http://www.surf.scss.tcd.ie/IoTservices.owl#patientVideo"
            }
         ],
         "name": "task-3",
         "inputs": [
            {
               "desc": "Input of service patient_camera",
               "name": "_PATIENTPROFILE",
               "type": "http://www.surf.scss.tcd.ie/IoTservices.owl#patientProfile"
            }
         ],
         "services": []
      }
   ]
}