{
   "outputs": [
      {
         "name": "_PUBLICATION",
         "desc": "Output of service Author Publication MaxPrice Service",
         "type": "http://127.0.0.1/ontology/books.owl#Publication"
      },
      {
         "name": "_MAXPRICE",
         "desc": "Output of service Author Publication MaxPrice Service",
         "type": "http://127.0.0.1/ontology/concept.owl#MaxPrice"
      }
   ],
   "similarityThreshold": 0.5,
   "matchingType": 0,
   "feedbackThreshold": 0.5,
   "domains": [
      {
         "url": "http://www.surf.scss.tcd.ie/cityOntology/#Entertainment_Products",
         "name": "Entertainment_Products"
      },
      {
         "url": "http://www.surf.scss.tcd.ie/cityOntology/#Entertainment_Products",
         "name": "Entertainment_Products"
      },
      {
         "url": "http://www.surf.scss.tcd.ie/cityOntology/#Entertainment_Products",
         "name": "Entertainment_Products"
      },
      {
         "url": "http://www.surf.scss.tcd.ie/cityOntology/#Entertainment_Products",
         "name": "Entertainment_Products"
      },
      {
         "url": "http://www.surf.scss.tcd.ie/cityOntology/#Entertainment_Products",
         "name": "Entertainment_Products"
      },
      {
         "url": "http://www.surf.scss.tcd.ie/cityOntology/#Entertainment_Products",
         "name": "Entertainment_Products"
      },
      {
         "url": "http://www.surf.scss.tcd.ie/cityOntology/#Entertainment_Products",
         "name": "Entertainment_Products"
      }
   ],
   "jobId": "Author Novel MaxPrice Service-Author Publication MaxPrice Service-190",
   "inputs": [
      {
         "name": "_AUTHOR",
         "desc": "Input of service Author Novel MaxPrice Service",
         "type": "http://127.0.0.1/ontology/books.owl#Author"
      }
   ]
}