{
  "outputs": [
    {
      "name": "_ROUTEMAP",
      "type": "http://www.surf.scss.tcd.ie/IoTservices.owl#routeMap",
      "desc": "Output of service route_presentation"
    }
  ],
  "expectedPlanLength": 1,
  "inputs": [
    {
      "name": "_SELECTEDROUTE",
      "type": "http://www.surf.scss.tcd.ie/IoTservices.owl#selectedRoute",
      "desc": "Input of service route_presentation"
    }
  ],
  "domains": [
    {
      "name": "Transport_and_Mobility",
      "url": "http://www.surf.scss.tcd.ie/cityOntology/#Transport_and_Mobility"
    }
  ],
  "id": "13_route_presentation_request",
  "type": "atomic"
}