{
  "outputs": [
    {
      "name": "_PRODUCTS",
		"domains": [
	    	{
	      	"name": "Food_and_Drinks",
		      "url": "http://www.surf.scss.tcd.ie/cityOntology/#Food_and_Drinks"
   	 	}
  		],	
      "type": "http://www.surf.scss.tcd.ie/IoTservices.owl#products",
      "desc": "Output of service check_fridge_products"
    }
  ],
  "expectedPlanLength": 1,
  "inputs": [
    {
      "name": "_FRIDGEDATA",
		"domains": [
	    	{
	      	"name": "Food_and_Drinks",
		      "url": "http://www.surf.scss.tcd.ie/cityOntology/#Food_and_Drinks"
   	 	}
  		],	
      "type": "http://www.surf.scss.tcd.ie/IoTservices.owl#fridgeData",
      "desc": "Input of service check_fridge_products"
    }
  ],
  "domains": [
    {
      "name": "Food_and_Drinks",
      "url": "http://www.surf.scss.tcd.ie/cityOntology/#Food_and_Drinks"
    }
  ],
  "id": "68_check_fridge_products_request",
  "type": "atomic"
}
