{
   "outputs": [
      {
         "desc": "Output of service notify_home_owner",
         "name": "_STARTALARM",
         "type": "http://www.surf.scss.tcd.ie/IoTservices.owl#startAlarm"
      }
   ],
   "inputs": [
      {
         "desc": "Input of service home_surveillance_configurator",
         "name": "_HOMESURVEILLANCEPARAMETERS",
         "type": "http://www.surf.scss.tcd.ie/IoTservices.owl#homeSurveillanceParameters",
         "state": "used"
      }
   ],
   "id": "29_home_surveillance_configurator_x_34_notify_home_owner_request",
   "domains": [
      {
         "name": "Safety_and_Emergencies",
         "url": "http://www.surf.scss.tcd.ie/cityOntology/#Safety_and_Emergencies"
      }
   ],
   "tasks": [
      {
         "outputs": [
            {
               "desc": "Output of service notify_home_owner",
               "name": "_STARTALARM",
               "type": "http://www.surf.scss.tcd.ie/IoTservices.owl#startAlarm"
            }
         ],
         "name": "task-1",
         "inputs": [
            {
               "desc": "Input of service notify_home_owner",
               "name": "_ALERTNOTIFICATION",
               "type": "http://www.surf.scss.tcd.ie/IoTservices.owl#alertNotification"
            }
         ],
         "services": []
      },
      {
         "outputs": [
            {
               "desc": "Output of service home_anomaly_detection",
               "name": "_ALERTNOTIFICATION",
               "type": "http://www.surf.scss.tcd.ie/IoTservices.owl#alertNotification"
            }
         ],
         "name": "task-2",
         "inputs": [
            {
               "desc": "Input of service home_anomaly_detection",
               "name": "_HOMEINTRUSIONALERT",
               "type": "http://www.surf.scss.tcd.ie/IoTservices.owl#homeIntrusionAlert"
            },
            {
               "desc": "Input of service home_anomaly_detection",
               "name": "_HOMEVIDEO",
               "type": "http://www.surf.scss.tcd.ie/IoTservices.owl#homeVideo"
            }
         ],
         "services": []
      },
      {
         "outputs": [
            {
               "desc": "Output of service home_video_camera",
               "name": "_HOMEVIDEO",
               "type": "http://www.surf.scss.tcd.ie/IoTservices.owl#homeVideo"
            }
         ],
         "name": "task-3",
         "inputs": [
            {
               "desc": "Input of service home_video_camera",
               "name": "_HOMEINFORMATION",
               "type": "http://www.surf.scss.tcd.ie/IoTservices.owl#homeInformation"
            }
         ],
         "services": []
      },
      {
         "outputs": [
            {
               "desc": "Output of service home_intruder_detection",
               "name": "_HOMEINTRUSIONALERT",
               "type": "http://www.surf.scss.tcd.ie/IoTservices.owl#homeIntrusionAlert"
            }
         ],
         "name": "task-4",
         "inputs": [
            {
               "desc": "Input of service home_intruder_detection",
               "name": "_HOMEINFORMATION",
               "type": "http://www.surf.scss.tcd.ie/IoTservices.owl#homeInformation"
            }
         ],
         "services": []
      },
      {
         "outputs": [
            {
               "desc": "Output of service home_surveillance_configurator",
               "name": "_HOMEINFORMATION",
               "type": "http://www.surf.scss.tcd.ie/IoTservices.owl#homeInformation"
            }
         ],
         "name": "task-5",
         "inputs": [
            {
               "desc": "Input of service home_surveillance_configurator",
               "name": "_HOMESURVEILLANCEPARAMETERS",
               "type": "http://www.surf.scss.tcd.ie/IoTservices.owl#homeSurveillanceParameters"
            }
         ],
         "services": []
      }
   ]
}