{
  "outputs": [
    {
      "name": "_CONSTRUCTIONINFORMATION",
      "type": "http://www.surf.scss.tcd.ie/IoTservices.owl#constructionInformation",
      "desc": "Output of service construction_anomaly_detection"
    }
  ],
  "expectedPlanLength": 1,
  "inputs": [
    {
      "name": "_MACHINESTATUS",
      "type": "http://www.surf.scss.tcd.ie/IoTservices.owl#machineStatus",
      "desc": "Input of service construction_anomaly_detection"
    },
    {
      "name": "_GASDETECTION",
      "type": "http://www.surf.scss.tcd.ie/IoTservices.owl#gasDetection",
      "desc": "Input of service construction_anomaly_detection"
    }
  ],
  "domains": [
    {
      "name": "Safety_and_Emergencies",
      "url": "http://www.surf.scss.tcd.ie/cityOntology/#Safety_and_Emergencies"
    },
    {
      "name": "Construction",
      "url": "http://www.surf.scss.tcd.ie/cityOntology/#Construction"
    }
  ],
  "id": "44_construction_anomaly_detection_request",
  "type": "atomic"
}