{
  "outputs": [
    {
      "name": "_BUSAVAILABILITY",
      "type": "http://www.surf.scss.tcd.ie/IoTservices.owl#busAvailability",
      "desc": "Output of service bus_availability"
    }
  ],
  "expectedPlanLength": 2,
  "inputs": [
    {
      "name": "_FROM",
      "state": "used",
      "type": "http://www.surf.scss.tcd.ie/IoTservices.owl#from",
      "desc": "Input of service route_configurator"
    },
    {
      "name": "_TO",
      "state": "used",
      "type": "http://www.surf.scss.tcd.ie/IoTservices.owl#to",
      "desc": "Input of service route_configurator"
    }
  ],
  "domains": [
    {
      "name": "Transport_and_Mobility",
      "url": "http://www.surf.scss.tcd.ie/cityOntology/#Transport_and_Mobility"
    }
  ],
  "id": "1_route_configurator_x_8_bus_availability_request",
  "type": "composed"
}