{
  "outputs": [
    {
      "name": "_PURCHASEORDER",
      "type": "http://www.surf.scss.tcd.ie/IoTservices.owl#purchaseOrder",
      "desc": "Output of service shopping_order"
    }
  ],
  "expectedPlanLength": 2,
  "inputs": [
    {
      "name": "_PRODUCTDATA",
      "state": "used",
      "type": "http://www.surf.scss.tcd.ie/IoTservices.owl#productData",
      "desc": "Input of service buy_technology_products"
    }
  ],
  "domains": [
    {
      "name": "Technology",
      "url": "http://www.surf.scss.tcd.ie/cityOntology/#Technology"
    },
    {
      "name": "Payment_and_Delivery",
      "url": "http://www.surf.scss.tcd.ie/cityOntology/#Payment_and_Delivery"
    }
  ],
  "id": "131_buy_technology_products_x_134_shopping_order_request",
  "type": "composed"
}