{
  "outputs": [
    {
      "name": "_CALLTAXI",
      "domains": [
        {
          "name": "Transport_and_Mobility",
          "url": "http://www.surf.scss.tcd.ie/cityOntology/#Transport_and_Mobility"
        }
      ],
      "type": "http://www.surf.scss.tcd.ie/IoTservices.owl#callTaxi",
      "desc": "Output of service call_taxi"
    }
  ],
  "expectedPlanLength": 1,
  "inputs": [
    {
      "name": "_TAXILOCATION",
      "domains": [
        {
          "name": "Transport_and_Mobility",
          "url": "http://www.surf.scss.tcd.ie/cityOntology/#Transport_and_Mobility"
        }
      ],
      "type": "http://www.surf.scss.tcd.ie/IoTservices.owl#taxiLocation",
      "desc": "Input of service call_taxi"
    },
    {
      "name": "_TAXIAVAILABILITY",
      "domains": [
        {
          "name": "Transport_and_Mobility",
          "url": "http://www.surf.scss.tcd.ie/cityOntology/#Transport_and_Mobility"
        }
      ],
      "type": "http://www.surf.scss.tcd.ie/IoTservices.owl#taxiAvailability",
      "desc": "Input of service call_taxi"
    }
  ],
  "domains": [
    {
      "name": "Transport_and_Mobility",
      "url": "http://www.surf.scss.tcd.ie/cityOntology/#Transport_and_Mobility"
    }
  ],
  "id": "12_call_taxi_request",
  "type": "atomic"
}