{
   "domains": [
      {
         "name": "Entertainment_Products",
         "url": "http://www.surf.scss.tcd.ie/cityOntology/#Entertainment_Products"
      },
      {
         "name": "Entertainment_Products",
         "url": "http://www.surf.scss.tcd.ie/cityOntology/#Entertainment_Products"
      },
      {
         "name": "Entertainment_Products",
         "url": "http://www.surf.scss.tcd.ie/cityOntology/#Entertainment_Products"
      },
      {
         "name": "Entertainment_Products",
         "url": "http://www.surf.scss.tcd.ie/cityOntology/#Entertainment_Products"
      },
      {
         "name": "Entertainment_Products",
         "url": "http://www.surf.scss.tcd.ie/cityOntology/#Entertainment_Products"
      },
      {
         "name": "Entertainment_Products",
         "url": "http://www.surf.scss.tcd.ie/cityOntology/#Entertainment_Products"
      },
      {
         "name": "Entertainment_Products",
         "url": "http://www.surf.scss.tcd.ie/cityOntology/#Entertainment_Products"
      }
   ],
   "matchingType": 0,
   "jobId": "Author Novel RecommendedPrice Service-BookPriceTaxedPriceService-299",
   "feedbackThreshold": 0.5,
   "similarityThreshold": 0.5,
   "inputs": [
      {
         "name": "_AUTHOR",
         "type": "http://127.0.0.1/ontology/books.owl#Author",
         "desc": "Input of service Author Novel RecommendedPrice Service"
      }
   ],
   "outputs": [
      {
         "name": "_TAXEDPRICE",
         "type": "http://127.0.0.1/ontology/concept.owl#TaxedPrice",
         "desc": "Output of service BookPriceTaxedPriceService"
      },
      {
         "name": "_PRICE",
         "type": "http://127.0.0.1/ontology/concept.owl#Price",
         "desc": "Output of service BookPriceTaxedPriceService"
      }
   ]
}