{
   "outputs": [
      {
         "desc": "Output of service products_delivery",
         "name": "_PRODUCTSDELIVERYPLAN",
         "type": "http://www.surf.scss.tcd.ie/IoTservices.owl#productsDeliveryPlan"
      }
   ],
   "inputs": [
      {
         "desc": "Input of service pay_order",
         "name": "_PURCHASEORDER",
         "type": "http://www.surf.scss.tcd.ie/IoTservices.owl#purchaseOrder",
         "state": "used"
      }
   ],
   "id": "135_pay_order_x_136_products_delivery_request",
   "domains": [
      {
         "name": "Payment_and_Delivery",
         "url": "http://www.surf.scss.tcd.ie/cityOntology/#Payment_and_Delivery"
      }
   ],
   "tasks": [
      {
         "outputs": [
            {
               "desc": "Output of service products_delivery",
               "name": "_PRODUCTSDELIVERYPLAN",
               "type": "http://www.surf.scss.tcd.ie/IoTservices.owl#productsDeliveryPlan"
            }
         ],
         "name": "task-1",
         "inputs": [
            {
               "desc": "Input of service products_delivery",
               "name": "_PAYMENTINFO",
               "type": "http://www.surf.scss.tcd.ie/IoTservices.owl#paymentInfo"
            }
         ],
         "services": []
      },
      {
         "outputs": [
            {
               "desc": "Output of service pay_order",
               "name": "_PAYMENTINFO",
               "type": "http://www.surf.scss.tcd.ie/IoTservices.owl#paymentInfo"
            }
         ],
         "name": "task-2",
         "inputs": [
            {
               "desc": "Input of service pay_order",
               "name": "_PURCHASEORDER",
               "type": "http://www.surf.scss.tcd.ie/IoTservices.owl#purchaseOrder"
            }
         ],
         "services": []
      }
   ]
}