{
   "jobId": "ScienceFictionBook Author Price Service-Monograph Publisher Service-230",
   "inputs": [
      {
         "name": "_SCIENCEFICTIONBOOK",
         "desc": "Input of service ScienceFictionBook Author Price Service",
         "type": "http://127.0.0.1/ontology/books.owl#ScienceFictionBook"
      }
   ],
   "feedbackThreshold": 0.5,
   "domains": [
      {
         "name": "Entertainment_Products",
         "url": "http://www.surf.scss.tcd.ie/cityOntology/#Entertainment_Products"
      },
      {
         "name": "Entertainment_Products",
         "url": "http://www.surf.scss.tcd.ie/cityOntology/#Entertainment_Products"
      },
      {
         "name": "Entertainment_Products",
         "url": "http://www.surf.scss.tcd.ie/cityOntology/#Entertainment_Products"
      },
      {
         "name": "Entertainment_Products",
         "url": "http://www.surf.scss.tcd.ie/cityOntology/#Entertainment_Products"
      },
      {
         "name": "Entertainment_Products",
         "url": "http://www.surf.scss.tcd.ie/cityOntology/#Entertainment_Products"
      },
      {
         "name": "Entertainment_Products",
         "url": "http://www.surf.scss.tcd.ie/cityOntology/#Entertainment_Products"
      },
      {
         "name": "Entertainment_Products",
         "url": "http://www.surf.scss.tcd.ie/cityOntology/#Entertainment_Products"
      },
      {
         "name": "Entertainment_Products",
         "url": "http://www.surf.scss.tcd.ie/cityOntology/#Entertainment_Products"
      },
      {
         "name": "Entertainment_Products",
         "url": "http://www.surf.scss.tcd.ie/cityOntology/#Entertainment_Products"
      },
      {
         "name": "Entertainment_Products",
         "url": "http://www.surf.scss.tcd.ie/cityOntology/#Entertainment_Products"
      },
      {
         "name": "Entertainment_Products",
         "url": "http://www.surf.scss.tcd.ie/cityOntology/#Entertainment_Products"
      }
   ],
   "outputs": [
      {
         "name": "_PUBLISHER",
         "desc": "Output of service Monograph Publisher Service",
         "type": "http://127.0.0.1/ontology/books.owl#Publisher"
      }
   ],
   "matchingType": 0,
   "similarityThreshold": 0.5
}