{
  "outputs": [
    {
      "name": "_PRODUCTS",
      "domains": [
        {
          "name": "Clothing",
          "url": "http://www.surf.scss.tcd.ie/cityOntology/#Clothing"
        }
      ],
      "type": "http://www.surf.scss.tcd.ie/IoTservices.owl#products",
      "desc": "Output of service clothes_selection"
    }
  ],
  "expectedPlanLength": 1,
  "inputs": [
    {
      "name": "_PRESENTOFFERS",
      "domains": [
        {
          "name": "Clothing",
          "url": "http://www.surf.scss.tcd.ie/cityOntology/#Clothing"
        }
      ],
      "type": "http://www.surf.scss.tcd.ie/IoTservices.owl#presentOffers",
      "desc": "Input of service clothes_selection"
    }
  ],
  "domains": [
    {
      "name": "Clothing",
      "url": "http://www.surf.scss.tcd.ie/cityOntology/#Clothing"
    }
  ],
  "id": "70_clothes_selection_request",
  "type": "atomic"
}