{
   "tasks": [
      {
         "services": [],
         "name": "task-1",
         "inputs": [
            {
               "name": "_TITLE",
               "desc": "Input of service Comedy Film finder service",
               "type": "http://127.0.0.1/ontology/books.owl#Title"
            }
         ],
         "outputs": [
            {
               "name": "_COMEDYFILM",
               "desc": "Output of service Comedy Film finder service",
               "type": "http://127.0.0.1/ontology/my_ontology.owl#ComedyFilm"
            }
         ]
      }
   ],
   "id": "Comedy Film finder service_request",
   "domains": [
      {
         "name": "Communications",
         "url": "http://www.surf.scss.tcd.ie/cityOntology/#Communications"
      }
   ]
}