{
   "id": "43_hazardous_gases_detection_request",
   "domains": [
      {
         "name": "Safety_and_Emergencies",
         "url": "http://www.surf.scss.tcd.ie/cityOntology/#Safety_and_Emergencies"
      },
      {
         "name": "Construction",
         "url": "http://www.surf.scss.tcd.ie/cityOntology/#Construction"
      },
      {
         "name": "Buildings",
         "url": "http://www.surf.scss.tcd.ie/cityOntology/#Buildings"
      }
   ],
   "tasks": [
      {
         "outputs": [
            {
               "desc": "Output of service hazardous_gases_detection",
               "name": "_GASDETECTION",
               "type": "http://www.surf.scss.tcd.ie/IoTservices.owl#gasDetection"
            }
         ],
         "name": "task-1",
         "inputs": [
            {
               "desc": "Input of service hazardous_gases_detection",
               "name": "_CONSTRUCTIONSTATUS",
               "type": "http://www.surf.scss.tcd.ie/IoTservices.owl#constructionStatus"
            }
         ],
         "services": []
      }
   ]
}