{
   "inputs": [
      {
         "desc": "Input of service Postal Codes of Places Finder Service",
         "type": "http://127.0.0.1/ontology/geographydataset.owl#Code",
         "name": "_LICENSEKEY"
      },
      {
         "desc": "Input of service Postal Codes of Places Finder Service",
         "type": "http://127.0.0.1/ontology/geographydataset.owl#PostalCode",
         "name": "_POSTALCODE"
      },
      {
         "desc": "Input of service Postal Codes of Places Finder Service",
         "type": "http://127.0.0.1/ontology/protonu.owl#PopulatedPlace",
         "name": "_PLACENAME"
      }
   ],
   "feedbackThreshold": 0.5,
   "outputs": [
      {
         "desc": "Output of service Postal Codes of Places Finder Service",
         "type": "http://127.0.0.1/ontology/protont.owl#longitude",
         "name": "_LONGITUDE"
      },
      {
         "desc": "Output of service Postal Codes of Places Finder Service",
         "type": "http://127.0.0.1/ontology/protont.owl#latitude",
         "name": "_LATITUDE"
      },
      {
         "desc": "Output of service Postal Codes of Places Finder Service",
         "type": "http://127.0.0.1/ontology/geographydataset.owl#PostalCode",
         "name": "_POSTALCODE_OUT"
      },
      {
         "desc": "Output of service Postal Codes of Places Finder Service",
         "type": "http://127.0.0.1/ontology/protonu.owl#PopulatedPlace",
         "name": "_PLACENAME_OUT"
      },
      {
         "desc": "Output of service Postal Codes of Places Finder Service",
         "type": "http://127.0.0.1/ontology/geographydataset.owl#ISOCountryCode",
         "name": "_COUNTRYCODE_OUT"
      }
   ],
   "matchingType": 0,
   "similarityThreshold": 0.5,
   "jobId": "Postal Codes of Places Finder Service-Postal Codes of Places Finder Service-315",
   "domains": [
      {
         "url": "http://www.surf.scss.tcd.ie/cityOntology/#Geography",
         "name": "Geography"
      },
      {
         "url": "http://www.surf.scss.tcd.ie/cityOntology/#Geography",
         "name": "Geography"
      }
   ]
}