{
  "outputs": [
    {
      "name": "_UPDATEDROOMCALENDAR",
      "domains": [
        {
          "name": "Educational",
          "url": "http://www.surf.scss.tcd.ie/cityOntology/#Educational"
        }
      ],
      "type": "http://www.surf.scss.tcd.ie/IoTservices.owl#updatedRoomCalendar",
      "desc": "Output of service update_room_calendar"
    }
  ],
  "inputs": [
    {
      "name": "_ROOMPARAMETERS",
      "domains": [
        {
          "name": "Educational",
          "url": "http://www.surf.scss.tcd.ie/cityOntology/#Educational"
        }
      ],
      "state": "notUsed",
      "type": "http://www.surf.scss.tcd.ie/IoTservices.owl#roomParameters",
      "desc": "Input of service search_campus_room"
    }
  ],
  "domains": [
    {
      "name": "Educational",
      "url": "http://www.surf.scss.tcd.ie/cityOntology/#Educational"
    }
  ],
  "id": "search_campus_room_x_update_room_calendar"
}