{
   "outputs": [
      {
         "desc": "Output of service present_monument_content",
         "name": "_MONUMENTINFO",
         "type": "http://www.surf.scss.tcd.ie/IoTservices.owl#monumentInfo"
      }
   ],
   "inputs": [
      {
         "desc": "Input of service surrounding_historic_places",
         "name": "_USERLOCATION",
         "type": "http://www.surf.scss.tcd.ie/IoTservices.owl#userLocation",
         "state": "used"
      }
   ],
   "id": "79_surrounding_historic_places_x_81_present_monument_content_request",
   "domains": [
      {
         "name": "Touristic_Place",
         "url": "http://www.surf.scss.tcd.ie/cityOntology/#Touristic_Place"
      },
      {
         "name": "History",
         "url": "http://www.surf.scss.tcd.ie/cityOntology/#History"
      }
   ],
   "tasks": [
      {
         "outputs": [
            {
               "desc": "Output of service present_monument_content",
               "name": "_MONUMENTINFO",
               "type": "http://www.surf.scss.tcd.ie/IoTservices.owl#monumentInfo"
            }
         ],
         "name": "task-1",
         "inputs": [
            {
               "desc": "Input of service present_monument_content",
               "name": "_HISTORICCONTENT",
               "type": "http://www.surf.scss.tcd.ie/IoTservices.owl#historicContent"
            }
         ],
         "services": []
      },
      {
         "outputs": [
            {
               "desc": "Output of service search_historic_content",
               "name": "_HISTORICCONTENT",
               "type": "http://www.surf.scss.tcd.ie/IoTservices.owl#historicContent"
            }
         ],
         "name": "task-2",
         "inputs": [
            {
               "desc": "Input of service search_historic_content",
               "name": "_HISTORICPLACEINFO",
               "type": "http://www.surf.scss.tcd.ie/IoTservices.owl#historicPlaceInfo"
            }
         ],
         "services": []
      },
      {
         "outputs": [
            {
               "desc": "Output of service surrounding_historic_places",
               "name": "_HISTORICPLACEINFO",
               "type": "http://www.surf.scss.tcd.ie/IoTservices.owl#historicPlaceInfo"
            }
         ],
         "name": "task-3",
         "inputs": [
            {
               "desc": "Input of service surrounding_historic_places",
               "name": "_USERLOCATION",
               "type": "http://www.surf.scss.tcd.ie/IoTservices.owl#userLocation"
            }
         ],
         "services": []
      }
   ]
}