{
  "outputs": [
    {
      "name": "_SELECTEDACCOMMODATION",
      "domains": [
        {
          "name": "Accommodation",
          "url": "http://www.surf.scss.tcd.ie/cityOntology/#Accommodation"
        }
      ],
      "type": "http://www.surf.scss.tcd.ie/IoTservices.owl#selectedAccommodation",
      "desc": "Output of service accommodation_selection"
    }
  ],
  "expectedPlanLength": 1,
  "inputs": [
    {
      "name": "_ACCOMMODATIONLIST",
      "domains": [
        {
          "name": "Accommodation",
          "url": "http://www.surf.scss.tcd.ie/cityOntology/#Accommodation"
        }
      ],
      "type": "http://www.surf.scss.tcd.ie/IoTservices.owl#accommodationList",
      "desc": "Input of service accommodation_selection"
    }
  ],
  "domains": [
    {
      "name": "Accommodation",
      "url": "http://www.surf.scss.tcd.ie/cityOntology/#Accommodation"
    }
  ],
  "id": "83_accommodation_selection_request",
  "type": "atomic"
}