{
  "outputs": [
    {
      "name": "_BOOKNOTIFICATION",
      "type": "http://www.surf.scss.tcd.ie/IoTservices.owl#bookNotification",
      "desc": "Output of service notify_booking"
    }
  ],
  "expectedPlanLength": 4,
  "inputs": [
    {
      "name": "_SELECTEDACCOMMODATION",
      "state": "used",
      "type": "http://www.surf.scss.tcd.ie/IoTservices.owl#selectedAccommodation",
      "desc": "Input of service activate_room_camera"
    }
  ],
  "domains": [
    {
      "name": "Accommodation",
      "url": "http://www.surf.scss.tcd.ie/cityOntology/#Accommodation"
    }
  ],
  "id": "84_activate_room_camera_x_87_notify_booking_request",
  "type": "composed"
}