{
   "similarityThreshold": 0.5,
   "jobId": "WStoreFoodService-AvailablePreparedFoodService-274",
   "outputs": [
      {
         "type": "http://127.0.0.1/ontology/Mid-level-ontology.owl#PreparedFood",
         "name": "_PREPAREDFOOD",
         "desc": "Output of service AvailablePreparedFoodService"
      },
      {
         "type": "http://127.0.0.1/ontology/support.owl#Quantity",
         "name": "_QUANTITY",
         "desc": "Output of service AvailablePreparedFoodService"
      }
   ],
   "domains": [
      {
         "url": "http://www.surf.scss.tcd.ie/cityOntology/#Food_and_Drinks",
         "name": "Food_and_Drinks"
      },
      {
         "url": "http://www.surf.scss.tcd.ie/cityOntology/#Food_and_Drinks",
         "name": "Food_and_Drinks"
      },
      {
         "url": "http://www.surf.scss.tcd.ie/cityOntology/#Food_and_Drinks",
         "name": "Food_and_Drinks"
      }
   ],
   "matchingType": 0,
   "feedbackThreshold": 0.5,
   "inputs": [
      {
         "name": "_WHOLESALESTORE",
         "type": "http://127.0.0.1/ontology/Mid-level-ontology.owl#WholesaleStore",
         "desc": "Input of service WStoreFoodService"
      }
   ]
}