{
  "outputs": [
    {
      "name": "_CARAPPOINTMENT",
      "type": "http://www.surf.scss.tcd.ie/IoTservices.owl#carAppointment",
      "desc": "Output of service program_car_appointment"
    }
  ],
  "expectedPlanLength": 1,
  "inputs": [
    {
      "name": "_CARPROBLEMS",
      "type": "http://www.surf.scss.tcd.ie/IoTservices.owl#carProblems",
      "desc": "Input of service program_car_appointment"
    }
  ],
  "domains": [
    {
      "name": "Transport_and_Mobility",
      "url": "http://www.surf.scss.tcd.ie/cityOntology/#Transport_and_Mobility"
    }
  ],
  "id": "16_program_car_appointment_request",
  "type": "atomic"
}