{
   "id": "70_clothes_selection_request",
   "domains": [
      {
         "name": "Clothing",
         "url": "http://www.surf.scss.tcd.ie/cityOntology/#Clothing"
      }
   ],
   "tasks": [
      {
         "outputs": [
            {
               "desc": "Output of service clothes_selection",
               "name": "_PRODUCTS",
               "type": "http://www.surf.scss.tcd.ie/IoTservices.owl#products"
            }
         ],
         "name": "task-1",
         "inputs": [
            {
               "desc": "Input of service clothes_selection",
               "name": "_PRESENTOFFERS",
               "type": "http://www.surf.scss.tcd.ie/IoTservices.owl#presentOffers"
            }
         ],
         "services": []
      }
   ]
}