{
   "outputs": [
      {
         "desc": "Output of service camera_room_activation",
         "name": "_DISPLAYVIDEO",
         "type": "http://www.surf.scss.tcd.ie/IoTservices.owl#displayVideo"
      }
   ],
   "inputs": [
      {
         "desc": "Input of service search_campus_room",
         "name": "_ROOMPARAMETERS",
         "type": "http://www.surf.scss.tcd.ie/IoTservices.owl#roomParameters",
         "state": "used"
      }
   ],
   "id": "63_search_campus_room_x_65_camera_room_activation_request",
   "domains": [
      {
         "name": "Educational",
         "url": "http://www.surf.scss.tcd.ie/cityOntology/#Educational"
      }
   ],
   "tasks": [
      {
         "outputs": [
            {
               "desc": "Output of service camera_room_activation",
               "name": "_DISPLAYVIDEO",
               "type": "http://www.surf.scss.tcd.ie/IoTservices.owl#displayVideo"
            }
         ],
         "name": "task-1",
         "inputs": [
            {
               "desc": "Input of service camera_room_activation",
               "name": "_ROOMINFO",
               "type": "http://www.surf.scss.tcd.ie/IoTservices.owl#roomInfo"
            }
         ],
         "services": []
      },
      {
         "outputs": [
            {
               "desc": "Output of service search_campus_room",
               "name": "_ROOMINFO",
               "type": "http://www.surf.scss.tcd.ie/IoTservices.owl#roomInfo"
            }
         ],
         "name": "task-2",
         "inputs": [
            {
               "desc": "Input of service search_campus_room",
               "name": "_ROOMPARAMETERS",
               "type": "http://www.surf.scss.tcd.ie/IoTservices.owl#roomParameters"
            }
         ],
         "services": []
      }
   ]
}