{
  "outputs": [
    {
      "name": "_ROOMVIDEO",
      "domains": [
        {
          "name": "Accommodation",
          "url": "http://www.surf.scss.tcd.ie/cityOntology/#Accommodation"
        }
      ],
      "type": "http://www.surf.scss.tcd.ie/IoTservices.owl#roomVideo",
      "desc": "Output of service activate_room_camera"
    }
  ],
  "inputs": [
    {
      "name": "_ACCOMMODATIONLIST",
      "domains": [
        {
          "name": "Accommodation",
          "url": "http://www.surf.scss.tcd.ie/cityOntology/#Accommodation"
        }
      ],
      "state": "used",
      "type": "http://www.surf.scss.tcd.ie/IoTservices.owl#accommodationList",
      "desc": "Input of service accommodation_selection"
    }
  ],
  "domains": [
    {
      "name": "Accommodation",
      "url": "http://www.surf.scss.tcd.ie/cityOntology/#Accommodation"
    }
  ],
  "id": "accommodation_selection_x_activate_room_camera"
}