{
   "outputs": [
      {
         "desc": "Output of service present_touristic_plan",
         "name": "_TOURISTICPLAN",
         "type": "http://www.surf.scss.tcd.ie/IoTservices.owl#touristicPlan"
      }
   ],
   "inputs": [
      {
         "desc": "Input of service touristic_path_calculator",
         "name": "_ACTIVITYINFO",
         "type": "http://www.surf.scss.tcd.ie/IoTservices.owl#activityInfo",
         "state": "used"
      }
   ],
   "id": "75_touristic_path_calculator_x_78_present_touristic_plan_request",
   "domains": [
      {
         "name": "Activity",
         "url": "http://www.surf.scss.tcd.ie/cityOntology/#Activity"
      },
      {
         "name": "Travel",
         "url": "http://www.surf.scss.tcd.ie/cityOntology/#Travel"
      },
      {
         "name": "Geography",
         "url": "http://www.surf.scss.tcd.ie/cityOntology/#Geography"
      }
   ],
   "tasks": [
      {
         "outputs": [
            {
               "desc": "Output of service present_touristic_plan",
               "name": "_TOURISTICPLAN",
               "type": "http://www.surf.scss.tcd.ie/IoTservices.owl#touristicPlan"
            }
         ],
         "name": "task-1",
         "inputs": [
            {
               "desc": "Input of service present_touristic_plan",
               "name": "_TOURISTICPATH",
               "type": "http://www.surf.scss.tcd.ie/IoTservices.owl#touristicPath"
            },
            {
               "desc": "Input of service present_touristic_plan",
               "name": "_SUGGESTEDACTIVITIES",
               "type": "http://www.surf.scss.tcd.ie/IoTservices.owl#suggestedActivities"
            },
            {
               "desc": "Input of service present_touristic_plan",
               "name": "_RELATEDCONTENT",
               "type": "http://www.surf.scss.tcd.ie/IoTservices.owl#relatedContent"
            }
         ],
         "services": []
      },
      {
         "outputs": [
            {
               "desc": "Output of service recommended_activities",
               "name": "_SUGGESTEDACTIVITIES",
               "type": "http://www.surf.scss.tcd.ie/IoTservices.owl#suggestedActivities"
            }
         ],
         "name": "task-2",
         "inputs": [
            {
               "desc": "Input of service recommended_activities",
               "name": "_ACTIVITYINFO",
               "type": "http://www.surf.scss.tcd.ie/IoTservices.owl#activityInfo"
            }
         ],
         "services": []
      },
      {
         "outputs": [
            {
               "desc": "Output of service touristic_path_calculator",
               "name": "_TOURISTICPATH",
               "type": "http://www.surf.scss.tcd.ie/IoTservices.owl#touristicPath"
            }
         ],
         "name": "task-3",
         "inputs": [
            {
               "desc": "Input of service touristic_path_calculator",
               "name": "_ACTIVITYINFO",
               "type": "http://www.surf.scss.tcd.ie/IoTservices.owl#activityInfo"
            }
         ],
         "services": []
      },
      {
         "outputs": [
            {
               "desc": "Output of service related_content",
               "name": "_RELATEDCONTENT",
               "type": "http://www.surf.scss.tcd.ie/IoTservices.owl#relatedContent"
            }
         ],
         "name": "task-4",
         "inputs": [
            {
               "desc": "Input of service related_content",
               "name": "_ACTIVITYINFO",
               "type": "http://www.surf.scss.tcd.ie/IoTservices.owl#activityInfo"
            }
         ],
         "services": []
      }
   ]
}