{
   "id": "127_streets_waterLevel_request",
   "domains": [
      {
         "name": "Government_and_Planning",
         "url": "http://www.surf.scss.tcd.ie/cityOntology/#Government_and_Planning"
      },
      {
         "name": "Nature",
         "url": "http://www.surf.scss.tcd.ie/cityOntology/#Nature"
      }
   ],
   "tasks": [
      {
         "outputs": [
            {
               "desc": "Output of service streets_waterLevel",
               "name": "_STREETSWATERLEVEL",
               "type": "http://www.surf.scss.tcd.ie/IoTservices.owl#streetsWaterLevel"
            }
         ],
         "name": "task-1",
         "inputs": [
            {
               "desc": "Input of service streets_waterLevel",
               "name": "_STREETSINFO",
               "type": "http://www.surf.scss.tcd.ie/IoTservices.owl#streetsInfo"
            }
         ],
         "services": []
      }
   ]
}