{
   "similarityThreshold": 0.5,
   "outputs": [
      {
         "name": "_GROCERYSTORE",
         "type": "http://127.0.0.1/ontology/Mid-level-ontology.owl#GroceryStore",
         "desc": "Output of service GroceryStoreRecommendedPrice"
      },
      {
         "name": "_RECOMMENDEDPRICE",
         "type": "http://127.0.0.1/ontology/concept.owl#RecommendedPrice",
         "desc": "Output of service GroceryStoreRecommendedPrice"
      }
   ],
   "feedbackThreshold": 0.5,
   "matchingType": 0,
   "domains": [
      {
         "name": "Food_and_Drinks",
         "url": "http://www.surf.scss.tcd.ie/cityOntology/#Food_and_Drinks"
      },
      {
         "name": "Food_and_Drinks",
         "url": "http://www.surf.scss.tcd.ie/cityOntology/#Food_and_Drinks"
      }
   ],
   "jobId": "RetailStoreFoodService-GroceryStoreRecommendedPrice-444",
   "inputs": [
      {
         "name": "_RETAILSTORE",
         "type": "http://127.0.0.1/ontology/Mid-level-ontology.owl#RetailStore",
         "desc": "Input of service RetailStoreFoodService"
      }
   ]
}