{
  "outputs": [
    {
      "name": "_PARKINGINFO",
      "type": "http://www.surf.scss.tcd.ie/IoTservices.owl#parkingInfo",
      "desc": "Output of service near_parking_space"
    }
  ],
  "expectedPlanLength": 1,
  "inputs": [
    {
      "name": "_LOCATION",
      "type": "http://www.surf.scss.tcd.ie/IoTservices.owl#location",
      "desc": "Input of service near_parking_space"
    }
  ],
  "domains": [
    {
      "name": "Transport_and_Mobility",
      "url": "http://www.surf.scss.tcd.ie/cityOntology/#Transport_and_Mobility"
    }
  ],
  "id": "103_near_parking_space_request",
  "type": "atomic"
}