{
  "outputs": [
    {
      "name": "_PATROLDASHBOARD",
      "type": "http://www.surf.scss.tcd.ie/IoTservices.owl#patrolDashboard",
      "desc": "Output of service patrol_dashboard"
    }
  ],
  "expectedPlanLength": 8,
  "inputs": [
    {
      "name": "_STREETSURVEILLANCEPARAMETERS",
      "state": "notUsed",
      "type": "http://www.surf.scss.tcd.ie/IoTservices.owl#streetSurveillanceParameters",
      "desc": "Input of service street_surveillance_configurator"
    }
  ],
  "domains": [
    {
      "name": "Safety_and_Emergencies",
      "url": "http://www.surf.scss.tcd.ie/cityOntology/#Safety_and_Emergencies"
    }
  ],
  "id": "21_street_surveillance_configurator_x_28_patrol_dashboard_request",
  "type": "composed"
}