{
  "outputs": [
    {
      "name": "_PLACE",
      "type": "http://www.surf.scss.tcd.ie/IoTservices.owl#place",
      "desc": "Output of service street_anomaly_detection"
    }
  ],
  "expectedPlanLength": 1,
  "inputs": [
    {
      "name": "_GUNSHOTALERT",
      "type": "http://www.surf.scss.tcd.ie/IoTservices.owl#gunshotAlert",
      "desc": "Input of service street_anomaly_detection"
    },
    {
      "name": "_ZONEINTRUSIONALERT",
      "type": "http://www.surf.scss.tcd.ie/IoTservices.owl#zoneIntrusionAlert",
      "desc": "Input of service street_anomaly_detection"
    },
    {
      "name": "_REPORT",
      "type": "http://www.surf.scss.tcd.ie/IoTservices.owl#report",
      "desc": "Input of service street_anomaly_detection"
    }
  ],
  "domains": [
    {
      "name": "Safety_and_Emergencies",
      "url": "http://www.surf.scss.tcd.ie/cityOntology/#Safety_and_Emergencies"
    }
  ],
  "id": "25_street_anomaly_detection_request",
  "type": "atomic"
}