{
   "id": "25_street_anomaly_detection_request",
   "domains": [
      {
         "name": "Safety_and_Emergencies",
         "url": "http://www.surf.scss.tcd.ie/cityOntology/#Safety_and_Emergencies"
      }
   ],
   "tasks": [
      {
         "outputs": [
            {
               "desc": "Output of service street_anomaly_detection",
               "name": "_PLACE",
               "type": "http://www.surf.scss.tcd.ie/IoTservices.owl#place"
            }
         ],
         "name": "task-1",
         "inputs": [
            {
               "desc": "Input of service street_anomaly_detection",
               "name": "_GUNSHOTALERT",
               "type": "http://www.surf.scss.tcd.ie/IoTservices.owl#gunshotAlert"
            },
            {
               "desc": "Input of service street_anomaly_detection",
               "name": "_ZONEINTRUSIONALERT",
               "type": "http://www.surf.scss.tcd.ie/IoTservices.owl#zoneIntrusionAlert"
            },
            {
               "desc": "Input of service street_anomaly_detection",
               "name": "_REPORT",
               "type": "http://www.surf.scss.tcd.ie/IoTservices.owl#report"
            }
         ],
         "services": []
      }
   ]
}