{
   "outputs": [
      {
         "desc": "Output of service attendance_control",
         "name": "_ATTENDANCEINFO",
         "type": "http://www.surf.scss.tcd.ie/IoTservices.owl#attendanceInfo"
      }
   ],
   "inputs": [
      {
         "desc": "Input of service student_monitoring_configurator",
         "name": "_COURSEINFO",
         "type": "http://www.surf.scss.tcd.ie/IoTservices.owl#courseInfo",
         "state": "used"
      }
   ],
   "id": "51_student_monitoring_configurator_x_52_attendance_control_request",
   "domains": [
      {
         "name": "Educational",
         "url": "http://www.surf.scss.tcd.ie/cityOntology/#Educational"
      }
   ],
   "tasks": [
      {
         "outputs": [
            {
               "desc": "Output of service attendance_control",
               "name": "_ATTENDANCEINFO",
               "type": "http://www.surf.scss.tcd.ie/IoTservices.owl#attendanceInfo"
            }
         ],
         "name": "task-1",
         "inputs": [
            {
               "desc": "Input of service attendance_control",
               "name": "_STUDENTSINFO",
               "type": "http://www.surf.scss.tcd.ie/IoTservices.owl#studentsInfo"
            }
         ],
         "services": []
      },
      {
         "outputs": [
            {
               "desc": "Output of service student_monitoring_configurator",
               "name": "_STUDENTSINFO",
               "type": "http://www.surf.scss.tcd.ie/IoTservices.owl#studentsInfo"
            }
         ],
         "name": "task-2",
         "inputs": [
            {
               "desc": "Input of service student_monitoring_configurator",
               "name": "_COURSEINFO",
               "type": "http://www.surf.scss.tcd.ie/IoTservices.owl#courseInfo"
            }
         ],
         "services": []
      }
   ]
}