{
   "outputs": [
      {
         "desc": "Output of service course_content_delivery",
         "name": "_STUDENTCONTENT",
         "type": "http://www.surf.scss.tcd.ie/IoTservices.owl#studentContent"
      }
   ],
   "inputs": [
      {
         "desc": "Input of service course_configuration",
         "name": "_COURSEPARAMETERS",
         "type": "http://www.surf.scss.tcd.ie/IoTservices.owl#courseParameters",
         "state": "used"
      }
   ],
   "id": "46_course_configuration_x_50_course_content_delivery_request",
   "domains": [
      {
         "name": "Educational",
         "url": "http://www.surf.scss.tcd.ie/cityOntology/#Educational"
      }
   ],
   "tasks": [
      {
         "outputs": [
            {
               "desc": "Output of service course_content_delivery",
               "name": "_STUDENTCONTENT",
               "type": "http://www.surf.scss.tcd.ie/IoTservices.owl#studentContent"
            }
         ],
         "name": "task-1",
         "inputs": [
            {
               "desc": "Input of service course_content_delivery",
               "name": "_STUDYPLAN",
               "type": "http://www.surf.scss.tcd.ie/IoTservices.owl#studyPlan"
            }
         ],
         "services": []
      },
      {
         "outputs": [
            {
               "desc": "Output of service personalised_study_plan",
               "name": "_STUDYPLAN",
               "type": "http://www.surf.scss.tcd.ie/IoTservices.owl#studyPlan"
            }
         ],
         "name": "task-2",
         "inputs": [
            {
               "desc": "Input of service personalised_study_plan",
               "name": "_COURSECONTENT",
               "type": "http://www.surf.scss.tcd.ie/IoTservices.owl#courseContent"
            }
         ],
         "services": []
      },
      {
         "outputs": [
            {
               "desc": "Output of service learning_object_search",
               "name": "_COURSECONTENT",
               "type": "http://www.surf.scss.tcd.ie/IoTservices.owl#courseContent"
            }
         ],
         "name": "task-3",
         "inputs": [
            {
               "desc": "Input of service learning_object_search",
               "name": "_SUBJECTSLIST",
               "type": "http://www.surf.scss.tcd.ie/IoTservices.owl#subjectsList"
            }
         ],
         "services": []
      },
      {
         "outputs": [
            {
               "desc": "Output of service progress_monitoring_service",
               "name": "_SUBJECTSLIST",
               "type": "http://www.surf.scss.tcd.ie/IoTservices.owl#subjectsList"
            }
         ],
         "name": "task-4",
         "inputs": [
            {
               "desc": "Input of service progress_monitoring_service",
               "name": "_COURSESTRUCTURE",
               "type": "http://www.surf.scss.tcd.ie/IoTservices.owl#courseStructure"
            }
         ],
         "services": []
      },
      {
         "outputs": [
            {
               "desc": "Output of service course_configuration",
               "name": "_COURSESTRUCTURE",
               "type": "http://www.surf.scss.tcd.ie/IoTservices.owl#courseStructure"
            }
         ],
         "name": "task-5",
         "inputs": [
            {
               "desc": "Input of service course_configuration",
               "name": "_COURSEPARAMETERS",
               "type": "http://www.surf.scss.tcd.ie/IoTservices.owl#courseParameters"
            }
         ],
         "services": []
      }
   ]
}