java -jar ./experiments-automation-learning.jar adaptive 1 /home/users/cabrerac/ 100 1 5 1 30000m /adaptive-summary/summary_1.xlsx 4 1 0 1 0.01 24 13300 0 network_24_0.01_7_3 0 > ./logs/adaptive/adaptive_1_4_5.out
java -jar ./experiments-automation-learning.jar adaptive 2 /home/users/cabrerac/ 100 1 5 1 30000m /adaptive-summary/summary_2.xlsx 4 1 0 1 0.01 24 13300 0 network_24_0.01_7_3 0 > ./logs/adaptive/adaptive_2_4_5.out
java -jar ./experiments-automation-learning.jar adaptive 3 /home/users/cabrerac/ 100 1 5 1 30000m /adaptive-summary/summary_3.xlsx 4 1 0 1 0.01 24 13300 0 network_24_0.01_7_3 0 > ./logs/adaptive/adaptive_3_4_5.out

