*** Experiment approach MAXFIT :: scenario 3 :: servers 100 :: functions 1 ***
Setting paremeters...
*** Initiating Cloud Server ***
*** Setting up Edge Network ***
*** Initiating Generic Users ***
*** Initiating Opera Users ***
*** Initiating Ambulance Users ***
*** Filling Latencies ***
*** Starting Requests Generic Users ***
 Number of requests: 100
 Number of requests: 200
 Number of requests: 300
 Number of requests: 400
 Number of requests: 500
*** Opera Users Traveling to Opera House ***
 Number of requests: 600
 Number of requests: 700
 Number of requests: 800
 Number of requests: 900
 Number of requests: 1000
*** Ambulances Users Traveling to Accident Place ***
 Number of requests: 1100
 Number of requests: 1200
 Number of requests: 1300
 Number of requests: 1400
 Number of requests: 1500
 Number of requests: 1600
*** Ambulance Users Stopping ***
 Number of requests: 1700
*** Opera Users Stopping ***
 Number of requests: 1800
 Number of requests: 1900
 Number of requests: 2000
*** Generic Users Stopping ***
*** Cloud Server Stopping ***
*** Printing Results ***
File written: approach_maxfit_scenario_3_edge_servers_100_mec_systems_5_functions_1_prediction_NONE.csv
*** Requests = 2074 ***
*** Queue Max Length = 2 ***
*** Experiment finished ***
*** Experiment approach MAXFIT :: scenario 3 :: servers 100 :: functions 2 ***
Setting paremeters...
*** Initiating Cloud Server ***
*** Setting up Edge Network ***
*** Initiating Generic Users ***
*** Initiating Opera Users ***
*** Initiating Ambulance Users ***
*** Filling Latencies ***
*** Starting Requests Generic Users ***
 Number of requests: 100
 Number of requests: 200
 Number of requests: 300
 Number of requests: 400
 Number of requests: 500
*** Opera Users Traveling to Opera House ***
 Number of requests: 600
 Number of requests: 700
*** Ambulances Users Traveling to Accident Place ***
 Number of requests: 800
 Number of requests: 900
 Number of requests: 1000
*** Ambulance Users Stopping ***
*** Opera Users Stopping ***
 Number of requests: 1100
 Number of requests: 1200
*** Generic Users Stopping ***
*** Cloud Server Stopping ***
*** Printing Results ***
File written: approach_maxfit_scenario_3_edge_servers_100_mec_systems_5_functions_2_prediction_NONE.csv
*** Requests = 1271 ***
*** Queue Max Length = 3 ***
*** Experiment finished ***
*** Experiment approach MAXFIT :: scenario 3 :: servers 100 :: functions 3 ***
Setting paremeters...
*** Initiating Cloud Server ***
*** Setting up Edge Network ***
*** Initiating Generic Users ***
*** Initiating Opera Users ***
*** Initiating Ambulance Users ***
*** Filling Latencies ***
*** Starting Requests Generic Users ***
 Number of requests: 100
 Number of requests: 200
 Number of requests: 300
 Number of requests: 400
 Number of requests: 500
*** Opera Users Traveling to Opera House ***
 Number of requests: 600
 Number of requests: 700
 Number of requests: 800
*** Ambulances Users Traveling to Accident Place ***
 Number of requests: 900
 Number of requests: 1000
 Number of requests: 1100
 Number of requests: 1200
*** Ambulance Users Stopping ***
*** Opera Users Stopping ***
 Number of requests: 1300
 Number of requests: 1400
*** Generic Users Stopping ***
*** Cloud Server Stopping ***
*** Printing Results ***
File written: approach_maxfit_scenario_3_edge_servers_100_mec_systems_5_functions_3_prediction_NONE.csv
*** Requests = 1467 ***
*** Queue Max Length = 2 ***
*** Experiment finished ***
*** Experiment approach MAXFIT :: scenario 3 :: servers 100 :: functions 4 ***
Setting paremeters...
*** Initiating Cloud Server ***
*** Setting up Edge Network ***
*** Initiating Generic Users ***
*** Initiating Opera Users ***
*** Initiating Ambulance Users ***
*** Filling Latencies ***
*** Starting Requests Generic Users ***
 Number of requests: 100
 Number of requests: 200
 Number of requests: 300
 Number of requests: 400
 Number of requests: 500
*** Opera Users Traveling to Opera House ***
 Number of requests: 600
 Number of requests: 700
*** Ambulances Users Traveling to Accident Place ***
 Number of requests: 800
 Number of requests: 900
*** Ambulance Users Stopping ***
*** Opera Users Stopping ***
 Number of requests: 1000
*** Generic Users Stopping ***
 Number of requests: 1100
*** Cloud Server Stopping ***
*** Printing Results ***
File written: approach_maxfit_scenario_3_edge_servers_100_mec_systems_5_functions_4_prediction_NONE.csv
*** Requests = 1121 ***
*** Queue Max Length = 2 ***
*** Experiment finished ***
*** Experiment approach MAXFIT :: scenario 3 :: servers 100 :: functions 5 ***
Setting paremeters...
*** Initiating Cloud Server ***
*** Setting up Edge Network ***
*** Initiating Generic Users ***
*** Initiating Opera Users ***
*** Initiating Ambulance Users ***
*** Filling Latencies ***
*** Starting Requests Generic Users ***
 Number of requests: 100
 Number of requests: 200
 Number of requests: 300
 Number of requests: 400
*** Opera Users Traveling to Opera House ***
 Number of requests: 500
 Number of requests: 600
*** Ambulances Users Traveling to Accident Place ***
 Number of requests: 700
 Number of requests: 800
*** Ambulance Users Stopping ***
 Number of requests: 900
*** Opera Users Stopping ***
 Number of requests: 1000
*** Generic Users Stopping ***
 Number of requests: 1100
*** Cloud Server Stopping ***
*** Printing Results ***
File written: approach_maxfit_scenario_3_edge_servers_100_mec_systems_5_functions_5_prediction_NONE.csv
*** Requests = 1116 ***
*** Queue Max Length = 2 ***
*** Experiment finished ***
