java -jar ./experiments-automation-forwarding.jar urban 1 /home/users/cabrerac/ 100 1 5 1 2500m 1 10 0 1 500 1 > ./logs/urban/1.out
java -jar ./experiments-automation-forwarding.jar urban 2 /home/users/cabrerac/ 100 1 5 1 2500m 1 10 0 1 500 1 > ./logs/urban/2.out
java -jar ./experiments-automation-forwarding.jar urban 3 /home/users/cabrerac/ 100 1 5 1 2500m 1 10 0 1 500 1 > ./logs/urban/3.out

