*** Experiment approach MAACO :: scenario 1 :: servers 500 :: functions 1 :: iterations 100 :: ants 10 :: prediction HMM ***
Setting paremeters...
*** Initiating Cloud Server ***
*** Setting up Edge Network ***
*** Initiating Generic Users ***
*** Initiating Opera Users ***
*** Initiating Ambulance Users ***
*** Filling Latencies ***
*** Starting Requests Generic Users ***
 Number of requests: 100
 Number of requests: 200
 Number of requests: 300
 Number of requests: 400
 Number of requests: 500
 Number of requests: 600
 Number of requests: 700
*** Opera Users Traveling to Opera House ***
 Number of requests: 800
 Number of requests: 900
 Number of requests: 1000
*** Ambulances Users Traveling to Accident Place ***
 Number of requests: 1100
 Number of requests: 1200
 Number of requests: 1300
*** Ambulance Users Stopping ***
*** Opera Users Stopping ***
 Number of requests: 1400
 Number of requests: 1500
*** Generic Users Stopping ***
 Number of requests: 1600
*** Cloud Server Stopping ***
*** Printing Results ***
File written: approach_maaco_scenario_1_edge_servers_500_mec_systems_5_functions_1_prediction_HMM_iterations_100_ants_10.csv
*** Requests = 1630 ***
*** Queue Max Length = 3 ***
*** Experiment finished ***
*** Experiment approach MAACO :: scenario 1 :: servers 500 :: functions 1 :: iterations 100 :: ants 100 :: prediction HMM ***
Setting paremeters...
*** Initiating Cloud Server ***
*** Setting up Edge Network ***
*** Initiating Generic Users ***
*** Initiating Opera Users ***
*** Initiating Ambulance Users ***
*** Filling Latencies ***
*** Starting Requests Generic Users ***
 Number of requests: 100
 Number of requests: 200
 Number of requests: 300
 Number of requests: 400
 Number of requests: 500
 Number of requests: 600
*** Opera Users Traveling to Opera House ***
 Number of requests: 700
 Number of requests: 800
 Number of requests: 900
*** Ambulances Users Traveling to Accident Place ***
 Number of requests: 1000
 Number of requests: 1100
 Number of requests: 1200
 Number of requests: 1300
*** Ambulance Users Stopping ***
 Number of requests: 1400
*** Opera Users Stopping ***
 Number of requests: 1500
 Number of requests: 1600
*** Generic Users Stopping ***
 Number of requests: 1700
*** Cloud Server Stopping ***
*** Printing Results ***
File written: approach_maaco_scenario_1_edge_servers_500_mec_systems_5_functions_1_prediction_HMM_iterations_100_ants_100.csv
*** Requests = 1701 ***
*** Queue Max Length = 2 ***
*** Experiment finished ***
*** Experiment approach MAACO :: scenario 1 :: servers 500 :: functions 1 :: iterations 100 :: ants 1000 :: prediction HMM ***
Setting paremeters...
*** Initiating Cloud Server ***
*** Setting up Edge Network ***
*** Initiating Generic Users ***
*** Initiating Opera Users ***
*** Initiating Ambulance Users ***
*** Filling Latencies ***
*** Starting Requests Generic Users ***
 Number of requests: 100
 Number of requests: 200
 Number of requests: 300
 Number of requests: 400
 Number of requests: 500
 Number of requests: 600
*** Opera Users Traveling to Opera House ***
 Number of requests: 700
 Number of requests: 800
 Number of requests: 900
 Number of requests: 1000
 Number of requests: 1100
*** Ambulances Users Traveling to Accident Place ***
 Number of requests: 1200
 Number of requests: 1300
 Number of requests: 1400
 Number of requests: 1500
 Number of requests: 1600
 Number of requests: 1700
*** Ambulance Users Stopping ***
*** Opera Users Stopping ***
 Number of requests: 1800
 Number of requests: 1900
 Number of requests: 2000
*** Generic Users Stopping ***
*** Cloud Server Stopping ***
*** Printing Results ***
File written: approach_maaco_scenario_1_edge_servers_500_mec_systems_5_functions_1_prediction_HMM_iterations_100_ants_1000.csv
*** Requests = 2028 ***
*** Queue Max Length = 2 ***
*** Experiment finished ***
*** Experiment approach MAACO :: scenario 1 :: servers 500 :: functions 1 :: iterations 1000 :: ants 10 :: prediction HMM ***
Setting paremeters...
*** Initiating Cloud Server ***
*** Setting up Edge Network ***
*** Initiating Generic Users ***
*** Initiating Opera Users ***
*** Initiating Ambulance Users ***
*** Filling Latencies ***
*** Starting Requests Generic Users ***
 Number of requests: 100
 Number of requests: 200
 Number of requests: 300
 Number of requests: 400
 Number of requests: 500
 Number of requests: 600
 Number of requests: 700
*** Opera Users Traveling to Opera House ***
 Number of requests: 800
 Number of requests: 900
 Number of requests: 1000
*** Ambulances Users Traveling to Accident Place ***
 Number of requests: 1100
 Number of requests: 1200
 Number of requests: 1300
 Number of requests: 1400
*** Ambulance Users Stopping ***
*** Opera Users Stopping ***
 Number of requests: 1500
 Number of requests: 1600
*** Generic Users Stopping ***
*** Cloud Server Stopping ***
*** Printing Results ***
File written: approach_maaco_scenario_1_edge_servers_500_mec_systems_5_functions_1_prediction_HMM_iterations_1000_ants_10.csv
*** Requests = 1687 ***
*** Queue Max Length = 2 ***
*** Experiment finished ***
*** Experiment approach MAACO :: scenario 1 :: servers 500 :: functions 1 :: iterations 1000 :: ants 100 :: prediction HMM ***
Setting paremeters...
*** Initiating Cloud Server ***
*** Setting up Edge Network ***
*** Initiating Generic Users ***
*** Initiating Opera Users ***
*** Initiating Ambulance Users ***
*** Filling Latencies ***
*** Starting Requests Generic Users ***
 Number of requests: 100
 Number of requests: 200
 Number of requests: 300
 Number of requests: 400
 Number of requests: 500
 Number of requests: 600
*** Opera Users Traveling to Opera House ***
 Number of requests: 700
 Number of requests: 800
 Number of requests: 900
 Number of requests: 1000
*** Ambulances Users Traveling to Accident Place ***
 Number of requests: 1100
 Number of requests: 1200
 Number of requests: 1300
 Number of requests: 1400
*** Ambulance Users Stopping ***
*** Opera Users Stopping ***
 Number of requests: 1500
 Number of requests: 1600
*** Generic Users Stopping ***
*** Cloud Server Stopping ***
*** Printing Results ***
File written: approach_maaco_scenario_1_edge_servers_500_mec_systems_5_functions_1_prediction_HMM_iterations_1000_ants_100.csv
*** Requests = 1670 ***
*** Queue Max Length = 3 ***
*** Experiment finished ***
*** Experiment approach MAACO :: scenario 1 :: servers 500 :: functions 1 :: iterations 1000 :: ants 1000 :: prediction HMM ***
Setting paremeters...
*** Initiating Cloud Server ***
*** Setting up Edge Network ***
*** Initiating Generic Users ***
*** Initiating Opera Users ***
*** Initiating Ambulance Users ***
*** Filling Latencies ***
*** Starting Requests Generic Users ***
 Number of requests: 100
 Number of requests: 200
 Number of requests: 300
 Number of requests: 400
 Number of requests: 500
 Number of requests: 600
*** Opera Users Traveling to Opera House ***
 Number of requests: 700
 Number of requests: 800
 Number of requests: 900
 Number of requests: 1000
 Number of requests: 1100
*** Ambulances Users Traveling to Accident Place ***
 Number of requests: 1200
 Number of requests: 1300
 Number of requests: 1400
 Number of requests: 1500
 Number of requests: 1600
*** Ambulance Users Stopping ***
 Number of requests: 1700
*** Opera Users Stopping ***
 Number of requests: 1800
 Number of requests: 1900
*** Generic Users Stopping ***
 Number of requests: 2000
*** Cloud Server Stopping ***
*** Printing Results ***
File written: approach_maaco_scenario_1_edge_servers_500_mec_systems_5_functions_1_prediction_HMM_iterations_1000_ants_1000.csv
*** Requests = 2011 ***
*** Queue Max Length = 3 ***
*** Experiment finished ***
*** Experiment approach MAACO :: scenario 1 :: servers 500 :: functions 1 :: iterations 10000 :: ants 10 :: prediction HMM ***
Setting paremeters...
*** Initiating Cloud Server ***
*** Setting up Edge Network ***
*** Initiating Generic Users ***
*** Initiating Opera Users ***
*** Initiating Ambulance Users ***
*** Filling Latencies ***
*** Starting Requests Generic Users ***
 Number of requests: 100
 Number of requests: 200
 Number of requests: 300
 Number of requests: 400
 Number of requests: 500
 Number of requests: 600
 Number of requests: 700
*** Opera Users Traveling to Opera House ***
 Number of requests: 800
 Number of requests: 900
 Number of requests: 1000
*** Ambulances Users Traveling to Accident Place ***
 Number of requests: 1100
 Number of requests: 1200
 Number of requests: 1300
 Number of requests: 1400
*** Ambulance Users Stopping ***
*** Opera Users Stopping ***
 Number of requests: 1500
 Number of requests: 1600
*** Generic Users Stopping ***
 Number of requests: 1700
*** Cloud Server Stopping ***
*** Printing Results ***
File written: approach_maaco_scenario_1_edge_servers_500_mec_systems_5_functions_1_prediction_HMM_iterations_10000_ants_10.csv
*** Requests = 1725 ***
*** Queue Max Length = 2 ***
*** Experiment finished ***
*** Experiment approach MAACO :: scenario 1 :: servers 500 :: functions 1 :: iterations 10000 :: ants 100 :: prediction HMM ***
Setting paremeters...
*** Initiating Cloud Server ***
*** Setting up Edge Network ***
*** Initiating Generic Users ***
*** Initiating Opera Users ***
*** Initiating Ambulance Users ***
*** Filling Latencies ***
*** Starting Requests Generic Users ***
 Number of requests: 100
 Number of requests: 200
 Number of requests: 300
 Number of requests: 400
 Number of requests: 500
 Number of requests: 600
*** Opera Users Traveling to Opera House ***
 Number of requests: 700
 Number of requests: 800
 Number of requests: 900
 Number of requests: 1000
*** Ambulances Users Traveling to Accident Place ***
 Number of requests: 1100
 Number of requests: 1200
 Number of requests: 1300
*** Ambulance Users Stopping ***
 Number of requests: 1400
*** Opera Users Stopping ***
 Number of requests: 1500
 Number of requests: 1600
*** Generic Users Stopping ***
*** Cloud Server Stopping ***
*** Printing Results ***
File written: approach_maaco_scenario_1_edge_servers_500_mec_systems_5_functions_1_prediction_HMM_iterations_10000_ants_100.csv
*** Requests = 1686 ***
*** Queue Max Length = 2 ***
*** Experiment finished ***
*** Experiment approach MAACO :: scenario 1 :: servers 500 :: functions 1 :: iterations 10000 :: ants 1000 :: prediction HMM ***
Setting paremeters...
*** Initiating Cloud Server ***
*** Setting up Edge Network ***
*** Initiating Generic Users ***
*** Initiating Opera Users ***
*** Initiating Ambulance Users ***
*** Filling Latencies ***
*** Starting Requests Generic Users ***
 Number of requests: 100
 Number of requests: 200
 Number of requests: 300
 Number of requests: 400
 Number of requests: 500
 Number of requests: 600
*** Opera Users Traveling to Opera House ***
 Number of requests: 700
 Number of requests: 800
 Number of requests: 900
 Number of requests: 1000
*** Ambulances Users Traveling to Accident Place ***
 Number of requests: 1100
 Number of requests: 1200
 Number of requests: 1300
 Number of requests: 1400
 Number of requests: 1500
 Number of requests: 1600
*** Ambulance Users Stopping ***
*** Opera Users Stopping ***
 Number of requests: 1700
 Number of requests: 1800
*** Generic Users Stopping ***
 Number of requests: 1900
*** Cloud Server Stopping ***
*** Printing Results ***
File written: approach_maaco_scenario_1_edge_servers_500_mec_systems_5_functions_1_prediction_HMM_iterations_10000_ants_1000.csv
*** Requests = 1926 ***
*** Queue Max Length = 3 ***
*** Experiment finished ***
*** Experiment approach MAACO :: scenario 1 :: servers 500 :: functions 2 :: iterations 100 :: ants 10 :: prediction HMM ***
Setting paremeters...
*** Initiating Cloud Server ***
*** Setting up Edge Network ***
*** Initiating Generic Users ***
*** Initiating Opera Users ***
*** Initiating Ambulance Users ***
*** Filling Latencies ***
*** Starting Requests Generic Users ***
 Number of requests: 100
 Number of requests: 200
 Number of requests: 300
 Number of requests: 400
 Number of requests: 500
 Number of requests: 600
*** Opera Users Traveling to Opera House ***
 Number of requests: 700
 Number of requests: 800
 Number of requests: 900
 Number of requests: 1000
*** Ambulances Users Traveling to Accident Place ***
 Number of requests: 1100
 Number of requests: 1200
 Number of requests: 1300
 Number of requests: 1400
*** Ambulance Users Stopping ***
*** Opera Users Stopping ***
 Number of requests: 1500
 Number of requests: 1600
*** Generic Users Stopping ***
*** Cloud Server Stopping ***
*** Printing Results ***
File written: approach_maaco_scenario_1_edge_servers_500_mec_systems_5_functions_2_prediction_HMM_iterations_100_ants_10.csv
*** Requests = 1699 ***
*** Queue Max Length = 3 ***
*** Experiment finished ***
*** Experiment approach MAACO :: scenario 1 :: servers 500 :: functions 2 :: iterations 100 :: ants 100 :: prediction HMM ***
Setting paremeters...
*** Initiating Cloud Server ***
*** Setting up Edge Network ***
*** Initiating Generic Users ***
*** Initiating Opera Users ***
*** Initiating Ambulance Users ***
*** Filling Latencies ***
*** Starting Requests Generic Users ***
 Number of requests: 100
 Number of requests: 200
 Number of requests: 300
 Number of requests: 400
 Number of requests: 500
 Number of requests: 600
*** Opera Users Traveling to Opera House ***
 Number of requests: 700
 Number of requests: 800
 Number of requests: 900
 Number of requests: 1000
*** Ambulances Users Traveling to Accident Place ***
 Number of requests: 1100
 Number of requests: 1200
 Number of requests: 1300
 Number of requests: 1400
*** Ambulance Users Stopping ***
*** Opera Users Stopping ***
 Number of requests: 1500
 Number of requests: 1600
*** Generic Users Stopping ***
 Number of requests: 1700
*** Cloud Server Stopping ***
*** Printing Results ***
File written: approach_maaco_scenario_1_edge_servers_500_mec_systems_5_functions_2_prediction_HMM_iterations_100_ants_100.csv
*** Requests = 1721 ***
*** Queue Max Length = 2 ***
*** Experiment finished ***
*** Experiment approach MAACO :: scenario 1 :: servers 500 :: functions 2 :: iterations 100 :: ants 1000 :: prediction HMM ***
Setting paremeters...
*** Initiating Cloud Server ***
*** Setting up Edge Network ***
*** Initiating Generic Users ***
*** Initiating Opera Users ***
*** Initiating Ambulance Users ***
*** Filling Latencies ***
*** Starting Requests Generic Users ***
 Number of requests: 100
 Number of requests: 200
 Number of requests: 300
 Number of requests: 400
 Number of requests: 500
 Number of requests: 600
*** Opera Users Traveling to Opera House ***
 Number of requests: 700
 Number of requests: 800
 Number of requests: 900
 Number of requests: 1000
*** Ambulances Users Traveling to Accident Place ***
 Number of requests: 1100
 Number of requests: 1200
 Number of requests: 1300
 Number of requests: 1400
*** Ambulance Users Stopping ***
 Number of requests: 1500
*** Opera Users Stopping ***
 Number of requests: 1600
 Number of requests: 1700
*** Generic Users Stopping ***
*** Cloud Server Stopping ***
*** Printing Results ***
File written: approach_maaco_scenario_1_edge_servers_500_mec_systems_5_functions_2_prediction_HMM_iterations_100_ants_1000.csv
*** Requests = 1782 ***
*** Queue Max Length = 2 ***
*** Experiment finished ***
*** Experiment approach MAACO :: scenario 1 :: servers 500 :: functions 2 :: iterations 1000 :: ants 10 :: prediction HMM ***
Setting paremeters...
*** Initiating Cloud Server ***
*** Setting up Edge Network ***
*** Initiating Generic Users ***
*** Initiating Opera Users ***
*** Initiating Ambulance Users ***
*** Filling Latencies ***
*** Starting Requests Generic Users ***
 Number of requests: 100
 Number of requests: 200
 Number of requests: 300
 Number of requests: 400
 Number of requests: 500
 Number of requests: 600
 Number of requests: 700
*** Opera Users Traveling to Opera House ***
 Number of requests: 800
 Number of requests: 900
 Number of requests: 1000
 Number of requests: 1100
*** Ambulances Users Traveling to Accident Place ***
 Number of requests: 1200
 Number of requests: 1300
 Number of requests: 1400
 Number of requests: 1500
 Number of requests: 1600
 Number of requests: 1700
*** Ambulance Users Stopping ***
*** Opera Users Stopping ***
 Number of requests: 1800
 Number of requests: 1900
 Number of requests: 2000
*** Generic Users Stopping ***
*** Cloud Server Stopping ***
*** Printing Results ***
File written: approach_maaco_scenario_1_edge_servers_500_mec_systems_5_functions_2_prediction_HMM_iterations_1000_ants_10.csv
*** Requests = 2042 ***
*** Queue Max Length = 2 ***
*** Experiment finished ***
*** Experiment approach MAACO :: scenario 1 :: servers 500 :: functions 2 :: iterations 1000 :: ants 100 :: prediction HMM ***
Setting paremeters...
*** Initiating Cloud Server ***
*** Setting up Edge Network ***
*** Initiating Generic Users ***
*** Initiating Opera Users ***
*** Initiating Ambulance Users ***
*** Filling Latencies ***
*** Starting Requests Generic Users ***
 Number of requests: 100
 Number of requests: 200
 Number of requests: 300
 Number of requests: 400
 Number of requests: 500
 Number of requests: 600
 Number of requests: 700
*** Opera Users Traveling to Opera House ***
 Number of requests: 800
 Number of requests: 900
 Number of requests: 1000
*** Ambulances Users Traveling to Accident Place ***
 Number of requests: 1100
 Number of requests: 1200
 Number of requests: 1300
 Number of requests: 1400
*** Ambulance Users Stopping ***
*** Opera Users Stopping ***
 Number of requests: 1500
 Number of requests: 1600
 Number of requests: 1700
*** Generic Users Stopping ***
*** Cloud Server Stopping ***
*** Printing Results ***
File written: approach_maaco_scenario_1_edge_servers_500_mec_systems_5_functions_2_prediction_HMM_iterations_1000_ants_100.csv
*** Requests = 1747 ***
*** Queue Max Length = 2 ***
*** Experiment finished ***
*** Experiment approach MAACO :: scenario 1 :: servers 500 :: functions 2 :: iterations 1000 :: ants 1000 :: prediction HMM ***
Setting paremeters...
*** Initiating Cloud Server ***
*** Setting up Edge Network ***
*** Initiating Generic Users ***
*** Initiating Opera Users ***
*** Initiating Ambulance Users ***
*** Filling Latencies ***
*** Starting Requests Generic Users ***
 Number of requests: 100
 Number of requests: 200
 Number of requests: 300
 Number of requests: 400
 Number of requests: 500
 Number of requests: 600
*** Opera Users Traveling to Opera House ***
 Number of requests: 700
 Number of requests: 800
 Number of requests: 900
 Number of requests: 1000
*** Ambulances Users Traveling to Accident Place ***
 Number of requests: 1100
 Number of requests: 1200
 Number of requests: 1300
 Number of requests: 1400
 Number of requests: 1500
*** Ambulance Users Stopping ***
*** Opera Users Stopping ***
 Number of requests: 1600
 Number of requests: 1700
*** Generic Users Stopping ***
*** Cloud Server Stopping ***
*** Printing Results ***
File written: approach_maaco_scenario_1_edge_servers_500_mec_systems_5_functions_2_prediction_HMM_iterations_1000_ants_1000.csv
*** Requests = 1784 ***
*** Queue Max Length = 2 ***
*** Experiment finished ***
*** Experiment approach MAACO :: scenario 1 :: servers 500 :: functions 2 :: iterations 10000 :: ants 10 :: prediction HMM ***
Setting paremeters...
*** Initiating Cloud Server ***
*** Setting up Edge Network ***
*** Initiating Generic Users ***
*** Initiating Opera Users ***
*** Initiating Ambulance Users ***
*** Filling Latencies ***
*** Starting Requests Generic Users ***
 Number of requests: 100
 Number of requests: 200
 Number of requests: 300
 Number of requests: 400
 Number of requests: 500
 Number of requests: 600
 Number of requests: 700
*** Opera Users Traveling to Opera House ***
 Number of requests: 800
 Number of requests: 900
 Number of requests: 1000
 Number of requests: 1100
*** Ambulances Users Traveling to Accident Place ***
 Number of requests: 1200
 Number of requests: 1300
 Number of requests: 1400
*** Ambulance Users Stopping ***
*** Opera Users Stopping ***
 Number of requests: 1500
 Number of requests: 1600
*** Generic Users Stopping ***
 Number of requests: 1700
*** Cloud Server Stopping ***
*** Printing Results ***
File written: approach_maaco_scenario_1_edge_servers_500_mec_systems_5_functions_2_prediction_HMM_iterations_10000_ants_10.csv
*** Requests = 1727 ***
*** Queue Max Length = 2 ***
*** Experiment finished ***
*** Experiment approach MAACO :: scenario 1 :: servers 500 :: functions 2 :: iterations 10000 :: ants 100 :: prediction HMM ***
Setting paremeters...
*** Initiating Cloud Server ***
*** Setting up Edge Network ***
*** Initiating Generic Users ***
*** Initiating Opera Users ***
*** Initiating Ambulance Users ***
*** Filling Latencies ***
*** Starting Requests Generic Users ***
 Number of requests: 100
 Number of requests: 200
 Number of requests: 300
 Number of requests: 400
 Number of requests: 500
 Number of requests: 600
*** Opera Users Traveling to Opera House ***
 Number of requests: 700
 Number of requests: 800
 Number of requests: 900
 Number of requests: 1000
*** Ambulances Users Traveling to Accident Place ***
 Number of requests: 1100
 Number of requests: 1200
 Number of requests: 1300
 Number of requests: 1400
*** Ambulance Users Stopping ***
*** Opera Users Stopping ***
 Number of requests: 1500
 Number of requests: 1600
*** Generic Users Stopping ***
*** Cloud Server Stopping ***
*** Printing Results ***
File written: approach_maaco_scenario_1_edge_servers_500_mec_systems_5_functions_2_prediction_HMM_iterations_10000_ants_100.csv
*** Requests = 1697 ***
*** Queue Max Length = 2 ***
*** Experiment finished ***
*** Experiment approach MAACO :: scenario 1 :: servers 500 :: functions 2 :: iterations 10000 :: ants 1000 :: prediction HMM ***
Setting paremeters...
*** Initiating Cloud Server ***
*** Setting up Edge Network ***
*** Initiating Generic Users ***
*** Initiating Opera Users ***
*** Initiating Ambulance Users ***
*** Filling Latencies ***
*** Starting Requests Generic Users ***
 Number of requests: 100
 Number of requests: 200
 Number of requests: 300
 Number of requests: 400
 Number of requests: 500
 Number of requests: 600
 Number of requests: 700
