java -jar ./automated-experiments.jar urban 2 /home/users/cabrerac/ 100 1 5 1 1500m /urban-summary/summary_28.xlsx 0 10 0 10 > ./logs/urban/urban_2_1_5.out
java -jar ./automated-experiments.jar urban 2 /home/users/cabrerac/ 100 1 4 1 1500m /urban-summary/summary_29.xlsx 0 10 0 10 > ./logs/urban/urban_2_1_4.out
java -jar ./automated-experiments.jar urban 2 /home/users/cabrerac/ 100 1 3 1 1500m /urban-summary/summary_30.xlsx 0 10 0 10 > ./logs/urban/urban_2_1_3.out

