*** Experiment approach RANDOM :: scenario 1 :: servers 300 :: functions 1 ***
Setting paremeters...
*** Initiating Cloud Server ***
*** Setting up Edge Network ***
*** Initiating Generic Users ***
*** Initiating Opera Users ***
*** Initiating Ambulance Users ***
*** Filling Latencies ***
*** Starting Requests Generic Users ***
 Number of requests: 100
 Number of requests: 200
 Number of requests: 300
 Number of requests: 400
 Number of requests: 500
 Number of requests: 600
*** Opera Users Traveling to Opera House ***
 Number of requests: 700
 Number of requests: 800
 Number of requests: 900
*** Ambulances Users Traveling to Accident Place ***
 Number of requests: 1000
 Number of requests: 1100
 Number of requests: 1200
*** Ambulance Users Stopping ***
 Number of requests: 1300
*** Opera Users Stopping ***
 Number of requests: 1400
 Number of requests: 1500
*** Generic Users Stopping ***
*** Cloud Server Stopping ***
*** Printing Results ***
File written: approach_random_scenario_1_edge_servers_300_mec_systems_5_functions_1_prediction_NONE.csv
*** Requests = 1548 ***
*** Queue Max Length = 3 ***
*** Experiment finished ***
*** Experiment approach RANDOM :: scenario 1 :: servers 300 :: functions 2 ***
Setting paremeters...
*** Initiating Cloud Server ***
*** Setting up Edge Network ***
*** Initiating Generic Users ***
*** Initiating Opera Users ***
*** Initiating Ambulance Users ***
*** Filling Latencies ***
*** Starting Requests Generic Users ***
 Number of requests: 100
 Number of requests: 200
 Number of requests: 300
 Number of requests: 400
 Number of requests: 500
 Number of requests: 600
 Number of requests: 700
*** Opera Users Traveling to Opera House ***
 Number of requests: 800
 Number of requests: 900
 Number of requests: 1000
 Number of requests: 1100
*** Ambulances Users Traveling to Accident Place ***
 Number of requests: 1200
 Number of requests: 1300
 Number of requests: 1400
 Number of requests: 1500
*** Ambulance Users Stopping ***
 Number of requests: 1600
*** Opera Users Stopping ***
 Number of requests: 1700
 Number of requests: 1800
*** Generic Users Stopping ***
*** Cloud Server Stopping ***
*** Printing Results ***
File written: approach_random_scenario_1_edge_servers_300_mec_systems_5_functions_2_prediction_NONE.csv
*** Requests = 1884 ***
*** Queue Max Length = 3 ***
*** Experiment finished ***
*** Experiment approach RANDOM :: scenario 1 :: servers 300 :: functions 3 ***
Setting paremeters...
*** Initiating Cloud Server ***
*** Setting up Edge Network ***
*** Initiating Generic Users ***
*** Initiating Opera Users ***
*** Initiating Ambulance Users ***
*** Filling Latencies ***
*** Starting Requests Generic Users ***
 Number of requests: 100
 Number of requests: 200
 Number of requests: 300
 Number of requests: 400
 Number of requests: 500
 Number of requests: 600
*** Opera Users Traveling to Opera House ***
 Number of requests: 700
 Number of requests: 800
 Number of requests: 900
*** Ambulances Users Traveling to Accident Place ***
 Number of requests: 1000
 Number of requests: 1100
 Number of requests: 1200
*** Ambulance Users Stopping ***
*** Opera Users Stopping ***
 Number of requests: 1300
 Number of requests: 1400
*** Generic Users Stopping ***
 Number of requests: 1500
*** Cloud Server Stopping ***
*** Printing Results ***
File written: approach_random_scenario_1_edge_servers_300_mec_systems_5_functions_3_prediction_NONE.csv
*** Requests = 1518 ***
*** Queue Max Length = 2 ***
*** Experiment finished ***
*** Experiment approach RANDOM :: scenario 1 :: servers 300 :: functions 4 ***
Setting paremeters...
*** Initiating Cloud Server ***
*** Setting up Edge Network ***
*** Initiating Generic Users ***
*** Initiating Opera Users ***
*** Initiating Ambulance Users ***
*** Filling Latencies ***
*** Starting Requests Generic Users ***
 Number of requests: 100
 Number of requests: 200
 Number of requests: 300
 Number of requests: 400
 Number of requests: 500
 Number of requests: 600
 Number of requests: 700
*** Opera Users Traveling to Opera House ***
 Number of requests: 800
 Number of requests: 900
 Number of requests: 1000
*** Ambulances Users Traveling to Accident Place ***
 Number of requests: 1100
 Number of requests: 1200
 Number of requests: 1300
*** Ambulance Users Stopping ***
*** Opera Users Stopping ***
 Number of requests: 1400
 Number of requests: 1500
*** Generic Users Stopping ***
*** Cloud Server Stopping ***
*** Printing Results ***
File written: approach_random_scenario_1_edge_servers_300_mec_systems_5_functions_4_prediction_NONE.csv
*** Requests = 1558 ***
*** Queue Max Length = 3 ***
*** Experiment finished ***
*** Experiment approach RANDOM :: scenario 1 :: servers 300 :: functions 5 ***
Setting paremeters...
*** Initiating Cloud Server ***
*** Setting up Edge Network ***
*** Initiating Generic Users ***
*** Initiating Opera Users ***
*** Initiating Ambulance Users ***
*** Filling Latencies ***
*** Starting Requests Generic Users ***
 Number of requests: 100
 Number of requests: 200
 Number of requests: 300
 Number of requests: 400
 Number of requests: 500
 Number of requests: 600
*** Opera Users Traveling to Opera House ***
 Number of requests: 700
 Number of requests: 800
 Number of requests: 900
*** Ambulances Users Traveling to Accident Place ***
 Number of requests: 1000
 Number of requests: 1100
 Number of requests: 1200
 Number of requests: 1300
 Number of requests: 1400
*** Ambulance Users Stopping ***
*** Opera Users Stopping ***
 Number of requests: 1500
 Number of requests: 1600
*** Generic Users Stopping ***
 Number of requests: 1700
*** Cloud Server Stopping ***
*** Printing Results ***
File written: approach_random_scenario_1_edge_servers_300_mec_systems_5_functions_5_prediction_NONE.csv
*** Requests = 1722 ***
*** Queue Max Length = 2 ***
*** Experiment finished ***
