*** Experiment approach MULTIOPT :: scenario 1 :: servers 100 :: functions 1 ***
Setting paremeters...
*** Initiating Cloud Server ***
*** Setting up Edge Network ***
*** Initiating Generic Users ***
*** Initiating Opera Users ***
*** Initiating Ambulance Users ***
*** Filling Latencies ***
*** Starting Requests Generic Users ***
 Number of requests: 100
 Number of requests: 200
 Number of requests: 300
 Number of requests: 400
 Number of requests: 500
 Number of requests: 600
*** Opera Users Traveling to Opera House ***
 Number of requests: 700
 Number of requests: 800
 Number of requests: 900
 Number of requests: 1000
*** Ambulances Users Traveling to Accident Place ***
 Number of requests: 1100
 Number of requests: 1200
 Number of requests: 1300
 Number of requests: 1400
 Number of requests: 1500
*** Ambulance Users Stopping ***
 Number of requests: 1600
*** Opera Users Stopping ***
 Number of requests: 1700
 Number of requests: 1800
*** Generic Users Stopping ***
*** Cloud Server Stopping ***
*** Printing Results ***
File written: approach_multiopt_scenario_1_edge_servers_100_mec_systems_5_functions_1_prediction_NONE.csv
*** Requests = 1895 ***
*** Queue Max Length = 3 ***
*** Experiment finished ***
*** Experiment approach MULTIOPT :: scenario 1 :: servers 100 :: functions 2 ***
Setting paremeters...
*** Initiating Cloud Server ***
*** Setting up Edge Network ***
*** Initiating Generic Users ***
*** Initiating Opera Users ***
*** Initiating Ambulance Users ***
*** Filling Latencies ***
*** Starting Requests Generic Users ***
 Number of requests: 100
 Number of requests: 200
 Number of requests: 300
 Number of requests: 400
 Number of requests: 500
*** Opera Users Traveling to Opera House ***
 Number of requests: 600
 Number of requests: 700
*** Ambulances Users Traveling to Accident Place ***
 Number of requests: 800
 Number of requests: 900
*** Ambulance Users Stopping ***
*** Opera Users Stopping ***
 Number of requests: 1000
 Number of requests: 1100
*** Generic Users Stopping ***
*** Cloud Server Stopping ***
*** Printing Results ***
File written: approach_multiopt_scenario_1_edge_servers_100_mec_systems_5_functions_2_prediction_NONE.csv
*** Requests = 1190 ***
*** Queue Max Length = 2 ***
*** Experiment finished ***
*** Experiment approach MULTIOPT :: scenario 1 :: servers 100 :: functions 3 ***
Setting paremeters...
*** Initiating Cloud Server ***
*** Setting up Edge Network ***
*** Initiating Generic Users ***
*** Initiating Opera Users ***
*** Initiating Ambulance Users ***
*** Filling Latencies ***
*** Starting Requests Generic Users ***
 Number of requests: 100
 Number of requests: 200
 Number of requests: 300
 Number of requests: 400
 Number of requests: 500
 Number of requests: 600
*** Opera Users Traveling to Opera House ***
 Number of requests: 700
 Number of requests: 800
 Number of requests: 900
*** Ambulances Users Traveling to Accident Place ***
 Number of requests: 1000
 Number of requests: 1100
 Number of requests: 1200
 Number of requests: 1300
 Number of requests: 1400
 Number of requests: 1500
*** Ambulance Users Stopping ***
*** Opera Users Stopping ***
 Number of requests: 1600
 Number of requests: 1700
 Number of requests: 1800
*** Generic Users Stopping ***
*** Cloud Server Stopping ***
*** Printing Results ***
File written: approach_multiopt_scenario_1_edge_servers_100_mec_systems_5_functions_3_prediction_NONE.csv
*** Requests = 1864 ***
*** Queue Max Length = 2 ***
*** Experiment finished ***
*** Experiment approach MULTIOPT :: scenario 1 :: servers 100 :: functions 4 ***
Setting paremeters...
*** Initiating Cloud Server ***
*** Setting up Edge Network ***
*** Initiating Generic Users ***
*** Initiating Opera Users ***
*** Initiating Ambulance Users ***
*** Filling Latencies ***
*** Starting Requests Generic Users ***
 Number of requests: 100
 Number of requests: 200
 Number of requests: 300
 Number of requests: 400
 Number of requests: 500
*** Opera Users Traveling to Opera House ***
 Number of requests: 600
 Number of requests: 700
 Number of requests: 800
 Number of requests: 900
 Number of requests: 1000
 Number of requests: 1100
 Number of requests: 1200
 Number of requests: 1300
 Number of requests: 1400
 Number of requests: 1500
 Number of requests: 1600
 Number of requests: 1700
*** Ambulances Users Traveling to Accident Place ***
 Number of requests: 1800
 Number of requests: 1900
 Number of requests: 2000
 Number of requests: 2100
 Number of requests: 2200
 Number of requests: 2300
 Number of requests: 2400
 Number of requests: 2500
 Number of requests: 2600
 Number of requests: 2700
 Number of requests: 2800
 Number of requests: 2900
 Number of requests: 3000
 Number of requests: 3100
 Number of requests: 3200
 Number of requests: 3300
 Number of requests: 3400
 Number of requests: 3500
 Number of requests: 3600
*** Ambulance Users Stopping ***
 Number of requests: 3700
 Number of requests: 3800
*** Opera Users Stopping ***
 Number of requests: 3900
 Number of requests: 4000
 Number of requests: 4100
*** Generic Users Stopping ***
 Number of requests: 4200
*** Cloud Server Stopping ***
*** Printing Results ***
File written: approach_multiopt_scenario_1_edge_servers_100_mec_systems_5_functions_4_prediction_NONE.csv
*** Requests = 4211 ***
*** Queue Max Length = 654 ***
*** Experiment finished ***
*** Experiment approach MULTIOPT :: scenario 1 :: servers 100 :: functions 5 ***
Setting paremeters...
*** Initiating Cloud Server ***
*** Setting up Edge Network ***
*** Initiating Generic Users ***
*** Initiating Opera Users ***
*** Initiating Ambulance Users ***
*** Filling Latencies ***
*** Starting Requests Generic Users ***
 Number of requests: 100
 Number of requests: 200
 Number of requests: 300
 Number of requests: 400
 Number of requests: 500
*** Opera Users Traveling to Opera House ***
 Number of requests: 600
 Number of requests: 700
*** Ambulances Users Traveling to Accident Place ***
 Number of requests: 800
 Number of requests: 900
 Number of requests: 1000
*** Ambulance Users Stopping ***
*** Opera Users Stopping ***
 Number of requests: 1100
 Number of requests: 1200
*** Generic Users Stopping ***
*** Cloud Server Stopping ***
*** Printing Results ***
File written: approach_multiopt_scenario_1_edge_servers_100_mec_systems_5_functions_5_prediction_NONE.csv
*** Requests = 1285 ***
*** Queue Max Length = 2 ***
*** Experiment finished ***
