python3 ./main.py 10 25
python3 ./main.py 10 15
python3 ./main.py 10 5
python3 ./main.py 8 25
python3 ./main.py 8 15
python3 ./main.py 8 5
python3 ./main.py 6 25
python3 ./main.py 6 15
python3 ./main.py 6 5
python3 ./main.py 4 25
python3 ./main.py 4 15
python3 ./main.py 4 5
python3 ./main.py 2 25
python3 ./main.py 2 15
python3 ./main.py 2 5
python3 ./main.py 0 25
python3 ./main.py 0 15
python3 ./main.py 0 5

