python3 ./main.py 10 5 10 2000 > ./output/script1005.out
python3 ./main.py 8 5 10 2000 > ./output/script0805.out
python3 ./main.py 6 5 10 2000 > ./output/script0605.out
python3 ./main.py 4 5 10 2000 > ./output/script0405.out
python3 ./main.py 2 5 10 2000 > ./output/script0205.out
python3 ./main.py 0 5 10 2000 > ./output/script0005.out

