-0.090023	2.754195	1
8.799773	11.763719	2
15.674150	15.984127	3
44.378912	48.410431	4
54.136735	54.556463	5
56.431519	63.815420	6
65.351247	68.335147	7
69.082766	71.178685	8
75.677778	76.775964	9
81.734014	82.063946	10
87.331293	88.289796	11
119.597959	121.574150	12
125.514512	126.153741	13
127.450113	129.805442	14
133.905442	135.841723	15
139.283220	141.339229	16
143.393878	145.479819	17
146.626531	151.965079	18
152.692744	154.429478	19
157.152608	157.991383	20
160.475057	161.483447	21
174.722676	175.312018	22
192.831519	194.348753	23
195.645125	195.955102	24
196.792517	197.441723	25
199.366667	202.031293	26
208.755329	211.340136	27
212.486848	213.714739	28
215.240590	216.368707	29
222.134921	228.840363	30
230.096825	230.895692	31
232.341723	233.709297	32
237.639683	238.638095	33
240.393424	245.342857	34
252.136735	253.803628	35
255.509070	256.028571	36
258.352608	259.031746	37
262.333560	264.449433	38
267.202494	268.939229	39
271.013832	271.712925	40
273.238776	278.048526	41
278.846032	279.505215	42
281.749433	285.182313	43
288.543991	289.193197	44
291.297732	292.066667	45
293.792063	294.870295	46
300.017914	300.657143	47
304.038776	306.703401	48
307.909977	308.519274	49
324.691837	325.540590	50
329.021995	330.309751	51
332.504082	334.160998	52
338.211111	339.967800	53
347.041043	354.754195	54
358.854195	360.481179	55
362.585714	364.043084	56
367.245125	368.652608	57
369.799320	371.416327	58
378.130385	378.550113	59
379.706803	384.257143	60
386.591156	386.980952	61
396.508617	397.207710	62
399.182540	399.921542	63
402.644671	403.333787	64
405.099093	406.546485	65
407.314059	408.212698	66
418.758050	419.886168	67
425.353061	425.882540	68
426.969388	427.947846	69
429.643311	430.322449	70
434.532200	436.757823	71
439.969841	441.746485	72
446.943991	451.105215	73
458.178458	459.196825	74
460.273696	461.671202	75
464.623810	465.612245	76
467.078231	469.004535	77
472.326304	473.414512	78
483.311338	487.851701	79
504.553061	507.307483	80
508.144898	510.270748	81
511.517234	511.897052	82
521.863719	524.767800	83
528.089569	533.138776	84
534.205669	539.624036	85
541.668707	543.136054	86
546.577551	549.591383	87
554.110431	554.769615	88
555.547166	556.246259	89
557.412925	559.239456	90
565.813832	566.852154	91
568.787075	571.431746	92
573.995238	575.492517	93
576.788889	578.236281	94
579.153515	580.261678	95
582.336281	583.075283	96
584.521315	585.090703	97
587.225170	587.774603	98
591.126304	591.585941	99
601.452834	602.291610	100
605.134467	606.322449	101
611.240590	612.697959	102
617.157143	617.696599	103
619.970748	620.949206	104
626.984807	627.294785	105
631.873696	635.436281	106
637.351247	638.050340	107
640.913152	642.240816	108
647.717687	650.581859	109
655.579819	659.681179	110
661.985261	663.362812	111
679.156236	680.414059	112
684.284580	685.492517	113
691.099093	700.737868	114
701.994331	703.182313	115
704.927664	705.736508	116
710.365306	712.181859	117
714.605669	718.946485	118
760.052381	761.759184	119
764.831519	766.049433	120
767.864626	772.913832	121
775.018367	775.328345	122
779.987075	781.524263	123
785.993424	786.931973	124
822.300907	827.350113	125
828.975737	829.545125	126
835.111791	836.648980	127
837.855556	838.444898	128
839.451927	841.448073	129
846.615646	847.534240	130
848.670975	850.736961	131
854.088662	854.757823	132
856.343537	857.012698	133
858.608390	860.734240	134
863.477324	863.936961	135
865.333107	865.643084	136
873.664172	874.612698	137
884.529478	886.505669	138
887.841950	891.085261	139
892.182086	894.008617	140
900.902268	901.641270	141
902.787982	904.933787	142
908.475057	909.972336	143
912.406122	913.723810	144
917.314966	919.510658	145
920.677324	921.885261	146
927.102721	927.652154	147
933.518141	934.017687	148
945.012018	945.421769	149
948.524036	949.911565	150
958.481406	959.320181	151
975.772109	976.341497	152
993.451927	994.699773	153
1002.012472	1002.901134	154
1004.167574	1005.156009	155
1009.645125	1013.417234	156
1014.893197	1015.672109	157
1016.918594	1020.121995	158
1021.627891	1023.095238	159
1024.411565	1026.068481	160
1027.265079	1029.969615	161
1031.605215	1034.439456	162
1039.237868	1040.425850	163
1041.213379	1043.548753	164
1045.363946	1047.280272	165
1048.377098	1049.794558	166
1052.777098	1056.708844	167
1057.436508	1057.946032	168
1058.973016	1060.131066	169
1064.201134	1065.389116	170
1066.136735	1068.970975	171
1074.118594	1075.017234	172
1080.563946	1082.360544	173
1083.597052	1084.375964	174
1088.465986	1091.150567	175
1094.073243	1094.662585	176
1096.647392	1096.957370	177
1101.875510	1103.133333	178
1105.457370	1106.795011	179
1112.451474	1116.662585	180
1121.850113	1124.095692	181
1124.973016	1126.310658	182
1132.336281	1136.317914	183
1137.115420	1137.585034	184
1139.051020	1141.466213	185
1146.394331	1149.448073	186
1150.355329	1150.974603	187
1155.144444	1157.779138	188
1162.288209	1163.795465	189
1164.932200	1169.921542	190
1175.119048	1176.835828	191
1179.339456	1182.612698	192
1184.308163	1186.284354	193
1191.641497	1193.218594	194
1195.283220	1196.840363	195
1202.077778	1203.515193	196
1207.425624	1207.775510	197
1210.149433	1210.908390	198
1212.474150	1215.557823	199
1217.363039	1219.858050	200
1220.895011	1221.374603	201
1223.798413	1224.547392	202
1226.312698	1227.051701	203
1229.196145	1229.765533	204
1246.576644	1246.886621	205
1269.873696	1270.293424	206
1279.801134	1281.268481	207
1283.173469	1284.451247	208
1291.444671	1292.991837	209
1330.555782	1331.803628	210
1334.037868	1334.756916	211
1339.904535	1341.222222	212
1347.247846	1347.976871	213
1358.931293	1360.009524	214
1360.966667	1363.671202	215
1369.746712	1370.575510	216
1371.442857	1372.790476	217
1373.887302	1374.436735	218
1375.413832	1376.881179	219
1384.173923	1385.232200	220
1387.915420	1390.739683	221
1392.195692	1393.882540	222
1402.941270	1403.301134	223
1404.657370	1406.473923	224
1410.963039	1413.737415	225
1415.023810	1417.349206	226
1418.924943	1420.442177	227
1424.532200	1426.189116	228
1429.740363	1433.173243	229
1453.406576	1453.866213	230
1469.021088	1469.390930	231
1471.784807	1472.094785	232
1474.009751	1475.576871	233
1479.607029	1482.570975	234
1485.114512	1485.614059	235
1489.165306	1491.470748	236
1492.407937	1494.064853	237
1495.520862	1496.888435	238
1499.002948	1503.583220	239
1508.221995	1511.894331	240
1515.495465	1519.377324	241
1521.352154	1523.607710	242
1528.515873	1529.055329	243
1534.332653	1536.887528	244
1538.233787	1539.222222	245
1541.236961	1541.586848	246
1544.319955	1546.106576	247
1555.753968	1556.443084	248
1557.789342	1558.288889	249
1559.834694	1560.424036	250
1561.700454	1562.439456	251
1565.671429	1567.138776	252
1572.156689	1577.515193	253
1579.500000	1580.258957	254
1581.236054	1581.546032	255
1603.784807	1604.493878	256
1606.787982	1607.097959	257
1609.242404	1609.692063	258
1610.798866	1611.398186	259
1632.958503	1634.615420	260
1636.749887	1638.386848	261
1641.868254	1643.335601	262
1649.630612	1650.130159	263
1652.184807	1652.734240	264
1667.799320	1668.258957	265
1688.272789	1688.981859	266
1689.988889	1692.314286	267
1693.451020	1694.549206	268
1697.970748	1703.379138	269
1704.366213	1705.185034	270
1707.010204	1714.833107	271
1715.560771	1718.005896	272
1722.026077	1723.124263	273
1726.186621	1728.412245	274
1730.865986	1731.575057	275
1732.681859	1734.697959	276
1736.363492	1737.152381	277
1743.247846	1745.253968	278
1748.416100	1750.043084	279
1756.797052	1757.476190	280
1758.443311	1761.078005	281
1762.374376	1762.923810	282
1767.881859	1770.606349	283
1772.421542	1773.968707	284
1775.893651	1783.666667	285
1784.583900	1786.619955	286
1789.313152	1790.042177	287
1791.308617	1793.584127	288
1794.830612	1796.297959	289
1799.879138	1803.152381	290
1805.915420	1806.574603	291
1815.443764	1816.861224	292
1819.933560	1820.413152	293
1822.358050	1823.156916	294
1824.592971	1827.097959	295
1827.915420	1830.510204	296
1832.824263	1833.243991	297
1834.650113	1837.195011	298
1842.562132	1845.615873	299
1851.461905	1853.647619	300
1856.610204	1857.528798	301
1860.441497	1861.988662	302
1883.588889	1885.954195	303
1886.741723	1887.171429	304
1888.747166	1889.436281	305
1892.279138	1893.526984	306
1894.693651	1896.639909	307
1897.806576	1901.429025	308
1910.368027	1911.915193	309
1917.571655	1918.330612	310
1925.104535	1928.597279	311
1936.249206	1937.726531	312
1940.150340	1941.278458	313
1945.787528	1947.773696	314
1961.142630	1965.543311	315
1966.680045	1969.773696	316
1973.145351	1977.396372	317
1978.812472	1979.910658	318
1981.217007	1982.514739	319
1988.290930	1993.479819	320
1995.624263	1997.271202	321
1998.407937	2000.663492	322
2005.002948	2009.114286	323
2010.510431	2011.229478	324
2013.174376	2020.498413	325
2022.084127	2036.502041	326
2038.506803	2038.986395	327
2041.250567	2044.603628	328
2051.587075	2052.545578	329
2054.849660	2055.379138	330
2056.685488	2061.994104	331
2063.899093	2064.528345	332
2065.724943	2070.913832	333
2072.808844	2076.511111	334
2077.508163	2078.247166	335
2079.024717	2079.833560	336
2083.205215	2084.443084	337
2086.088662	2086.648073	338
2088.054195	2089.242177	339
2090.109524	2090.678912	340
2091.905442	2092.434921	341
2093.352154	2094.170975	342
2096.943991	2097.403628	343
2099.029252	2102.651701	344
2104.057823	2104.617234	345
2108.278231	2114.145578	346
2118.524943	2119.822676	347
2121.348526	2121.887982	348
2126.875964	2133.312018	349
2136.204762	2136.764172	350
2137.960771	2138.330612	351
2139.387528	2140.176417	352
2141.582540	2143.139683	353
2151.420181	2151.899773	354
2154.283673	2155.800907	355
2156.887755	2157.606803	356
2162.205669	2162.585488	357
2163.612472	2168.931066	358
2179.985261	2181.282993	359
2183.836508	2184.725170	360
2187.967120	2188.516553	361
2189.792971	2194.113832	362
2195.719501	2198.683447	363
2212.521315	2213.390023	364
2215.225170	2218.807710	365
2222.638322	2225.731973	366
2226.988435	2229.214059	367
2230.789796	2233.324717	368
2238.212925	2241.097052	369
2241.824717	2245.357370	370
2246.075057	2246.824036	371
2248.140363	2249.887075	372
2250.674603	2256.222676	373
2256.980272	2263.845351	374
2265.041950	2275.618594	375
2277.383900	2283.889796	376
2284.667347	2286.244444	377
2287.261451	2296.171882	378
2297.099093	2300.631746	379
2301.449206	2306.548299	380
2307.864626	2322.512018	381
2327.899093	2328.368707	382
2330.383447	2332.100227	383
2335.611565	2336.220862	384
2339.502721	2342.287075	385
2346.097732	2346.876644	386
2349.829252	2351.206803	387
2353.201587	2353.511565	388
2376.668254	2377.926077	389
2382.056009	2383.673016	390
2412.037868	2413.325624	391
2416.487755	2416.917460	392
2423.821088	2425.677551	393
2431.513605	2438.129252	394
2438.926757	2439.316553	395
2441.191610	2442.429478	396
2461.345805	2464.200000	397
2467.511791	2468.031293	398
2471.392971	2472.720635	399
2473.897279	2479.624943	400
2481.939002	2485.671202	401
2488.075057	2492.545578	402
2497.373923	2501.684807	403
2506.503175	2507.521542	404
2509.506349	2513.817234	405
2521.339456	2522.128345	406
2526.457823	2527.865306	407
2529.720408	2536.595465	408
2537.452834	2542.851247	409
2544.516780	2546.034014	410
2547.320408	2552.678912	411
2559.782086	2560.760544	412
2571.665079	2572.324263	413
2576.334467	2577.362812	414
2578.439683	2584.416780	415
2585.792971	2586.402268	416
2591.819274	2592.268934	417
2625.113605	2627.389116	418
2630.900454	2631.789116	419
2633.574376	2634.702494	420
2639.560771	2639.870748	421
2647.712245	2648.052154	422
2688.190249	2689.178685	423
2694.805215	2700.133787	424
2702.018821	2702.498413	425
2704.323583	2708.365079	426
2711.617007	2712.236281	427
2719.169841	2719.669388	428
2723.958957	2725.496145	429
2728.618367	2731.771882	430
2732.868707	2735.024490	431
2736.510431	2737.668481	432
2738.535828	2743.495238	433
2744.222902	2749.172336	434
2752.963039	2755.468027	435
2764.027891	2764.557370	436
2773.037415	2773.566893	437
2778.435147	2783.354649	438
2787.165306	2788.971882	439
2793.021995	2795.068027	440
2798.878685	2800.795011	441
2801.572562	2804.446712	442
2835.894558	2837.172336	443
2838.957596	2843.907029	444
2844.983900	2845.852608	445
2847.388435	2847.768254	446
2865.547166	2867.313832	447
2870.775283	2872.013152	448
2873.778458	2877.879819	449
2878.797052	2881.561451	450
2886.599320	2888.874830	451
2894.720862	2895.958730	452
2903.141723	2903.890703	453
2905.037415	2905.596825	454
2906.494104	2912.511111	455
2914.665533	2916.422222	456
2917.878231	2922.628118	457
2926.199320	2926.728798	458
2931.118141	2935.159637	459
2938.621088	2939.789116	460
2956.610204	2961.829025	461
2962.736281	2964.612698	462
2972.194785	2975.298413	463
2976.504989	2977.593197	464
2981.393878	2983.779138	465
2985.694104	2986.522902	466
2988.477778	2990.414059	467
2991.151701	2994.634467	468
2997.656916	3000.521088	469
3004.331746	3006.148299	470
3008.761678	3009.640363	471
3021.023810	3026.432200	472
3030.482313	3031.480726	473
3032.228345	3034.144671	474
3041.337642	3042.126531	475
3043.353061	3044.241723	476
3045.148980	3045.828118	477
3047.703175	3048.871202	478
3049.908163	3050.337868	479
3053.869161	3056.054875	480
3059.516327	3062.619955	481
3063.786621	3065.224036	482
3068.007029	3071.270295	483
3078.084127	3079.082540	484
3088.829705	3089.139683	485
3093.768481	3094.088435	486
3120.697279	3122.773243	487
3137.329478	3138.118367	488
3139.753968	3142.697959	489
3143.545351	3144.264399	490
3156.974830	3159.529705	491
3160.387075	3161.165986	492
3168.917687	3169.756463	493
3174.145805	3176.221769	494
3177.019274	3177.389116	495
3185.799320	3188.064853	496
3191.426531	3192.065760	497
3200.675510	3202.132880	498
3203.997959	3207.071655	499
3215.511791	3216.101134	500
3218.604762	3221.339229	501
3222.675510	3224.412245	502
3233.740363	3234.249887	503
3240.724490	3243.259410	504
3244.725397	3246.691610	505
3250.272789	3253.506122	506
3255.510884	3255.830839	507
3257.486395	3260.360544	508
3262.624717	3263.673016	509
3267.274150	3269.679365	510
3276.253741	3278.449433	511
3279.426531	3280.424943	512
3282.110431	3283.428118	513
3284.365306	3287.319274	514
3289.543537	3290.172789	515
3291.878231	3294.552834	516
3298.752608	3299.312018	517
3301.825624	3304.280726	518
3311.274150	3311.673923	519
3312.840590	3313.150567	520
3318.527664	3318.847619	521
3327.926304	3330.431293	522
3333.164399	3337.285714	523
3338.532200	3341.196825	524
3348.699093	3349.108844	525
3363.635147	3364.364172	526
3365.890023	3367.606803	527
3370.669161	3374.102041	528
3374.929478	3378.960998	529
3380.047846	3383.530612	530
3387.251474	3392.410431	531
3393.507256	3397.738322	532
3398.735374	3400.432200	533
3401.449206	3403.056236	534
3412.683673	3414.719728	535
3423.539002	3425.026304	536
3429.635147	3430.763265	537
3436.629252	3436.939229	538
3438.814286	3439.912472	539
3443.503628	3444.082993	540
3446.417007	3447.894331	541
3449.659637	3452.284354	542
3454.239229	3455.606803	543
3472.896825	3476.629025	544
3478.264626	3482.535601	545
3483.333107	3484.042177	546
3485.717687	3486.975510	547
3491.883673	3495.077098	548
3496.652834	3498.549206	549
3499.735828	3500.734240	550
3503.886395	3508.456689	551
3511.838322	3514.732426	552
3517.086395	3518.084807	553
3519.021995	3520.359637	554
3521.316780	3522.953741	555
3524.080499	3527.164172	556
3530.465986	3531.005442	557
3532.760771	3533.070748	558
3539.116327	3541.491610	559
3543.516327	3544.055782	560
3546.240136	3550.590930	561
3552.106803	3553.713832	562
3554.720862	3556.876644	563
3560.038776	3562.374150	564
3563.271429	3563.711111	565
3565.346712	3566.215420	566
3567.940816	3569.438095	567
3580.402494	3582.189116	568
3584.403401	3585.800907	569
3587.646032	3588.355102	570
3591.008390	3592.864853	571
3594.869615	3596.666213	572
3600.187528	3607.431746	573
3644.796145	3646.383220	574
3648.567574	3649.136961	575
3652.768027	3656.320635	576
3661.069161	3661.618594	577
3663.743084	3665.000907	578
3666.426984	3668.093878	579
3670.218367	3671.865306	580
3672.732653	3673.371882	581
3674.768027	3677.013605	582
3679.736735	3680.276190	583
3681.113605	3683.828118	584
3685.274150	3685.853515	585
3686.770748	3687.839002	586
3690.552154	3694.174603	587
3695.251474	3696.190023	588
3697.316780	3700.879365	589
3708.411565	3708.721542	590
3719.795692	3720.165533	591
3723.547166	3724.864853	592
3752.471429	3755.076190	593
3758.467800	3761.022676	594
3765.571655	3767.807256	595
3770.789796	3773.614059	596
3774.461451	3776.746939	597
3778.492290	3780.648073	598
3782.153968	3782.853061	599
3785.496372	3791.463492	600
3801.060998	3803.186848	601
3808.663719	3809.442630	602
3810.589342	3811.258503	603
3812.634694	3815.419048	604
3816.565760	3818.970975	605
3824.198413	3826.803175	606
3828.538549	3829.397279	607
3830.992971	3833.328345	608
3836.121315	3838.556463	609
3842.965760	3852.494785	610
3858.171202	3858.860317	611
3860.346259	3861.564172	612
3863.299546	3867.899773	613
3868.667347	3874.674376	614
3875.831066	3877.148753	615
3877.956236	3880.032200	616
3881.079138	3882.905669	617
3883.892744	3888.792290	618
3889.729478	3894.589116	619
3895.845578	3900.296145	620
3901.073696	3910.552834	621
3914.762585	3916.329705	622
3917.616100	3918.135601	623
3919.531746	3919.901587	624
3920.808844	3921.448073	625
3929.698639	3930.008617	626
3933.509977	3937.581406	627
3938.758050	3939.477098	628
3942.180272	3943.617687	629
3948.136735	3948.506122	630
19.784807	20.094785	1
22.778005	23.097959	2
24.823356	25.522449	3
29.812018	30.371429	4
32.106803	32.795918	5
34.641043	35.529705	6
37.205215	37.954195	7
39.739456	40.558277	8
42.363492	43.042630	9
52.819728	53.199546	10
64.163946	64.733333	11
69.102721	69.961451	12
72.036054	72.525624	13
78.401587	78.731519	14
83.739456	84.159184	15
98.236508	98.546485	16
130.153968	130.633560	17
132.099546	133.507029	18
166.670975	167.110658	19
168.935828	170.921995	20
172.527664	173.575964	21
176.528571	177.467120	22
194.916780	195.366440	23
203.856463	204.246259	24
229.039229	229.808163	25
230.775283	231.254875	26
234.666440	235.325624	27
236.711791	237.251247	28
238.517687	239.755556	29
248.504989	249.184127	30
250.849660	252.446712	31
257.494558	258.053968	32
260.617460	260.937415	33
267.052834	268.021315	34
270.435147	271.473469	35
275.204308	275.863492	36
282.238322	283.146939	37
285.201587	285.970522	38
287.965306	289.013605	39
290.309977	290.969161	40
309.855556	310.404989	41
327.974376	329.880726	42
334.998413	337.533333	43
339.448299	339.897959	44
343.948073	344.916553	45
356.170295	356.480272	46
363.832880	366.357823	47
368.113152	369.380952	48
371.016553	376.395011	49
378.130385	379.787302	50
381.492744	382.221769	51
388.027891	389.754649	52
390.791610	393.226757	53
397.426531	398.055782	54
399.831066	400.300680	55
410.117687	410.986395	56
423.197959	423.817234	57
425.333107	427.538776	58
430.551247	432.836735	59
438.074150	440.459410	60
443.771202	445.078912	61
446.594785	447.463492	62
448.400680	453.659410	63
456.901361	457.560544	64
466.818821	467.378231	65
469.622449	472.546485	66
473.663265	474.013152	67
474.820635	475.409977	68
478.053288	478.662585	69
481.565306	483.032653	70
488.938549	490.695238	71
500.781633	504.124717	72
505.909977	506.219955	73
510.649206	516.346939	74
517.952608	519.060771	75
528.149433	528.519274	76
532.519501	533.128798	77
539.393878	542.347846	78
557.652381	558.032200	79
559.817460	564.268027	80
566.402494	569.067120	81
571.131746	573.507029	82
575.082766	577.587755	83
578.684580	579.962358	84
592.273696	597.602268	85
602.630159	603.518821	86
607.279592	610.073923	87
612.068707	612.947392	88
615.451020	616.798639	89
621.946259	622.785034	90
625.488209	629.888889	91
643.447392	646.730612	92
659.371202	660.708844	93
663.741270	664.200907	94
665.706803	666.066667	95
673.399320	674.188209	96
682.458730	683.217687	97
686.140363	690.840363	98
691.867347	693.025397	99
696.756236	697.126077	100
703.012018	704.030385	101
705.775737	706.714286	102
719.205215	719.624943	103
724.742630	725.870748	104
726.598413	736.855782	105
737.583447	745.685714	106
746.473243	754.126531	107
762.975737	763.744671	108
764.861451	765.191383	109
768.652834	768.962812	110
771.955329	774.510204	111
775.646939	776.336054	112
778.650113	779.229478	113
780.785261	781.424490	114
783.688662	784.707029	115
786.811565	787.400907	116
788.966667	789.825397	117
791.391156	791.701134	118
793.855556	795.023583	119
807.135374	807.455329	120
809.569841	809.919728	121
811.884580	812.194558	122
814.538549	815.137868	123
829.943537	831.510658	124
835.091837	837.267574	125
839.212472	839.622222	126
851.225170	854.638095	127
863.008390	863.318367	128
878.463265	879.661224	129
880.418821	881.317460	130
886.904082	887.762812	131
891.673243	892.172789	132
899.056463	901.202268	133
905.731293	906.041270	134
927.152608	927.682086	135
931.662358	934.596372	136
936.231973	936.831293	137
937.768481	941.560544	138
942.727211	944.134694	139
946.588435	948.095692	140
950.818821	952.924717	141
956.216553	957.394558	142
959.708617	960.617234	143
962.083220	963.959637	144
964.767120	965.575964	145
968.159410	969.786395	146
978.944898	979.274830	147
1001.294104	1002.112925	148
1009.904535	1010.773243	149
1013.187075	1013.497052	150
1016.160317	1016.899320	151
1028.182993	1029.999546	152
1031.814739	1033.042630	153
1034.239229	1036.305215	154
1037.421995	1038.330612	155
1039.417460	1040.715193	156
1042.350794	1044.227211	157
1045.503628	1046.631746	158
1050.681859	1050.991837	159
1053.395692	1053.705669	160
1056.099546	1056.639002	161
1060.399773	1061.378231	162
1070.417007	1071.365533	163
1080.424263	1081.342857	164
1082.240136	1083.078912	165
1084.624717	1084.984580	166
1088.146712	1089.324717	167
1093.913605	1094.752381	168
1095.619728	1096.408617	169
1098.273696	1098.932880	170
1100.867800	1104.530159	171
1106.275510	1111.803628	172
1116.133107	1117.829932	173
1118.807029	1121.471655	174
1124.514059	1125.312925	175
1126.649206	1130.740590	176
1136.935828	1140.059410	177
1142.912245	1143.651247	178
1151.582540	1152.112018	179
1155.134467	1155.963265	180
1157.259637	1162.508390	181
1163.655102	1165.252154	182
1166.498639	1168.504762	183
1169.731293	1170.041270	184
1174.051474	1174.950113	185
1176.895011	1178.761451	186
1180.905896	1181.345578	187
1182.891383	1184.568254	188
1185.415646	1186.503855	189
1187.241497	1188.200000	190
1192.938549	1196.780499	191
1198.176644	1200.960998	192
1202.297279	1202.726984	193
1203.743991	1205.321088	194
1207.116327	1207.765533	195
1208.553061	1211.536961	196
1216.185714	1216.765079	197
1218.859637	1221.773696	198
1226.412472	1227.301134	199
1228.407937	1229.935147	200
1233.755782	1235.372789	201
1237.626984	1238.246259	202
1239.622449	1241.468934	203
1244.920408	1245.819048	204
1251.315873	1251.705669	205
1289.768481	1290.527438	206
1292.003401	1292.502948	207
1293.749433	1296.244444	208
1298.159410	1305.423583	209
1306.660091	1307.648526	210
1309.094558	1312.587302	211
1318.453288	1318.803175	212
1321.157143	1322.893878	213
1323.900907	1324.240816	214
1326.016100	1326.665306	215
1329.268707	1330.795918	216
1356.426984	1356.746939	217
1367.511791	1367.971429	218
1371.772109	1373.169615	219
1374.086848	1375.055329	220
1376.601134	1380.772336	221
1382.836961	1384.044898	222
1386.548526	1388.414966	223
1404.368027	1405.047166	224
1406.523129	1411.811791	225
1413.437415	1415.752834	226
1433.032880	1433.392744	227
1438.141270	1439.798186	228
1440.665533	1440.975510	229
1443.409297	1445.235828	230
1446.552154	1447.650340	231
1450.094104	1450.404082	232
1451.620635	1452.040363	233
1485.324036	1485.733787	234
1491.829252	1493.276644	235
1494.074150	1494.563719	236
1497.805669	1499.642177	237
1501.617007	1502.445805	238
1513.120862	1514.348753	239
1515.415646	1516.843084	240
1518.817914	1521.063492	241
1525.452834	1527.299320	242
1530.820635	1531.459864	243
1537.206122	1538.573696	244
1551.373923	1552.641723	245
1553.758503	1555.824490	246
1556.691837	1557.341043	247
1558.876871	1560.234467	248
1561.021995	1562.050340	249
1563.566213	1565.063492	250
1566.699093	1567.497959	251
1569.692290	1570.580952	252
1571.987075	1572.516553	253
1574.102268	1575.469841	254
1636.081406	1636.491156	255
1643.694104	1648.284354	256
1650.309070	1652.794104	257
1697.950794	1700.405896	258
1704.605669	1707.270295	259
1714.812472	1715.262132	260
1717.885488	1718.315193	261
1727.583447	1729.799093	262
1733.609751	1735.775510	263
1736.712698	1742.649887	264
1743.387528	1753.036281	265
1753.743991	1757.845351	266
1759.810204	1764.111111	267
1766.225624	1766.685261	268
1773.738549	1775.445351	269
1779.814739	1780.693424	270
1781.979819	1782.658957	271
1784.194785	1785.542404	272
1786.499546	1788.016780	273
1789.462812	1790.501134	274
1802.473243	1806.335147	275
1812.510431	1817.659410	276
1819.893651	1820.522902	277
1821.579819	1825.461678	278
1840.726304	1841.874376	279
1842.981179	1844.967347	280
1850.144898	1851.622222	281
1854.614739	1856.211791	282
1859.284127	1860.951020	283
1864.252834	1867.815420	284
1870.079592	1871.796372	285
1875.726757	1876.375964	286
1877.183447	1877.513379	287
1878.540363	1879.159637	288
1881.204308	1882.262585	289
1909.529932	1910.997279	290
1920.425170	1920.834921	291
1921.732200	1923.259410	292
1932.717234	1933.186848	293
1934.383447	1935.292063	294
1936.109524	1936.419501	295
1939.392063	1940.071202	296
1942.554875	1944.281633	297
1957.919955	1960.125624	298
1966.490476	1968.446712	299
1969.443764	1972.856689	300
1977.305896	1979.381859	301
1994.666440	1995.355556	302
1998.148526	1998.877551	303
2003.536281	2004.015873	304
2007.926304	2010.311565	305
2011.228798	2013.145125	306
2016.995692	2021.366440	307
2040.961224	2041.580499	308
2049.960771	2050.520181	309
2053.851927	2054.940136	310
2056.126757	2056.746032	311
2058.182086	2059.958730	312
2068.708163	2069.327438	313
2075.542630	2076.141950	314
2084.751701	2088.992744	315
2095.716780	2096.585488	316
2098.719955	2102.222676	317
2103.249660	2107.720181	318
2112.099546	2112.409524	319
2114.334467	2114.644444	320
2118.804308	2119.832653	321
2127.714059	2128.622676	322
2130.378005	2132.783220	323
2133.880045	2135.846259	324
2137.292290	2138.390476	325
2142.670068	2143.548753	326
2152.158503	2153.466213	327
2159.791156	2161.158730	328
2179.007483	2179.616780	329
2180.434240	2183.817234	330
2186.899546	2188.706122	331
2198.832426	2199.142404	332
2202.025170	2202.853968	333
2206.904082	2208.261678	334
2208.969388	2210.865760	335
2211.683220	2212.771429	336
2213.818367	2214.786848	337
2216.921315	2221.391837	338
2226.739002	2227.627664	339
2228.854195	2229.373696	340
2240.308163	2240.837642	341
2242.453288	2243.102494	342
2244.937642	2245.487075	343
2247.591610	2248.160998	344
2252.799773	2253.249433	345
2328.487755	2329.446259	346
2334.174830	2335.193197	347
2336.659184	2336.969161	348
2338.395238	2341.009977	349
2351.305896	2351.785488	350
2352.612925	2352.982766	351
2359.407483	2359.817234	352
2379.142630	2379.522449	353
2390.526757	2390.866667	354
2423.202494	2424.929252	355
2427.792063	2429.997732	356
2431.453741	2432.212698	357
2436.971202	2437.570522	358
2438.457823	2441.411791	359
2443.346712	2444.365079	360
2462.612925	2463.132426	361
2467.212472	2471.473469	362
2472.600227	2473.139683	363
2480.013379	2481.979592	364
2484.782540	2485.272109	365
2487.745805	2488.504762	366
2493.153515	2494.680726	367
2497.543537	2499.958730	368
2501.813832	2506.593651	369
2511.541723	2512.380499	370
2514.943991	2521.858957	371
2526.876871	2527.376417	372
2528.493197	2532.764172	373
2536.774376	2537.214059	374
2542.521315	2543.020862	375
2544.007937	2546.912018	376
2547.819274	2548.388662	377
2551.900000	2552.808617	378
2553.536281	2559.553288	379
2563.413832	2570.668027	380
2572.114059	2575.826304	381
2578.110431	2579.657596	382
2599.940816	2600.759637	383
2602.056009	2602.655329	384
2604.540363	2605.369161	385
2606.725397	2607.404535	386
2644.908617	2645.497959	387
2656.442404	2657.001814	388
2675.000227	2675.310204	389
2692.310884	2697.619501	390
2698.536735	2699.006349	391
2701.150794	2701.460771	392
2706.877778	2708.863946	393
2709.771202	2710.779592	394
2712.524943	2714.600907	395
2716.356236	2717.454422	396
2719.728571	2720.317914	397
2722.881406	2724.498413	398
2726.702721	2729.576871	399
2742.875964	2743.994104	400
2749.600680	2752.724263	401
2754.858730	2756.984580	402
2758.300907	2759.588662	403
2761.094558	2762.901134	404
2764.925850	2765.315646	405
2766.621995	2769.027211	406
2770.243764	2772.150113	407
2773.386621	2774.115646	408
2775.112698	2776.360544	409
2777.237868	2778.755102	410
2783.423810	2783.863492	411
2784.870522	2785.968707	412
2788.073243	2788.463039	413
2792.054195	2792.364172	414
2796.184807	2796.564626	415
2809.793878	2812.368707	416
2813.275964	2830.527438	417
2838.588435	2841.781859	418
2842.748980	2844.785034	419
2846.430612	2847.249433	420
2848.056916	2850.013152	421
2852.417007	2853.934240	422
2855.150794	2856.468481	423
2859.031973	2859.681179	424
2863.032880	2864.899320	425
2866.275510	2867.772789	426
2868.809751	2870.117460	427
2873.548980	2874.158277	428
2875.933560	2876.343311	429
2885.431973	2887.248526	430
2892.745351	2893.254875	431
2900.777098	2902.244444	432
2910.325397	2910.904762	433
2912.091383	2915.394558	434
2916.162132	2916.631746	435
2921.300454	2921.610431	436
2924.592971	2931.677551	437
2932.435147	2933.842630	438
2936.515873	2937.883447	439
2945.904535	2946.214512	440
2949.466440	2952.081179	441
2953.946259	2956.291610	442
2960.431519	2961.190476	443
2963.923583	2964.971882	444
2966.737188	2967.047166	445
2972.723583	2973.941497	446
2978.789796	2982.142857	447
2988.717234	2990.224490	448
2994.104989	2996.560091	449
2997.587075	2998.595465	450
3001.328571	3004.631746	451
3007.883673	3013.441723	452
3016.683673	3017.382766	453
3027.080045	3028.377778	454
3029.314966	3031.101587	455
3033.016553	3033.466213	456
3035.261451	3037.776417	457
3038.524036	3040.390476	458
3048.012472	3049.669388	459
3050.546712	3052.702494	460
3058.778005	3059.437188	461
3060.234694	3060.684354	462
3061.990703	3062.689796	463
3065.592517	3066.521088	464
3075.430159	3077.496145	465
3085.457370	3087.124263	466
3088.350794	3089.648526	467
3095.793878	3096.423129	468
3128.339909	3128.799546	469
3131.123583	3131.982313	470
3133.987075	3135.045351	471
3136.501361	3137.729252	472
3138.895918	3140.153741	473
3143.445578	3144.164626	474
3155.767574	3156.775964	475
3160.536735	3160.846712	476
3172.050567	3172.969161	477
3174.784354	3175.094331	478
3179.064626	3183.345578	479
3187.894558	3188.354195	480
3189.530839	3190.259864	481
3192.543991	3194.210884	482
3197.283220	3199.448980	483
3203.529025	3204.736961	484
3206.641950	3208.717914	485
3209.605215	3211.371882	486
3212.867800	3213.856236	487
3216.629252	3219.673016	488
3221.977098	3222.406803	489
3224.521315	3224.901134	490
3228.761678	3231.605896	491
3236.104989	3239.009070	492
3249.045578	3249.415420	493
3253.325850	3256.449433	494
3259.831066	3260.490249	495
3261.367574	3262.914739	496
3266.246485	3267.903401	497
3269.239683	3271.794558	498
3274.228345	3276.763265	499
3293.285034	3293.884354	500
3314.337188	3314.776871	501
3317.390249	3320.354195	502
3324.065079	3325.013605	503
3326.389796	3328.635374	504
3329.821995	3334.262585	505
3335.908163	3336.627211	506
3337.654195	3338.522902	507
3340.846939	3341.685714	508
3342.732653	3343.172336	509
3345.217007	3345.846259	510
3351.313152	3352.102041	511
3373.462812	3374.690703	512
3380.995692	3382.522902	513
3392.748980	3393.248526	514
3398.156689	3398.546485	515
3400.591156	3401.080726	516
3437.607029	3438.555556	517
3439.522676	3440.112018	518
3441.518141	3442.815873	519
3449.390249	3449.949660	520
3465.343991	3470.053968	521
3470.851474	3473.775510	522
3476.797959	3477.806349	523
3484.670068	3485.907937	524
3488.361678	3492.951927	525
3496.642857	3497.302041	526
3511.548980	3513.515193	527
3514.412472	3519.820862	528
3520.738095	3521.956009	529
3531.962585	3539.735601	530
3540.543084	3542.938322	531
3546.010658	3547.567800	532
3551.827438	3552.985488	533
3554.651020	3555.150567	534
3564.089569	3564.878458	535
3565.845578	3567.342857	536
3568.868707	3571.483447	537
3573.258730	3573.578685	538
3577.718594	3578.717007	539
3582.677324	3583.166893	540
3588.095011	3588.664399	541
3593.323129	3594.900227	542
3604.916780	3605.955102	543
3615.023810	3615.443537	544
3628.573016	3629.062585	545
3640.904989	3641.643991	546
3646.731746	3647.660317	547
3657.936281	3662.466667	548
3683.148980	3683.558730	549
3692.487755	3692.927438	550
3728.565760	3728.875737	551
3731.050113	3732.617234	552
3766.589342	3771.019955	553
3772.775283	3775.839002	554
3778.492290	3779.191383	555
3780.397959	3781.705669	556
3782.483220	3783.341950	557
3784.538549	3785.806349	558
3788.649206	3789.717460	559
3791.802041	3795.374603	560
3803.305896	3803.995011	561
3811.437415	3811.956916	562
3815.587982	3816.137415	563
3819.479138	3821.146032	564
3826.153968	3828.449433	565
3830.893197	3831.382766	566
3832.439683	3834.795011	567
3836.310884	3837.329252	568
3838.505896	3841.250340	569
3846.248299	3846.608163	570
3913.575283	3913.955102	571
3914.822449	3915.132426	572
3916.418821	3916.868481	573
3919.481859	3920.709751	574
3921.876417	3923.882540	575
3928.860544	3929.360091	576
3936.163946	3936.473923	577
3937.760317	3942.510204	578
3943.607029	3945.014512	579
3945.841950	3946.541043	580
16.891383	23.786395	1
24.534014	37.156009	2
45.715873	47.672109	3
63.794785	65.172336	4
69.980726	70.849433	5
72.924036	73.373696	6
77.294104	77.893424	7
80.496825	82.552834	8
83.709524	84.029478	9
126.761678	127.101587	10
130.792517	132.559184	11
166.820635	167.190476	12
183.033787	184.930159	13
189.449206	191.345578	14
198.339002	200.105669	15
201.501814	203.687528	16
229.099093	229.638549	17
230.465986	232.152834	18
233.648753	236.582766	19
241.261451	241.880726	20
242.728118	244.115646	21
245.342177	247.098866	22
248.425170	252.107483	23
253.194331	253.723810	24
289.671429	290.041270	25
329.660544	329.970522	26
331.935374	333.761905	27
339.987075	340.945578	28
344.277324	344.587302	29
356.120408	359.184127	30
387.908163	388.397732	31
437.665079	438.054875	32
452.670975	456.762358	33
457.529932	459.645805	34
468.963946	470.690703	35
471.398413	474.043084	36
474.970295	477.285714	37
491.153515	499.894331	38
500.771655	503.176871	39
621.966213	622.276190	40
631.983447	632.463039	41
652.167574	652.517460	42
653.734014	655.311111	43
657.914512	659.361905	44
660.917687	661.507029	45
681.460998	682.658957	46
766.577551	766.967347	47
770.378912	772.544671	48
840.629252	841.936961	49
846.226531	846.576417	50
849.469161	849.789116	51
852.282766	853.520635	52
875.978912	880.170068	53
890.944898	891.883447	54
919.968934	920.658050	55
928.150340	928.580045	56
929.407483	929.757370	57
931.861905	932.181859	58
933.827438	934.307029	59
998.829705	1001.424490	60
1004.875964	1005.944218	61
1015.002948	1017.647619	62
1050.562132	1051.251247	63
1055.351247	1056.688889	64
1060.160317	1062.894785	65
1076.992063	1080.165533	66
1108.420635	1109.558730	67
1144.019728	1145.497052	68
1169.122676	1170.111111	69
1193.577098	1193.917007	70
1200.032426	1201.469841	71
1216.435147	1217.443537	72
1235.691383	1236.550113	73
1246.576644	1246.886621	74
1248.841497	1249.151474	75
1251.415646	1251.755556	76
1255.007483	1257.452608	77
1264.356236	1264.676190	78
1274.712698	1275.930612	79
1394.101361	1394.441270	80
1398.351701	1403.650340	81
1404.387982	1405.216780	82
1406.453288	1407.202268	83
1409.107256	1409.776417	84
1411.571655	1411.881633	85
1413.537188	1414.036735	86
1414.934014	1415.423583	87
1432.683673	1433.223129	88
1482.959410	1484.227211	89
1486.182086	1486.931066	90
1531.479138	1533.964172	91
1559.954422	1560.404082	92
1575.409297	1575.988662	93
1581.236054	1581.546032	94
1650.418821	1650.878458	95
1695.097279	1697.083447	96
1700.465079	1701.852608	97
1702.759864	1703.409070	98
1719.631519	1722.056689	99
1723.712245	1725.937868	100
1730.875964	1733.291156	101
1738.139456	1738.609070	102
1746.580272	1746.910204	103
1758.223810	1758.773243	104
1765.287755	1765.877098	105
1767.931746	1768.491156	106
1770.186621	1772.162812	107
1805.995238	1813.029932	108
1817.638776	1818.956463	109
1819.853741	1821.291156	110
1823.166213	1824.044898	111
1846.573016	1847.112472	112
1881.593424	1882.841270	113
1896.798866	1898.276190	114
1907.454649	1908.393197	115
1914.578458	1914.888435	116
1923.897279	1924.945578	117
1942.544898	1944.082086	118
1948.002494	1953.101587	119
1953.849206	1957.361905	120
1959.646032	1961.851701	121
1966.021542	1966.471202	122
1998.008844	1998.428571	123
2004.543991	2005.791837	124
2024.279138	2024.648980	125
2080.102268	2081.240363	126
2090.219274	2092.993651	127
2145.453741	2150.592744	128
2172.422449	2175.007256	129
2188.126757	2188.736054	130
2204.180272	2204.759637	131
2207.921769	2208.900227	132
2226.359864	2227.507937	133
2351.066440	2351.695692	134
2359.547166	2360.076644	135
2366.321769	2368.178231	136
2370.332653	2371.211338	137
2379.721315	2380.031293	138
2427.861905	2428.471202	139
2516.470522	2518.067574	140
2522.157596	2526.169161	141
2527.196145	2529.641270	142
2535.297732	2535.797279	143
2591.021088	2592.139229	144
2593.026531	2600.639909	145
2601.377551	2604.640816	146
2605.927211	2610.258050	147
2611.205215	2612.333333	148
2613.250567	2621.033560	149
2691.522676	2691.832653	150
2701.490023	2705.790930	151
2721.953515	2723.750113	152
2727.101814	2728.449433	153
2731.232426	2731.871655	154
2749.660544	2751.536961	155
2753.002948	2753.642177	156
2756.844218	2758.610884	157
2783.773016	2784.202721	158
2876.023356	2877.151474	159
2902.732653	2904.219955	160
2935.368481	2935.728345	161
2952.888662	2955.383673	162
2965.869161	2971.287528	163
2973.721315	2974.310658	164
2975.836508	2976.306122	165
2984.047846	2984.437642	166
3155.558050	3156.297052	167
3247.798413	3248.118367	168
3256.708163	3258.075737	169
3261.197959	3261.926984	170
3271.833787	3274.887528	171
3313.918141	3314.587302	172
3374.370748	3374.780499	173
3394.325397	3394.645351	174
3491.664172	3491.974150	175
3567.631519	3568.250794	176
3571.023810	3572.052154	177
3574.386168	3576.831293	178
3599.149887	3599.459864	179
3610.174830	3610.494785	180
3613.138095	3614.126531	181
3705.188889	3721.023583	182
3794.785261	3797.699320	183
3798.417007	3801.550567	184
3803.146259	3810.270748	185
3933.420181	3933.959637	186
3935.515420	3936.483900	187
3937.510884	3938.778685	188
3939.576190	3940.305215	189
3942.509524	3942.819501	190
3943.597052	3944.525624	191
3945.881859	3946.421315	192
