% file automatically generated by expertdet.R
% printPerformanceARFFfile(vocdf = makeRawVocDataSet(), file = "../data/all-raw-voclevel.arff",     individual = F, anonymous = T)

@RELATION mmla

@ATTRIBUTE Pause                                       REAL
@ATTRIBUTE SwitchingPause                              REAL
@ATTRIBUTE Vocalisation                                REAL
@ATTRIBUTE SwitchingVocalisation                       REAL
@ATTRIBUTE GrpVocalisation                             REAL
@ATTRIBUTE GrpSwitchingPause                           REAL
@ATTRIBUTE Pause-Pause                                 REAL
@ATTRIBUTE SwitchingPause-Pause                        REAL
@ATTRIBUTE Vocalisation-Pause                          REAL
@ATTRIBUTE SwitchingVocalisation-Pause                 REAL
@ATTRIBUTE GrpVocalisation-Pause                       REAL
@ATTRIBUTE GrpSwitchingPause-Pause                     REAL
@ATTRIBUTE Pause-SwitchingPause                        REAL
@ATTRIBUTE SwitchingPause-SwitchingPause               REAL
@ATTRIBUTE Vocalisation-SwitchingPause                 REAL
@ATTRIBUTE SwitchingVocalisation-SwitchingPause        REAL
@ATTRIBUTE GrpVocalisation-SwitchingPause              REAL
@ATTRIBUTE GrpSwitchingPause-SwitchingPause            REAL
@ATTRIBUTE Pause-Vocalisation                          REAL
@ATTRIBUTE SwitchingPause-Vocalisation                 REAL
@ATTRIBUTE Vocalisation-Vocalisation                   REAL
@ATTRIBUTE SwitchingVocalisation-Vocalisation          REAL
@ATTRIBUTE GrpVocalisation-Vocalisation                REAL
@ATTRIBUTE GrpSwitchingPause-Vocalisation              REAL
@ATTRIBUTE Pause-SwitchingVocalisation                 REAL
@ATTRIBUTE SwitchingPause-SwitchingVocalisation        REAL
@ATTRIBUTE Vocalisation-SwitchingVocalisation          REAL
@ATTRIBUTE SwitchingVocalisation-SwitchingVocalisation REAL
@ATTRIBUTE GrpVocalisation-SwitchingVocalisation       REAL
@ATTRIBUTE GrpSwitchingPause-SwitchingVocalisation     REAL
@ATTRIBUTE Pause-GrpVocalisation                       REAL
@ATTRIBUTE SwitchingPause-GrpVocalisation              REAL
@ATTRIBUTE Vocalisation-GrpVocalisation                REAL
@ATTRIBUTE SwitchingVocalisation-GrpVocalisation       REAL
@ATTRIBUTE GrpVocalisation-GrpVocalisation             REAL
@ATTRIBUTE GrpSwitchingPause-GrpVocalisation           REAL
@ATTRIBUTE Pause-GrpSwitchingPause                     REAL
@ATTRIBUTE SwitchingPause-GrpSwitchingPause            REAL
@ATTRIBUTE Vocalisation-GrpSwitchingPause              REAL
@ATTRIBUTE SwitchingVocalisation-GrpSwitchingPause     REAL
@ATTRIBUTE GrpVocalisation-GrpSwitchingPause           REAL
@ATTRIBUTE GrpSwitchingPause-GrpSwitchingPause         REAL
@ATTRIBUTE correct {TRUE,FALSE}


@DATA
0.00166389351081531,0.242928452579035,0.6738768718802,0.0183028286189684,0.0632279534109817,0,0,0,0,0,0,0,1,0.897260273972603,0.0346534653465347,0,0,0,0,0.102739726027397,0.928217821782178,1,0.105263157894737,0,0,0,0.0247524752475248,0,0.0263157894736842,0,0,0,0.0123762376237624,0,0.868421052631579,0,0,0,0,0,0,0,TRUE
0.00102986611740474,0.220391349124614,0.677651905252317,0.0133882595262616,0.0875386199794027,0,0,0,0,0,0,0,1,0.897196261682243,0.0319148936170213,0,0,0,0,0.0981308411214953,0.93161094224924,1,0.130952380952381,0,0,0,0.0182370820668693,0,0.0119047619047619,0,0,0.00467289719626168,0.0182370820668693,0,0.857142857142857,0,0,0,0,0,0,0,TRUE
0.00109769484083425,0.395170142700329,0.500548847420417,0.0109769484083425,0.0922063666300768,0,0,0,0,0,0,0,1,0.936111111111111,0.0483516483516484,0,0,0,0,0.0611111111111111,0.914285714285714,1,0.0952380952380952,0,0,0,0.0197802197802198,0,0.0119047619047619,0,0,0.00277777777777778,0.0175824175824176,0,0.892857142857143,0,0,0,0,0,0,0,TRUE
0.00113507377979569,0.288308740068104,0.611804767309875,0.0136208853575482,0.0851305334846765,0,0,0,0,0,0,0,1,0.913385826771654,0.0390334572490706,0,0,0,0,0.0826771653543307,0.925650557620818,1,0.106666666666667,0,0,0.00393700787401575,0.0185873605947955,0,0.0133333333333333,0,0,0,0.016728624535316,0,0.88,0,0,0,0,0,0,0,FALSE
0.00453514739229025,0.106575963718821,0.72562358276644,0.0226757369614512,0.140589569160998,0,0,0.0212765957446809,0,0,0,0,1,0.851063829787234,0.01875,0,0,0,0,0.106382978723404,0.928125,1,0.129032258064516,0,0,0,0.03125,0,0,0,0,0.0212765957446809,0.021875,0,0.870967741935484,0,0,0,0,0,0,0,TRUE
0.00191938579654511,0.238003838771593,0.618042226487524,0.0153550863723608,0.126679462571977,0,0,0,0,0,0,0,1,0.919354838709677,0.0280373831775701,0,0,0,0,0.0806451612903226,0.909657320872274,1,0.181818181818182,0,0,0,0.0249221183800623,0,0,0,0,0,0.0373831775700935,0,0.818181818181818,0,0,0,0,0,0,0,TRUE
0.000648929266709929,0.122647631408177,0.742375081116158,0.0129785853341986,0.121349772874757,0,0,0,0,0,0,0,1,0.862433862433862,0.0218722659667542,0,0,0,0,0.132275132275132,0.939632545931758,1,0.133689839572193,0,0,0,0.0174978127734033,0,0,0,0,0.00529100529100529,0.020997375328084,0,0.866310160427808,0,0,0,0,0,0,0,FALSE
0.000413052457662123,0.18876497315159,0.689797604295746,0.0144568360181743,0.106567534076828,0,0,0,0,0,0,0,1,0.908096280087527,0.024565608148592,0,0,0,0,0.0897155361050328,0.932893948472139,1,0.143410852713178,0,0,0.00218818380743982,0.0203714799281007,0,0,0,0,0,0.0221689634511684,0,0.856589147286822,0,0,0,0,0,0,0,FALSE
0.00074019245003701,0.165062916358253,0.686898593634345,0.00666173205033309,0.140636565507032,0,0,0,0,0,0,0,1,0.896860986547085,0.0237324703344121,0,0,0,0,0.0986547085201794,0.944983818770227,1,0.110526315789474,0,0,0,0.00970873786407767,0,0,0,0,0.00448430493273543,0.0215749730312837,0,0.889473684210526,0,0,0,0,0,0,0,TRUE
0.00113507377979569,0.18955732122588,0.611804767309875,0.0102156640181612,0.187287173666288,0,0,0,0,0,0,0,1,0.922155688622755,0.0223048327137546,0,0,0,0,0.0658682634730539,0.940520446096654,1,0.0787878787878788,0,0,0.0119760479041916,0.0130111524163569,0,0,0,0,0,0.0241635687732342,0,0.921212121212121,0,0,0,0,0,0,0,TRUE
0.00070871722182849,0.155917788802268,0.698086463501063,0.0155917788802268,0.129695251594614,0,0,0,0,0,0,0,1,0.872727272727273,0.0274390243902439,0,0,0,0,0.122727272727273,0.926829268292683,1,0.131147540983607,0,0,0,0.0223577235772358,0,0,0,0,0.00454545454545455,0.0233739837398374,0,0.868852459016393,0,0,0,0,0,0,0,TRUE
0.000512557662737058,0.186058431573552,0.601230138390569,0.0189646335212711,0.192721681189134,0.000512557662737058,0,0,0,0,0,0,1,0.903581267217631,0.0281569965870307,0,0,1,0,0.0909090909090909,0.914675767918089,1,0.0824468085106383,0,0,0.00550964187327824,0.0290102389078498,0,0.00265957446808511,0,0,0,0.0281569965870307,0,0.912234042553192,0,0,0,0,0,0.00265957446808511,0,TRUE
0.0016366612111293,0.1620294599018,0.556464811783961,0.0196399345335516,0.258592471358429,0.0016366612111293,0,0,0,0,0,0,1,0.929292929292929,0.0147492625368732,0,0,1,0,0.0606060606060606,0.911504424778761,1,0.0822784810126582,0,0,0.0101010101010101,0.0324483775811209,0,0,0,0,0,0.0412979351032448,0,0.911392405063291,0,0,0,0,0,0.00632911392405063,0,TRUE
0.00106269925611052,0.12327311370882,0.452709883103082,0.0170031880977683,0.405951115834219,0,0,0,0,0,0,0,1,0.896551724137931,0.0258823529411765,0,0,0,0,0.0948275862068965,0.872941176470588,1,0.0732984293193717,0,0,0,0.0352941176470588,0,0.00261780104712042,0,0,0.00862068965517241,0.0658823529411765,0,0.924083769633508,0,0,0,0,0,0,0,TRUE
0.0013869625520111,0.0859916782246879,0.704576976421637,0.0110957004160888,0.196948682385576,0,0,0,0,0,0,0,1,0.838709677419355,0.0177165354330709,0,0,0,0,0.161290322580645,0.938976377952756,1,0.0921985815602837,0,0,0,0.015748031496063,0,0,0,0,0,0.0275590551181102,0,0.907801418439716,0,0,0,0,0,0,0,TRUE
0.000703729767769177,0.151301900070373,0.617171006333568,0.0147783251231527,0.216045038705137,0,0,0,0,0,0,0,1,0.906976744186046,0.0216647662485747,0,0,0,0,0.0883720930232558,0.92018244013683,1,0.0980392156862745,0,0,0.00465116279069767,0.0216647662485747,0,0.00326797385620915,0,0,0,0.0364880273660205,0,0.898692810457516,0,0,0,0,0,0,0,TRUE
0.0056980056980057,0.282051282051282,0.584045584045584,0,0.128205128205128,0,0,0.0101010101010101,0,0,0,0,1,0.898989898989899,0.0439024390243902,0,0,0,0,0.0909090909090909,0.936585365853659,0,0.0888888888888889,0,0,0,0,0,0,0,0,0,0.0195121951219512,0,0.911111111111111,0,0,0,0,0,0,0,TRUE
0.00153609831029186,0.28110599078341,0.639016897081413,0.00768049155145929,0.0706605222734255,0,0,0,0,0,0,0,1,0.92896174863388,0.0289156626506024,0,0,0,0,0.0710382513661202,0.937349397590361,1,0.195652173913043,0,0,0,0.0120481927710843,0,0,0,0,0,0.0216867469879518,0,0.804347826086957,0,0,0,0,0,0,0,TRUE
0.00322061191626409,0.368760064412238,0.573268921095008,0.00483091787439614,0.0499194847020934,0,0,0,0.00280898876404494,0,0,0,1,0.912663755458515,0.0533707865168539,0,0,0,0,0.0873362445414847,0.915730337078652,1,0.225806451612903,0,0,0,0.00842696629213483,0,0,0,0,0,0.0196629213483146,0,0.774193548387097,0,0,0,0,0,0,0,TRUE
0.00110987791342952,0.172031076581576,0.661487236403996,0.0133185349611543,0.152053274139845,0,0,0,0,0,0,0,1,0.864516129032258,0.0336134453781513,0,0,0,0,0.135483870967742,0.921008403361344,1,0.109489051094891,0,0,0,0.0184873949579832,0,0.0072992700729927,0,0,0,0.026890756302521,0,0.883211678832117,0,0,0,0,0,0,0,TRUE
0.000786782061369001,0.107789142407553,0.626278520849725,0.011801730920535,0.253343823760818,0,0,0,0,0,0,0,1,0.861313868613139,0.0226130653266332,0,0,0,0,0.131386861313869,0.924623115577889,1,0.0841121495327103,0,0,0,0.0188442211055276,0,0,0,0,0.0072992700729927,0.0339195979899497,0,0.91588785046729,0,0,0,0,0,0,0,FALSE
0.00133155792276964,0.157123834886818,0.693741677762983,0.0199733688415446,0.127829560585885,0,0,0,0,0,0,0,1,0.88135593220339,0.0249520153550864,0,0,0,0,0.11864406779661,0.923224568138196,1,0.115789473684211,0,0,0,0.0287907869481766,0,0,0,0,0,0.0230326295585413,0,0.884210526315789,0,0,0,0,0,0,0,TRUE
0.000640614990390775,0.135169762972454,0.607943625880846,0.0108904548366432,0.245355541319667,0,0,0,0,0,0,0,1,0.862559241706161,0.029535864978903,0,0,0,0,0.123222748815166,0.915611814345992,1,0.0992167101827676,0,0,0.004739336492891,0.0158227848101266,0,0.00261096605744125,0,0,0.00947867298578199,0.0390295358649789,0,0.898172323759791,0,0,0,0,0,0,0,TRUE
0.00302571860816944,0.232980332829047,0.571860816944024,0.00605143721633888,0.186081694402421,0,0,0.00649350649350649,0,0,0,0,1,0.896103896103896,0.0396825396825397,0,0,0,0,0.0974025974025974,0.915343915343915,1,0.105691056910569,0,0,0,0.0105820105820106,0,0,0,0,0,0.0343915343915344,0,0.894308943089431,0,0,0,0,0,0,0,TRUE
0.0014903129657228,0.129657228017884,0.697466467958271,0.0104321907600596,0.160953800298063,0,0,0,0,0,0,0,0,0.919540229885057,0.014957264957265,0,0,0,1,0.0689655172413793,0.952991452991453,1,0.0747663551401869,0,0,0,0.014957264957265,0,0,0,0,0.0114942528735632,0.0170940170940171,0,0.925233644859813,0,0,0,0,0,0,0,TRUE
0.000774593338497289,0.0898528272656855,0.647560030983733,0.00929512006196747,0.252517428350116,0,0,0,0,0,0,0,1,0.853448275862069,0.0191616766467066,0,0,0,0,0.137931034482759,0.930538922155689,1,0.0950920245398773,0,0,0,0.0143712574850299,0,0,0,0,0.00862068965517241,0.0359281437125748,0,0.904907975460123,0,0,0,0,0,0,0,TRUE
0.00188323917137476,0.096045197740113,0.694915254237288,0.0169491525423729,0.190207156308851,0,0,0,0,0,0,0,1,0.823529411764706,0.021680216802168,0,0,0,0,0.156862745098039,0.929539295392954,1,0.09,0,0,0,0.024390243902439,0,0,0,0,0.0196078431372549,0.024390243902439,0,0.91,0,0,0,0,0,0,0,TRUE
0.000832639467110741,0.203996669442132,0.582847626977519,0.0124895920066611,0.199833472106578,0,0,0,0,0,0,0,1,0.906122448979592,0.0314735336194564,0,0,0,0,0.0938775510204082,0.915593705293276,1,0.0916666666666667,0,0,0,0.0185979971387697,0,0.00833333333333333,0,0,0,0.0343347639484979,0,0.9,0,0,0,0,0,0,0,TRUE
0.0013869625520111,0.0693481276005548,0.636615811373093,0.0194174757281553,0.271844660194175,0.0013869625520111,0,0,0,0,0,0,1,0.84,0.0130718954248366,0,0,1,0,0.16,0.908496732026144,1,0.102564102564103,0,0,0,0.028322440087146,0,0.00512820512820513,0,0,0,0.0501089324618736,0,0.887179487179487,0,0,0,0,0,0.00512820512820513,0,TRUE
0.00134952766531714,0.214574898785425,0.508771929824561,0.00539811066126856,0.268556005398111,0.00134952766531714,0,0,0,0,0,0,1,0.886792452830189,0.0425531914893617,0,0,1,0,0.113207547169811,0.893617021276596,1,0.0954773869346734,0,0,0,0.00797872340425532,0,0.0050251256281407,0,0,0,0.0558510638297872,0,0.894472361809045,0,0,0,0,0,0.0050251256281407,0,TRUE
0.000846740050804403,0.110076206604572,0.651143099068586,0.0169348010160881,0.220999153259949,0,0,0,0,0,0,0,1,0.892307692307692,0.0169050715214564,0,0,0,0,0.1,0.933680104031209,1,0.0692307692307692,0,0,0.00769230769230769,0.0221066319895969,0,0.00769230769230769,0,0,0,0.0273081924577373,0,0.923076923076923,0,0,0,0,0,0,0,TRUE
0.000347101700798334,0.116973273169039,0.606386671294689,0.0131898646303367,0.263103089205137,0,0,0,0,0,0,0,1,0.872403560830861,0.0240549828178694,0,0,0,0,0.118694362017804,0.916380297823597,1,0.0910290237467019,0,0,0,0.0206185567010309,0,0.00263852242744063,0,0,0.00890207715133531,0.0389461626575029,0,0.906332453825857,0,0,0,0,0,0,0,FALSE
0.00203873598369011,0.281345565749235,0.590214067278288,0.00203873598369011,0.124362895005097,0,0,0.0036231884057971,0,0,0,0,1,0.920289855072464,0.0362694300518135,0,0,0,0,0.0760869565217391,0.929188255613126,1,0.147540983606557,0,0,0,0.00172711571675302,0,0.00819672131147541,0,0,0,0.0328151986183074,0,0.844262295081967,0,0,0,0,0,0,0,TRUE
0.000751314800901578,0.187828700225394,0.549211119459053,0.00826446280991736,0.253193087903832,0.000751314800901578,0,0,0,0,0,0,1,0.928,0.0219178082191781,0,0,1,0,0.072,0.920547945205479,1,0.0890207715133531,0,0,0,0.0150684931506849,0,0,0,0,0,0.0424657534246575,0,0.908011869436202,0,0,0,0,0,0.0029673590504451,0,FALSE
0.000245639891918448,0.28322279538197,0.532056005895357,0.00663227708179808,0.176369442397445,0.00147383935151069,0,0,0,0,0,0,1,0.928013876843018,0.0355658198614319,0,0,0.833333333333333,0,0.0719861231569818,0.919630484988453,1,0.0891364902506964,0.166666666666667,0,0,0.0120092378752887,0,0.00139275766016713,0,0,0,0.0327944572748268,0,0.901114206128134,0,0,0,0,0,0.00835654596100279,0,FALSE
0.000847098686997035,0.253282507412114,0.570520965692503,0.00381194409148666,0.170266836086404,0.00127064803049555,0,0.00167224080267559,0,0,0,0,1,0.921404682274248,0.0319227913882702,0,0,1,0,0.0752508361204013,0.925760950259837,1,0.114427860696517,0,0,0,0.0066815144766147,0,0,0,0,0.00167224080267559,0.0356347438752784,0,0.878109452736318,0,0,0,0,0,0.00746268656716418,0,TRUE
0.000252461499621308,0.213329967180005,0.531683918202474,0.00454430699318354,0.250189346124716,0,0,0,0,0,0,0,1,0.917159763313609,0.0327790973871734,0,0,0,0,0.0792899408284024,0.923990498812352,1,0.0766902119071645,0,0,0,0.00807600950118765,0,0.00100908173562059,0,0,0.00355029585798817,0.0351543942992874,0,0.922300706357215,0,0,0,0,0,0,0,FALSE
0.000372995151063036,0.252144722118612,0.538977993286087,0.00335695635956733,0.204774337933607,0.000372995151063036,0,0,0,0,0,0,1,0.909763313609467,0.0408587257617729,0,0,1,0,0.0872781065088757,0.921052631578947,1,0.0856102003642987,0,0,0,0.00623268698060942,0,0,0,0,0.0029585798816568,0.0318559556786704,0,0.912568306010929,0,0,0,0,0,0.00182149362477231,0,FALSE
0.000473709142586452,0.192325911890099,0.565608716248224,0.00757934628138323,0.233064898152534,0.000947418285172904,0,0,0,0,0,0,1,0.903940886699507,0.0301507537688442,0,0,1,0,0.0911330049261084,0.922948073701843,1,0.0794297352342159,0,0,0,0.0134003350083752,0,0,0,0,0.00492610837438424,0.033500837520938,0,0.916496945010183,0,0,0,0,0,0.00407331975560081,0,FALSE
0.000407996736026112,0.184822521419829,0.58547531619747,0.00652794777641779,0.222766217870257,0,0,0,0,0,0,0,1,0.907284768211921,0.0285913528591353,0,0,0,0,0.0927152317880795,0.927475592747559,1,0.0860805860805861,0,0,0,0.0111576011157601,0,0,0,0,0,0.0327754532775453,0,0.913919413919414,0,0,0,0,0,0,0,FALSE
0.00128122998078155,0.0992953235105701,0.588725176169122,0.00832799487508008,0.302370275464446,0,0,0.00645161290322581,0,0,0,0,1,0.87741935483871,0.0195865070729053,0,0,0,0,0.109677419354839,0.936887921653972,1,0.0593220338983051,0,0,0.00645161290322581,0.0119695321001088,0,0.00211864406779661,0,0,0,0.0315560391730141,0,0.938559322033898,0,0,0,0,0,0,0,TRUE
0.000151263046437755,0.208440477991227,0.609287551051278,0.00484041748600817,0.177129027378611,0.000151263046437755,0,0,0,0,0,0,1,0.923076923076923,0.0258256766823938,0,0,1,0,0.0747460087082729,0.940402284579091,1,0.0905209222886422,0,0,0.000725689404934688,0.00769803824186739,0,0,0,0,0.00145137880986938,0.0260740004966476,0,0.908625106746371,0,0,0,0,0,0.00085397096498719,0,FALSE
0.00020116676725005,0.353651176825588,0.444980889157111,0.00362100181050091,0.197143431905049,0.000402333534500101,0,0,0,0,0,0,1,0.934584755403868,0.0506558118498417,0,0,1,0,0.0642775881683731,0.90547263681592,0.944444444444444,0.0816326530612245,0,0,0,0.00723654454997739,0.0555555555555556,0.00102040816326531,0,0,0.00113765642775882,0.0366350067842605,0,0.91530612244898,0,0,0,0,0,0.00204081632653061,0,FALSE
0.000364830353885443,0.300985041955491,0.505654870485224,0.00474279460051076,0.187522801897118,0.000729660707770887,0,0,0,0,0,0,1,0.918787878787879,0.0462093862815884,0,0,1,0,0.0751515151515151,0.911913357400722,1,0.0933852140077821,0,0,0.00121212121212121,0.00866425992779783,0,0,0,0,0.00484848484848485,0.0332129963898917,0,0.90272373540856,0,0,0,0,0,0.00389105058365759,0,FALSE
0.000620732464307883,0.159528243327126,0.559279950341403,0.00620732464307883,0.274363749224084,0,0,0,0,0,0,0,1,0.88715953307393,0.0310765815760266,0,0,0,0,0.101167315175097,0.921198668146504,1,0.0793650793650794,0,0,0,0.0110987791342952,0,0,0,0,0.0116731517509728,0.0366259711431743,0,0.920634920634921,0,0,0,0,0,0,0,TRUE
0.00159872102318145,0.115107913669065,0.576338928856915,0.00559552358113509,0.301358912869704,0,0,0.00694444444444444,0,0,0,0,1,0.854166666666667,0.0277392510402219,0,0,0,0,0.131944444444444,0.914008321775312,1,0.0954907161803713,0,0,0,0.00970873786407767,0,0,0,0,0.00694444444444444,0.0485436893203883,0,0.904509283819629,0,0,0,0,0,0,0,TRUE
0.000295770482105886,0.228926353149956,0.516415261756877,0.00532386867790594,0.24874297545105,0.000295770482105886,0,0,0,0,0,0,1,0.91343669250646,0.0372492836676218,0,0,1,0,0.082687338501292,0.912893982808023,1,0.084423305588585,0,0,0,0.0103151862464183,0,0,0,0,0.00387596899224806,0.039541547277937,0,0.914387633769322,0,0,0,0,0,0.00118906064209275,0,TRUE
0.000657462195923734,0.179487179487179,0.614727153188692,0.00525969756738988,0.199868507560815,0,0,0,0,0,0,0,1,0.904761904761905,0.0267665952890792,0,0,0,0,0.0915750915750916,0.937901498929336,1,0.0855263157894737,0,0,0,0.00749464668094218,0,0.00328947368421053,0,0,0.00366300366300366,0.0278372591006424,0,0.911184210526316,0,0,0,0,0,0,0,FALSE
0.00120336943441637,0.350180505415162,0.474127557160048,0.0108303249097473,0.163658243080626,0,0,0,0,0,0,0,1,0.927835051546392,0.0508905852417303,0,0,0,0,0.0687285223367698,0.898218829516539,1,0.0882352941176471,0,0,0,0.0229007633587786,0,0,0,0,0.00343642611683849,0.0279898218829517,0,0.911764705882353,0,0,0,0,0,0,0,TRUE
0.000802890405459655,0.216378964271377,0.637494981934966,0.0112404656764352,0.134082697711762,0,0,0.00185528756957328,0,0,0,0,1,0.909090909090909,0.0302267002518892,0,0,0,0,0.0890538033395176,0.931360201511335,1,0.0988023952095808,0,0,0,0.017632241813602,0,0,0,0,0,0.0207808564231738,0,0.901197604790419,0,0,0,0,0,0,0,FALSE
0.000241487563390485,0.246317314658295,0.556870321178459,0.00796908959188602,0.188118811881188,0.000482975126780971,0,0,0,0,0,0,1,0.914705882352941,0.0364425162689805,0,0,1,0,0.0823529411764706,0.917570498915401,1,0.0949935815147625,0,0,0.000980392156862745,0.0134490238611714,0,0.00128369704749679,0,0,0.00196078431372549,0.0325379609544469,0,0.901155327342747,0,0,0,0,0,0.00256739409499358,0,TRUE
0.000534473543559594,0.254409406734367,0.473009086050241,0.0112239444147515,0.260288615713522,0.000534473543559594,0,0,0,0,0,0,1,0.920168067226891,0.0406779661016949,0,0,1,0,0.0777310924369748,0.897175141242938,0.952380952380952,0.0699588477366255,0,0,0,0.0203389830508475,0.0476190476190476,0.00411522633744856,0,0,0.00210084033613445,0.0418079096045198,0,0.923868312757202,0,0,0,0,0,0.00205761316872428,0,FALSE
0.00100908173562059,0.325933400605449,0.508577194752775,0.00504540867810293,0.159434914228052,0,0,0,0,0,0,0,1,0.91640866873065,0.0516898608349901,0,0,0,0,0.0804953560371517,0.894632206759443,1,0.145569620253165,0,0,0.00309597523219814,0.00795228628230616,0,0,0,0,0,0.0457256461232604,0,0.854430379746835,0,0,0,0,0,0,0,TRUE
0.00128040973111396,0.250960307298335,0.399487836107554,0.00512163892445583,0.34314980793854,0,0,0,0,0,0,0,1,0.938775510204082,0.0353697749196141,0,0,0,0,0.0612244897959184,0.906752411575563,1,0.0522388059701493,0,0,0,0.0128617363344051,0,0,0,0,0,0.045016077170418,0,0.947761194029851,0,0,0,0,0,0,0,TRUE
0.000185150897981855,0.295685984077023,0.553045732271802,0.00518422514349195,0.145528605813738,0.00037030179596371,0,0,0,0,0,0,1,0.929868503443957,0.036503683858004,0,0,1,0,0.0695053224796493,0.927662424648359,1,0.099236641221374,0,0,0,0.00937709310113865,0,0,0,0,0.000626174076393237,0.0264567983924983,0,0.898218829516539,0,0,0,0,0,0.00254452926208651,0,TRUE
0.000385951370127364,0.287919722115013,0.503280586646083,0.00617522192203782,0.201852566576611,0.000385951370127364,0,0,0,0,0,0,1,0.928954423592493,0.0391104294478528,0,0,1,0,0.0670241286863271,0.915644171779141,1,0.0842911877394636,0,0,0.00134048257372654,0.0115030674846626,0,0,0,0,0.00268096514745308,0.0337423312883436,0,0.913793103448276,0,0,0,0,0,0.00191570881226054,0,FALSE
0.000398247710075667,0.165671047391478,0.675826363998407,0.00995619275189168,0.147351652727997,0.000796495420151334,0,0,0,0,0,0,1,0.908653846153846,0.0206367924528302,0,0,1,0,0.0865384615384615,0.945754716981132,1,0.0864864864864865,0,0,0,0.0141509433962264,0,0.0027027027027027,0,0,0.00480769230769231,0.0194575471698113,0,0.905405405405405,0,0,0,0,0,0.00540540540540541,0,TRUE
0.000774593338497289,0.146398140975988,0.580945003872967,0.00309837335398916,0.268009295120062,0.000774593338497289,0,0,0,0,0,0,1,0.931216931216931,0.0160213618157543,0,0,0,0,0.0687830687830688,0.947930574098798,1,0.0635838150289017,1,0,0,0.00534045393858478,0,0,0,0,0,0.0307076101468625,0,0.933526011560694,0,0,0,0,0,0.00289017341040462,0,TRUE
0.000276166804750069,0.15879591273129,0.533278099972383,0.0113228389947528,0.295498481082574,0.000828500414250207,0,0,0,0,0,0,1,0.902608695652174,0.0269290523045054,0,0,1,0,0.0939130434782609,0.906784049715173,1,0.0795135640785781,0,0,0.00173913043478261,0.0207146556188503,0,0,0,0,0.00173913043478261,0.0455722423614707,0,0.917680074836296,0,0,0,0,0,0.00280636108512629,0,FALSE
0.000670915800067092,0.185508218718551,0.509560550150956,0.00771553170077155,0.296209325729621,0.000335457900033546,0,0.00180831826401447,0,0,0,0,1,0.920433996383363,0.0276497695852535,0,0,1,0,0.0741410488245931,0.912442396313364,1,0.0781426953567384,0,0,0,0.0151415404871626,0,0,0,0,0.00361663652802893,0.0447662936142199,0,0.920724801812005,0,0,0,0,0,0.00113250283125708,0,FALSE
0.00102986611740474,0.267765190525232,0.512873326467559,0.00926879505664264,0.208032955715757,0.00102986611740474,0,0,0,0,0,0,1,0.915384615384615,0.0402414486921529,0,0,1,0,0.0730769230769231,0.915492957746479,1,0.0742574257425743,0,0,0.00384615384615385,0.0160965794768612,0,0,0,0,0.00769230769230769,0.028169014084507,0,0.920792079207921,0,0,0,0,0,0.00495049504950495,0,TRUE
0.000819000819000819,0.0974610974610975,0.542178542178542,0.0122850122850123,0.346437346437346,0.000819000819000819,0,0,0,0,0,0,1,0.899159663865546,0.0151285930408472,0,0,1,0,0.100840336134454,0.925869894099849,1,0.0543735224586288,0,0,0,0.0226928895612708,0,0,0,0,0,0.0363086232980333,0,0.943262411347518,0,0,0,0,0,0.00236406619385343,0,FALSE
0.000363504180298073,0.246819338422392,0.520174482006543,0.0109051254089422,0.221737549981825,0,0,0,0,0,0,0,1,0.911634756995582,0.0412587412587413,0,0,0,0,0.0839469808541973,0.907692307692308,1,0.0754098360655738,0,0,0.00147275405007364,0.0195804195804196,0,0.00163934426229508,0,0,0.00294550810014728,0.0314685314685315,0,0.922950819672131,0,0,0,0,0,0,0,FALSE
0.000696621386276559,0.252176941832114,0.551724137931034,0.0121908742598398,0.181818181818182,0.00139324277255312,0,0.00138121546961326,0,0,0,0,1,0.912983425414365,0.0366161616161616,0,0,1,0,0.0801104972375691,0.909090909090909,1,0.0977011494252874,0,0,0.00138121546961326,0.0214646464646465,0,0,0,0,0.00414364640883978,0.0328282828282828,0,0.89463601532567,0,0,0,0,0,0.00766283524904215,0,FALSE
0.00100908173562059,0.277497477295661,0.641775983854692,0.024217961654894,0.0554994954591322,0,0,0,0,0,0,0,1,0.898181818181818,0.0425196850393701,0,0,0,0,0.0872727272727273,0.911811023622047,1,0.163636363636364,0,0,0.00363636363636364,0.0362204724409449,0,0,0,0,0.0109090909090909,0.0094488188976378,0,0.836363636363636,0,0,0,0,0,0,0,TRUE
0.000487567040468064,0.212579229644076,0.686494392979035,0.0219405168210629,0.0780107264748903,0.000487567040468064,0,0,0,0,0,0,1,0.905963302752294,0.0277185501066098,0,0,1,0,0.0940366972477064,0.923240938166311,1,0.14375,0,0,0,0.0319829424307036,0,0,0,0,0,0.0170575692963753,0,0.85,0,0,0,0,0,0.00625,0,FALSE
0.000876424189307625,0.45749342681858,0.508326029798422,0.0166520595968449,0.0166520595968449,0,0,0,0,0,0,0,1,0.938697318007663,0.0535405872193437,0,0,0,0,0.0613026819923372,0.903281519861831,1,0.315789473684211,0,0,0,0.0328151986183074,0,0,0,0,0,0.0103626943005181,0,0.684210526315789,0,0,0,0,0,0,0,TRUE
0.000648929266709929,0.321219987021415,0.628163530175211,0.0103828682673589,0.0395846852693056,0,0,0,0,0,0,0,1,0.935353535353535,0.0320579110651499,0,0,0,0,0.0626262626262626,0.94105480868666,1,0.180327868852459,0,0,0.00202020202020202,0.015511892450879,0,0,0,0,0,0.0113753877973113,0,0.819672131147541,0,0,0,0,0,0,0,TRUE
0.000613120784794605,0.289393010423053,0.627835683629675,0.0134886572654813,0.0680564071122011,0.000613120784794605,0,0,0,0,0,0,1,0.915254237288136,0.0371456500488759,0,0,1,0,0.0783898305084746,0.926686217008798,1,0.153153153153153,0,0,0.00635593220338983,0.0175953079178886,0,0.00900900900900901,0,0,0,0.0185728250244379,0,0.828828828828829,0,0,0,0,0,0.00900900900900901,0,TRUE
0.000367511944138185,0.174935685409776,0.656008820286659,0.0213156927600147,0.147372289599412,0,0,0,0,0,0,0,1,0.90546218487395,0.0246636771300448,0,0,0,0,0.092436974789916,0.923766816143498,1,0.0872817955112219,0,0,0.00210084033613445,0.0319506726457399,0,0,0,0,0,0.0196188340807175,0,0.912718204488778,0,0,0,0,0,0,0,TRUE
0.000434593654932638,0.286831812255541,0.643198609300304,0.0212950890916993,0.0478053020425902,0.000434593654932638,0,0,0,0,0,0,1,0.940909090909091,0.0250169033130494,0,0,1,0,0.0560606060606061,0.933062880324544,1,0.127272727272727,0,0,0.00151515151515152,0.0324543610547667,0,0,0,0,0.00151515151515152,0.0094658553076403,0,0.863636363636364,0,0,0,0,0,0.00909090909090909,0,TRUE
0.000427167876975651,0.208030756087142,0.733447244767193,0.0132422041862452,0.0448526270824434,0,0,0,0,0,0,0,1,0.915811088295688,0.0233100233100233,0,0,0,0,0.082135523613963,0.948717948717949,1,0.171428571428571,0,0,0,0.0180652680652681,0,0,0,0,0.00205338809034908,0.00990675990675991,0,0.828571428571429,0,0,0,0,0,0,0,TRUE
0.000366166239472721,0.116440864152325,0.555474185280117,0.0146466495789088,0.312339802270231,0.000732332478945441,0,0,0,0,0,0,1,0.886792452830189,0.0217678100263852,0,0,1,0,0.106918238993711,0.909630606860158,1,0.0750293083235639,0,0,0,0.0263852242744063,0,0,0,0,0.00628930817610063,0.0422163588390501,0,0.922626025791325,0,0,0,0,0,0.00234466588511137,0,TRUE
0.00029146021568056,0.147770329350044,0.669775575633926,0.0186534538035558,0.163509180996794,0,0,0,0,0,0,0,1,0.869822485207101,0.0282977797126687,0,0,0,0,0.128205128205128,0.923378319547235,1,0.0855614973262032,0,0,0,0.0274270787984327,0,0.0017825311942959,0,0,0.0019723865877712,0.020896821941663,0,0.912655971479501,0,0,0,0,0,0,0,TRUE
0.00173761946133797,0.314509122502172,0.600347523892268,0.0182450043440487,0.0651607298001738,0,0,0.00276243093922652,0,0,0,0,1,0.908839779005525,0.0463096960926194,0,0,0,0,0.0828729281767956,0.908827785817656,1,0.16,0,0,0.00276243093922652,0.0274963820549928,0,0.0133333333333333,0,0,0.00276243093922652,0.0173661360347323,0,0.826666666666667,0,0,0,0,0,0,0,TRUE
0.00116144018583043,0.219512195121951,0.583042973286876,0.024390243902439,0.171893147502904,0,0,0,0,0,0,0,1,0.941798941798942,0.0199600798403194,0,0,0,0,0.0476190476190476,0.912175648702595,1,0.101351351351351,0,0,0.0105820105820106,0.0379241516966068,0,0,0,0,0,0.029940119760479,0,0.898648648648649,0,0,0,0,0,0,0,TRUE
0.000812347684809098,0.240454914703493,0.615759545085297,0.0154346060113729,0.127538586515028,0,0,0,0,0,0,0,1,0.925675675675676,0.0277044854881266,0,0,0,0,0.0675675675675676,0.930079155672823,1,0.0897435897435897,0,0,0.00675675675675676,0.0211081794195251,0,0.00641025641025641,0,0,0,0.0211081794195251,0,0.903846153846154,0,0,0,0,0,0,0,TRUE
0.000552181115405853,0.153506350082827,0.674213141910547,0.0132523467697405,0.156819436775262,0.00165654334621756,0,0,0,0,0,0,1,0.906474820143885,0.0188524590163934,0,0,0.666666666666667,0,0.0827338129496403,0.936065573770492,1,0.109154929577465,0.333333333333333,0,0.00719424460431655,0.0180327868852459,0,0,0,0,0.00359712230215827,0.0270491803278689,0,0.880281690140845,0,0,0,0,0,0.0105633802816901,0,TRUE
0.001085776330076,0.517915309446254,0.395222584147666,0.00217155266015201,0.0836047774158523,0,0,0,0,0,0,0,1,0.960167714884696,0.0495867768595041,0,0,0,0,0.039832285115304,0.925619834710744,1,0.0909090909090909,0,0,0,0.00550964187327824,0,0,0,0,0,0.0192837465564738,0,0.909090909090909,0,0,0,0,0,0,0,TRUE
0.000858000858000858,0.236808236808237,0.522093522093522,0.00343200343200343,0.236808236808237,0,0,0.00181159420289855,0,0,0,0,1,0.952898550724638,0.0205423171733772,0,0,0,0,0.0452898550724638,0.938373048479869,1,0.0760869565217391,0,0,0,0.00657354149548069,0,0,0,0,0,0.0345110928512736,0,0.923913043478261,0,0,0,0,0,0,0,TRUE
0.000620732464307883,0.28739913097455,0.558038485412787,0.0124146492861577,0.140906269397889,0.000620732464307883,0,0,0,0,0,0,1,0.935205183585313,0.0311804008908686,0,0,1,0,0.0647948164146868,0.916481069042316,1,0.114537444933921,0,0,0,0.022271714922049,0,0,0,0,0,0.0300668151447661,0,0.881057268722467,0,0,0,0,0,0.00440528634361234,0,TRUE
0.00170794192997438,0.273270708795901,0.63535439795047,0.00768573868488471,0.0819812126387703,0,0,0.003125,0,0,0,0,1,0.915625,0.0349462365591398,0,0,0,0,0.08125,0.931451612903226,1,0.166666666666667,0,0,0,0.0120967741935484,0,0,0,0,0,0.021505376344086,0,0.833333333333333,0,0,0,0,0,0,0,TRUE
0.000969932104752667,0.280310378273521,0.566440349175558,0.00775945683802134,0.143549951503395,0.000969932104752667,0,0,0,0,0,0,1,0.927335640138408,0.032590051457976,0,0,1,0,0.069204152249135,0.921097770154374,1,0.128378378378378,0,0,0,0.0120068610634648,0,0.00675675675675676,0,0,0.00346020761245675,0.0343053173241852,0,0.858108108108108,0,0,0,0,0,0.00675675675675676,0,TRUE
0.000802890405459655,0.313528703331995,0.583299879566439,0.011641910879165,0.090726615816941,0,0,0.00128040973111396,0,0,0,0,1,0.914212548015365,0.0454232622161046,0,0,0,0,0.0845070422535211,0.917412250516173,1,0.110619469026549,0,0,0,0.0199587061252581,0,0,0,0,0,0.0172057811424639,0,0.889380530973451,0,0,0,0,0,0,0,TRUE
0.000812347684809098,0.241267262388302,0.591389114541024,0.00974817221770918,0.156783103168156,0,0,0,0,0,0,0,1,0.895622895622896,0.0412654745529574,0,0,0,0,0.101010101010101,0.916093535075653,1,0.103626943005181,0,0,0,0.0165061898211829,0,0,0,0,0.00336700336700337,0.0261348005502063,0,0.896373056994819,0,0,0,0,0,0,0,TRUE
0.000892060660124889,0.301516503122212,0.530776092774309,0.008028545941124,0.15878679750223,0,0,0,0,0,0,0,1,0.905325443786982,0.0521885521885522,0,0,0,0,0.0917159763313609,0.904040404040404,1,0.101123595505618,0,0,0,0.0151515151515152,0,0,0,0,0.0029585798816568,0.0286195286195286,0,0.898876404494382,0,0,0,0,0,0,0,TRUE
0.00102986611740474,0.274974253347065,0.610710607621009,0.00720906282183316,0.105046343975283,0.00102986611740474,0,0,0,0,0,0,1,0.913857677902622,0.0354131534569983,0,0,1,0,0.0786516853932584,0.935919055649241,1,0.099009900990099,0,0,0,0.0118043844856661,0,0,0,0,0.00749063670411985,0.0168634064080944,0,0.891089108910891,0,0,0,0,0,0.0099009900990099,0,TRUE
0.000979911807937286,0.28515433610975,0.629593336599706,0.00734933855952964,0.0764331210191083,0.000489955903968643,0,0.00171821305841924,0,0,0,0,1,0.927835051546392,0.0311284046692607,0,0,1,0,0.0687285223367698,0.943968871595331,1,0.108974358974359,0,0,0.00171821305841924,0.0101167315175097,0,0.00641025641025641,0,0,0,0.0147859922178988,0,0.878205128205128,0,0,0,0,0,0.00641025641025641,0,TRUE
0.00137835975189524,0.305995864920744,0.517574086836664,0.00551343900758098,0.16815988973122,0.00137835975189524,0,0.00225225225225225,0,0,0,0,1,0.912162162162162,0.0479360852197071,0,0,1,0,0.0833333333333333,0.913448735019973,1,0.0819672131147541,0,0,0.00225225225225225,0.00798934753661784,0,0.00409836065573771,0,0,0,0.0306258322237017,0,0.905737704918033,0,0,0,0,0,0.00819672131147541,0,TRUE
0.00112233445566779,0.424242424242424,0.501683501683502,0.00897867564534231,0.063973063973064,0,0,0,0,0,0,0,1,0.941798941798942,0.047085201793722,0,0,0,0,0.0582010582010582,0.917040358744395,1,0.140350877192982,0,0,0,0.0179372197309417,0,0,0,0,0,0.0179372197309417,0,0.859649122807018,0,0,0,0,0,0,0,TRUE
0.000825763831544178,0.284062758051197,0.572254335260116,0.00908340214698596,0.132947976878613,0.000825763831544178,0,0,0,0,0,0,1,0.912790697674419,0.0404624277456647,0,0,1,0,0.0872093023255814,0.917630057803468,1,0.105590062111801,0,0,0,0.0158959537572254,0,0,0,0,0,0.0260115606936416,0,0.888198757763975,0,0,0,0,0,0.0062111801242236,0,TRUE
0.000718907260963336,0.199856218547807,0.602444284687275,0.00790797987059669,0.189072609633357,0,0,0,0,0,0,0,1,0.89568345323741,0.033452807646356,0,0,0,0,0.0971223021582734,0.922341696535245,1,0.106463878326996,0,0,0.00359712230215827,0.010752688172043,0,0.00380228136882129,0,0,0.00359712230215827,0.033452807646356,0,0.889733840304182,0,0,0,0,0,0,0,TRUE
0.000398247710075667,0.161290322580645,0.622859418558343,0.00876144962166468,0.206292313819196,0.000398247710075667,0,0,0,0,0,0,1,0.891358024691358,0.0268714011516315,0,0,1,0,0.101234567901235,0.928982725527831,1,0.0945945945945946,0,0,0,0.0127959053103007,0,0.00386100386100386,0,0,0.00740740740740741,0.0313499680102367,0,0.8996138996139,0,0,0,0,0,0.00193050193050193,0,TRUE
0.00027693159789532,0.174466906674052,0.635834948767654,0.0055386319579064,0.183882581002492,0,0,0,0,0,0,0,1,0.914285714285714,0.0230936819172113,0,0,0,0,0.0825396825396825,0.943355119825708,1,0.088855421686747,0,0,0,0.00871459694989107,0,0,0,0,0.00317460317460317,0.0248366013071895,0,0.911144578313253,0,0,0,0,0,0,0,TRUE
0.00144717800289436,0.182344428364689,0.571635311143271,0.00868306801736614,0.23589001447178,0,0,0,0,0,0,0,1,0.880952380952381,0.0354430379746835,0,0,0,0,0.119047619047619,0.918987341772152,1,0.0679012345679012,0,0,0,0.0151898734177215,0,0,0,0,0,0.030379746835443,0,0.932098765432099,0,0,0,0,0,0,0,TRUE
0.00130633572828217,0.0966688438928805,0.485956890920967,0.00587851077726976,0.408883082952319,0.00130633572828217,0,0.00675675675675676,0,0,0,0,0,0.878378378378378,0.021505376344086,0,0,1,0,0.108108108108108,0.912634408602151,1,0.0638977635782748,0,0,0,0.0120967741935484,0,0,0,1,0.00675675675675676,0.0537634408602151,0,0.932907348242812,0,0,0,0,0,0.00319488817891374,0,FALSE
0.000587889476778366,0.111111111111111,0.485008818342152,0.0111699000587889,0.39212228101117,0,0,0,0,0,0,0,1,0.904761904761905,0.020631067961165,0,0,0,0,0.0952380952380952,0.910194174757282,1,0.0569715142428786,0,0,0,0.0218446601941748,0,0.00149925037481259,0,0,0,0.0473300970873786,0,0.941529235382309,0,0,0,0,0,0,0,TRUE
0.0014265335235378,0.172610556348074,0.557774607703281,0.00855920114122682,0.258202567760342,0.0014265335235378,0,0,0,0,0,0,1,0.884297520661157,0.030690537084399,0,0,1,0,0.115702479338843,0.91304347826087,1,0.0777777777777778,0,0,0,0.0127877237851662,0,0.00555555555555556,0,0,0,0.0434782608695652,0,0.911111111111111,0,0,0,0,0,0.00555555555555556,0,TRUE
0.00181653042688465,0.209809264305177,0.556766575840145,0.0072661217075386,0.223433242506812,0.000908265213442325,0,0,0.00163132137030995,0,0,0,1,0.891774891774892,0.0375203915171289,0,0,1,0,0.0995670995670996,0.915171288743883,1,0.0853658536585366,0,0,0,0.0114192495921697,0,0.0040650406504065,0,0,0.00865800865800866,0.034257748776509,0,0.90650406504065,0,0,0,0,0,0.0040650406504065,0,TRUE
0.00138792505204719,0.145038167938931,0.628036086051353,0.0104094378903539,0.215128383067314,0,0,0.00478468899521531,0,0,0,0,1,0.885167464114832,0.025414364640884,0,0,0,0,0.0956937799043062,0.929281767955801,1,0.0935483870967742,0,0,0.00478468899521531,0.0154696132596685,0,0,0,0,0.00956937799043062,0.0298342541436464,0,0.906451612903226,0,0,0,0,0,0,0,FALSE
0.00056785917092561,0.160136286201022,0.617262918796139,0.00624645088018171,0.214650766609881,0.00113571834185122,0,0,0,0,0,0,1,0.875886524822695,0.0294659300184162,0,0,1,0,0.124113475177305,0.935543278084715,1,0.0661375661375661,0,0,0,0.00920810313075507,0,0.00264550264550265,0,0,0,0.0257826887661142,0,0.925925925925926,0,0,0,0,0,0.00529100529100529,0,FALSE
0.000999000999000999,0.178821178821179,0.545454545454545,0.00599400599400599,0.267732267732268,0.000999000999000999,0,0,0,0,0,0,1,0.899441340782123,0.0293040293040293,0,0,1,0,0.100558659217877,0.917582417582418,1,0.0786516853932584,0,0,0,0.010989010989011,0,0,0,0,0,0.0421245421245421,0,0.917602996254682,0,0,0,0,0,0.00374531835205993,0,TRUE
0.00100908173562059,0.109989909182644,0.580221997981836,0.0100908173562059,0.298688193743693,0,0,0,0,0,0,0,1,0.889908256880734,0.0191304347826087,0,0,0,0,0.110091743119266,0.921739130434783,1,0.0779661016949153,0,0,0,0.0173913043478261,0,0,0,0,0,0.0417391304347826,0,0.922033898305085,0,0,0,0,0,0,0,TRUE
0.000661813368630046,0.172733289212442,0.601588352084712,0.00595632031767042,0.218398411647915,0.000661813368630046,0,0,0,0,0,0,1,0.888888888888889,0.0297356828193833,0,0,1,0,0.111111111111111,0.930616740088106,1,0.0787878787878788,0,0,0,0.00881057268722467,0,0.00303030303030303,0,0,0,0.0308370044052863,0,0.915151515151515,0,0,0,0,0,0.00303030303030303,0,TRUE
0.00085397096498719,0.115286080273271,0.567036720751494,0.0085397096498719,0.308283518360376,0,0,0,0,0,0,0,1,0.888888888888889,0.0210843373493976,0,0,0,0,0.0962962962962963,0.921686746987952,0.9,0.0833333333333333,0,0,0,0.0135542168674699,0.1,0,0,0,0.0148148148148148,0.0436746987951807,0,0.916666666666667,0,0,0,0,0,0,0,FALSE
0.000703729767769177,0.123152709359606,0.446868402533427,0.0091484869809993,0.420126671358198,0,0,0,0,0,0,0,1,0.908571428571429,0.0236593059936909,0,0,0,0,0.0857142857142857,0.925867507886435,1,0.033500837520938,0,0,0,0.0189274447949527,0,0.0016750418760469,0,0,0.00571428571428571,0.0315457413249211,0,0.964824120603015,0,0,0,0,0,0,0,FALSE
0.00285306704707561,0.108416547788873,0.613409415121255,0.0156918687589158,0.25962910128388,0,0,0.0131578947368421,0,0,0,0,1,0.907894736842105,0.013953488372093,0,0,0,0,0.0789473684210526,0.927906976744186,1,0.0769230769230769,0,0,0,0.0232558139534884,0,0.00549450549450549,0,0,0,0.0348837209302326,0,0.917582417582418,0,0,0,0,0,0,0,TRUE
0.000861326442721792,0.0973298880275624,0.496985357450474,0.00516795865633075,0.399655469422911,0,0,0,0,0,0,0,1,0.893805309734513,0.0190641247833622,0,0,0,0,0.106194690265487,0.916811091854419,1,0.0647948164146868,0,0,0,0.0103986135181976,0,0,0,0,0,0.0537261698440208,0,0.935205183585313,0,0,0,0,0,0,0,TRUE
0.000632511068943707,0.175205566097407,0.502213788741303,0.0126502213788741,0.309297912713473,0,0,0,0,0,0,0,1,0.924187725631769,0.0251889168765743,0,0,0,0,0.0722021660649819,0.899244332493703,1,0.0819672131147541,0,0,0,0.0251889168765743,0,0,0,0,0.0036101083032491,0.0503778337531486,0,0.918032786885246,0,0,0,0,0,0,0,FALSE
0.000288101411696917,0.155286660904638,0.513396715643907,0.00720253529242293,0.323537885335638,0.000288101411696917,0,0,0,0,0,0,1,0.896103896103896,0.0303030303030303,0,0,1,0,0.098330241187384,0.908529741863075,1,0.0757575757575758,0,0,0,0.0140291806958474,0,0,0,0,0.00556586270871985,0.0471380471380471,0,0.923351158645276,0,0,0,0,0,0.00089126559714795,0,TRUE
0.00123304562268804,0.106041923551171,0.537607891491985,0.00986436498150432,0.344019728729963,0.00123304562268804,0,0,0,0,0,0,1,0.906976744186046,0.0137931034482759,0,0,1,0,0.0813953488372093,0.937931034482759,1,0.046594982078853,0,0,0,0.0183908045977011,0,0,0,0,0.0116279069767442,0.0298850574712644,0,0.949820788530466,0,0,0,0,0,0.003584229390681,0,TRUE
0.000392003136025088,0.17640141121129,0.647981183849471,0.0156801254410035,0.159545276362211,0,0,0,0,0,0,0,1,0.902222222222222,0.0260290556900726,0,0,0,0,0.0888888888888889,0.929782082324455,1,0.0909090909090909,0,0,0.00444444444444444,0.0230024213075061,0,0,0,0,0.00444444444444444,0.0211864406779661,0,0.909090909090909,0,0,0,0,0,0,0,FALSE
0.00074019245003701,0.111028867505551,0.709104367135455,0.0111028867505551,0.168023686158401,0,0,0,0,0,0,0,1,0.866666666666667,0.0198537095088819,0,0,0,0,0.133333333333333,0.938349007314525,1,0.110132158590308,0,0,0,0.0146290491118077,0,0.00440528634361234,0,0,0,0.0271682340647858,0,0.885462555066079,0,0,0,0,0,0,0,TRUE
0.00114876507754164,0.116025272831706,0.576105686387134,0.0155083285468122,0.290637564618036,0.000574382538770821,0,0.00495049504950495,0,0,0,0,1,0.871287128712871,0.0239282153539382,0,0,1,0,0.118811881188119,0.915254237288136,1,0.0671936758893281,0,0,0,0.0259222333000997,0,0.00197628458498024,0,0,0.00495049504950495,0.0348953140578265,0,0.928853754940711,0,0,0,0,0,0.00197628458498024,0,FALSE
0.000868809730668983,0.224152910512598,0.637706342311034,0.00608166811468288,0.131190269331017,0,0,0,0,0,0,0,1,0.930232558139535,0.0231923601637108,0,0,0,0,0.0697674418604651,0.948158253751705,1,0.0927152317880795,0,0,0,0.00818553888130969,0,0.00662251655629139,0,0,0,0.0204638472032742,0,0.900662251655629,0,0,0,0,0,0,0,TRUE
0.00126422250316056,0.0847029077117573,0.672566371681416,0.011378002528445,0.230088495575221,0,0,0,0,0,0,0,1,0.865671641791045,0.0150659133709981,0,0,0,0,0.134328358208955,0.934086629001883,1,0.0989010989010989,0,0,0,0.0169491525423729,0,0,0,0,0,0.0338983050847458,0,0.901098901098901,0,0,0,0,0,0,0,TRUE
0.000620732464307883,0.19366852886406,0.625698324022346,0.0117939168218498,0.168218497827436,0,0,0,0,0,0,0,1,0.916666666666667,0.0248262164846077,0,0,0,0,0.0801282051282051,0.930486593843098,1,0.0996309963099631,0,0,0.00320512820512821,0.0178748758689176,0,0,0,0,0,0.0268123138033764,0,0.900369003690037,0,0,0,0,0,0,0,TRUE
0.000423549343498518,0.124099957645066,0.65141889030072,0.0148242270224481,0.208809826344769,0.000423549343498518,0,0,0,0,0,0,1,0.907849829351536,0.0162654521795706,0,0,1,0,0.0853242320819113,0.934287573194535,1,0.0851926977687627,0,0,0.00341296928327645,0.0214703968770332,0,0.00202839756592292,0,0,0.00341296928327645,0.0279765777488614,0,0.910750507099391,0,0,0,0,0,0.00202839756592292,0,TRUE
0.000745712155108128,0.0850111856823266,0.753914988814318,0.0216256524981357,0.138702460850112,0,0,0,0,0,0,0,1,0.894736842105263,0.0108910891089109,0,0,0,0,0.0964912280701754,0.946534653465346,1,0.0806451612903226,0,0,0,0.0277227722772277,0,0.00537634408602151,0,0,0.0087719298245614,0.0148514851485149,0,0.913978494623656,0,0,0,0,0,0,0,TRUE
0.000916590284142988,0.15032080659945,0.725939505041247,0.0174152153987168,0.105407882676444,0,0,0,0,0,0,0,1,0.884146341463415,0.02275600505689,0,0,0,0,0.0914634146341463,0.941845764854614,1,0.11304347826087,0,0,0.0182926829268293,0.0202275600505689,0,0,0,0,0.00609756097560976,0.0151706700379267,0,0.88695652173913,0,0,0,0,0,0,0,TRUE
0.00144717800289436,0.153400868306802,0.591895803183792,0.0101302460202605,0.243125904486252,0,0,0,0,0,0,0,1,0.886792452830189,0.0269607843137255,0,0,0,0,0.113207547169811,0.92156862745098,1,0.0833333333333333,0,0,0,0.017156862745098,0,0,0,0,0,0.0343137254901961,0,0.916666666666667,0,0,0,0,0,0,0,TRUE
0.000693962526023595,0.183900069396253,0.60999306037474,0.0173490631505899,0.186675919500347,0.00138792505204719,0,0,0,0,0,0,1,0.928301886792453,0.0193621867881549,0,0,0.5,0,0.0716981132075472,0.932801822323462,1,0.0557620817843866,0.5,0,0,0.0250569476082005,0,0.0111524163568773,0,0,0,0.0227790432801822,0,0.925650557620818,0,0,0,0,0,0.00743494423791822,0,TRUE
0.000507356671740233,0.13140537798072,0.612886859462202,0.0101471334348047,0.245053272450533,0,0,0,0,0,0,0,1,0.918918918918919,0.0165562913907285,0,0,0,0,0.0772200772200772,0.93046357615894,1,0.0912863070539419,0,0,0,0.0157284768211921,0,0.0020746887966805,0,0,0.00386100386100386,0.0372516556291391,0,0.906639004149378,0,0,0,0,0,0,0,TRUE
0.00140646976090014,0.118143459915612,0.661040787623066,0.0168776371308017,0.20253164556962,0,0,0,0,0,0,0,0,0.892857142857143,0.0191897654584222,0,0,0,1,0.107142857142857,0.929637526652452,1,0.0833333333333333,0,0,0,0.023454157782516,0,0.00694444444444444,0,0,0,0.0277185501066098,0,0.909722222222222,0,0,0,0,0,0,0,TRUE
0.000724112961622013,0.135409123823316,0.615496017378711,0.0115858073859522,0.235336712527154,0.00144822592324403,0,0,0,0,0,0,1,0.893048128342246,0.02,0,0,1,0,0.0962566844919786,0.930588235294118,1,0.0771604938271605,0,0,0.0053475935828877,0.0176470588235294,0,0,0,0,0.0053475935828877,0.0317647058823529,0,0.916666666666667,0,0,0,0,0,0.00617283950617284,0,TRUE
0.000540248514316586,0.0399783900594273,0.617504051863857,0.0124257158292815,0.329551593733117,0,0,0,0,0,0,0,0,0.797297297297297,0.0131348511383538,0,0,0,1,0.202702702702703,0.933450087565674,1,0.0622950819672131,0,0,0,0.0192644483362522,0,0.00163934426229508,0,0,0,0.0341506129597198,0,0.936065573770492,0,0,0,0,0,0,0,TRUE
0.000456412596987677,0.539936102236422,0.415791875855774,0.00502053856686445,0.0383386581469649,0.000456412596987677,0,0,0,0,0,0,1,0.949281487743026,0.0637362637362637,0,0,1,0,0.0490278951817413,0.910989010989011,1,0.154761904761905,0,0,0,0.0120879120879121,0,0,0,0,0.00169061707523246,0.0131868131868132,0,0.833333333333333,0,0,0,0,0,0.0119047619047619,0,TRUE
0.000428173838578463,0.411689145793192,0.530293299079426,0.00256904303147078,0.054592164418754,0.000428173838578463,0,0.000520020800832033,0,0,0,0,1,0.945397815912636,0.0411788453774727,0,0,1,0,0.0509620384815393,0.939442874444893,1,0.156862745098039,0,0,0.000520020800832033,0.00363342753330642,0,0.00784313725490196,0,0,0.00260010400416017,0.0157448526443278,0,0.827450980392157,0,0,0,0,0,0.00784313725490196,0,TRUE
0.000632511068943707,0.56989247311828,0.376344086021505,0.00442757748260595,0.0487033523086654,0,0,0,0,0,0,0,1,0.951165371809101,0.0723905723905724,0,0,0,0,0.0477247502774695,0.897306397306397,1,0.155844155844156,0,0,0,0.0117845117845118,0,0,0,0,0.00110987791342952,0.0185185185185185,0,0.844155844155844,0,0,0,0,0,0,0,TRUE
0.000406338886631451,0.429500203169443,0.47054043071922,0.00203169443315725,0.0963023161316538,0.00121901665989435,0,0,0,0,0,0,1,0.938505203405866,0.0526770293609672,0,0,1,0,0.0596026490066225,0.914507772020725,1,0.13135593220339,0,0,0,0.00431778929188256,0,0,0,0,0.00189214758751183,0.0284974093264249,0,0.855932203389831,0,0,0,0,0,0.0127118644067797,0,FALSE
0.000698812019566737,0.504542278127184,0.443046820405311,0.00209643605870021,0.0496156533892383,0,0,0,0,0,0,0,1,0.957063711911357,0.0473933649289099,0,0,0,0,0.0415512465373961,0.930489731437599,1,0.169014084507042,0,0,0,0.004739336492891,0,0,0,0,0.00138504155124654,0.0173775671406003,0,0.830985915492958,0,0,0,0,0,0,0,TRUE
0.000751314800901578,0.537190082644628,0.416228399699474,0.00150262960180316,0.0443275732531931,0,0,0,0,0,0,0,1,0.948251748251748,0.0649819494584837,0,0,0,0,0.0503496503496504,0.913357400722022,1,0.172413793103448,0,0,0,0.0036101083032491,0,0,0,0,0.0013986013986014,0.0180505415162455,0,0.827586206896552,0,0,0,0,0,0,0,TRUE
0.000341180484476288,0.46229955646537,0.43841692255203,0.00375298532923917,0.0948481746844081,0.000341180484476288,0,0,0,0,0,0,1,0.960885608856089,0.0397196261682243,0,0,1,0,0.03690036900369,0.927570093457944,1,0.118705035971223,0,0,0.000738007380073801,0.00778816199376947,0,0,0,0,0.0014760147601476,0.0249221183800623,0,0.877697841726619,0,0,0,0,0,0.00359712230215827,0,TRUE
0.000212720697723889,0.340353116358222,0.585194639438417,0.00276536907041055,0.0708359923420549,0.000638162093171666,0,0,0,0,0,0,1,0.930625,0.0389090909090909,0,0,1,0,0.068125,0.943272727272727,1,0.105105105105105,0,0,0.000625,0.00436363636363636,0,0,0,0,0.000625,0.0134545454545455,0,0.885885885885886,0,0,0,0,0,0.00900900900900901,0,TRUE
0.000793335977786593,0.397461324871083,0.510115033716779,0.00238000793335978,0.0892502975009917,0,0,0.000998003992015968,0,0,0,0,1,0.960079840319361,0.0303265940902022,0,0,0,0,0.0389221556886228,0.942457231726283,1,0.128888888888889,0,0,0,0.0046656298600311,0,0,0,0,0,0.0225505443234837,0,0.871111111111111,0,0,0,0,0,0,0,TRUE
0.000482858522452921,0.473201352003863,0.446644133268952,0.00241429261226461,0.0772573635924674,0,0,0,0,0,0,0,1,0.956122448979592,0.0454054054054054,0,0,0,0,0.0418367346938776,0.931891891891892,1,0.106918238993711,0,0,0.00102040816326531,0.00432432432432432,0,0,0,0,0.00102040816326531,0.0183783783783784,0,0.893081761006289,0,0,0,0,0,0,0,TRUE
0.000425350914504466,0.376860910250957,0.537643555933645,0.000850701829008932,0.0837941301573798,0.000425350914504466,0,0,0,0,0,0,1,0.928893905191874,0.0482977038796516,0,0,1,0,0.0711060948081264,0.927949326999208,1,0.137055837563452,0,0,0,0.00158353127474268,0,0,0,0,0,0.0221694378463975,0,0.857868020304569,0,0,0,0,0,0.0050761421319797,0,TRUE
0.000467071461933676,0.546940681924334,0.405885100420364,0.000467071461933676,0.0462400747314339,0,0,0,0,0,0,0,1,0.957301451750641,0.0564516129032258,0,0,0,0,0.0426985482493595,0.918202764976959,1,0.212121212121212,0,0,0,0.00115207373271889,0,0,0,0,0,0.0241935483870968,0,0.787878787878788,0,0,0,0,0,0,0,TRUE
0.000916590284142988,0.599450045829514,0.367552703941338,0.00183318056828598,0.0302474793767186,0,0,0,0,0,0,0,1,0.96177370030581,0.06,0,0,0,0,0.0382262996941896,0.9225,1,0.151515151515152,0,0,0,0.005,0,0,0,0,0,0.0125,0,0.848484848484849,0,0,0,0,0,0,0,TRUE
0.000661813368630046,0.346790205162144,0.555261416280609,0.000661813368630046,0.0966247518199868,0,0,0,0,0,0,0,1,0.933206106870229,0.0405727923627685,0,0,0,0,0.0648854961832061,0.93436754176611,1,0.143835616438356,0,0,0,0.00119331742243437,0,0,0,0,0.00190839694656489,0.0238663484486874,0,0.856164383561644,0,0,0,0,0,0,0,TRUE
0.00170794192997438,0.557643040136635,0.427839453458582,0,0.0128095644748079,0,0,0.00153139356814701,0,0,0,0,1,0.961715160796325,0.0479041916167665,0,0,0,0,0.0367534456355283,0.946107784431138,0,0.2,0,0,0,0,0,0,0,0,0,0.00598802395209581,0,0.8,0,0,0,0,0,0,0,TRUE
0.000528820729772607,0.355896351136965,0.580645161290323,0.00158646218931782,0.0613432046536224,0,0,0,0,0,0,0,1,0.949479940564636,0.0300546448087432,0,0,0,0,0.0490341753343239,0.95264116575592,1,0.139130434782609,0,0,0,0.00273224043715847,0,0,0,0,0.00148588410104012,0.0145719489981785,0,0.860869565217391,0,0,0,0,0,0,0,TRUE
0.000933706816059757,0.697478991596639,0.282913165266106,0,0.0186741363211951,0,0,0,0,0,0,0,1,0.959839357429719,0.0960264900662252,0,0,0,0,0.0401606425702811,0.884105960264901,0,0.3,0,0,0,0,0,0,0,0,0,0.0198675496688742,0,0.7,0,0,0,0,0,0,0,TRUE
0.0016246953696182,0.566206336311942,0.40536149471974,0.000812347684809098,0.0259951259138911,0,0,0.00143472022955524,0,0,0,0,1,0.962697274031564,0.0501002004008016,0,0,0,0,0.0358680057388809,0.935871743486974,1,0.1875,0,0,0,0.00200400801603206,0,0,0,0,0,0.0120240480961924,0,0.8125,0,0,0,0,0,0,0,TRUE
0.00128122998078155,0.559897501601538,0.381806534272902,0.00192184497117233,0.0550928891736067,0,0,0,0.00167785234899329,0,0,0,0,0.955377574370709,0.0654362416107383,0,0,0,1,0.0446224256292906,0.907718120805369,1,0.13953488372093,0,0,0,0.00503355704697987,0,0,0,0,0,0.0201342281879195,0,0.86046511627907,0,0,0,0,0,0,0,TRUE
0.000564652738565782,0.383399209486166,0.516657255787691,0.00282326369282891,0.0965556182947487,0,0,0,0,0,0,0,1,0.921944035346097,0.0568927789934354,0,0,0,0,0.0751104565537555,0.910284463894967,1,0.157894736842105,0,0,0,0.00437636761487965,0,0.00584795321637427,0,0,0.00294550810014728,0.0284463894967177,0,0.83625730994152,0,0,0,0,0,0,0,TRUE
0.000283205890682526,0.320022656471255,0.559331634097989,0.00254885301614274,0.117530444633248,0.000283205890682526,0,0,0,0,0,0,1,0.924778761061947,0.0420466058763931,0,0,1,0,0.0725663716814159,0.927051671732523,1,0.130120481927711,0,0,0.000884955752212389,0.00354609929078014,0,0.00240963855421687,0,0,0.00176991150442478,0.027355623100304,0,0.865060240963855,0,0,0,0,0,0.00240963855421687,0,TRUE
0.000359582883854729,0.239841783531104,0.584681769147789,0.00395541172240201,0.171161452714851,0,0,0,0,0,0,0,1,0.926536731634183,0.0295384615384615,0,0,0,0,0.0719640179910045,0.932923076923077,1,0.107142857142857,0,0,0,0.00676923076923077,0,0,0,0,0.00149925037481259,0.0307692307692308,0,0.892857142857143,0,0,0,0,0,0,0,TRUE
0.000446229361892012,0.337795626952253,0.519857206604195,0.00223114680946006,0.1396697902722,0,0,0,0,0,0,0,1,0.92998678996037,0.0446735395189003,0,0,0,0,0.0700132100396301,0.918384879725086,1,0.121405750798722,0,0,0,0.00429553264604811,0,0,0,0,0,0.0326460481099656,0,0.878594249201278,0,0,0,0,0,0,0,TRUE
0.000929800092980009,0.336122733612273,0.558809855880986,0.00278940027894003,0.101348210134821,0,0,0.00138312586445367,0,0,0,0,1,0.933609958506224,0.0391014975041597,0,0,0,0,0.0650069156293223,0.927620632279534,1,0.155963302752294,0,0,0,0.00499168053244592,0,0,0,0,0,0.0282861896838602,0,0.844036697247706,0,0,0,0,0,0,0,TRUE
0.0007627765064836,0.409610983981693,0.516399694889397,0.0022883295194508,0.0709382151029748,0,0,0,0,0,0,0,1,0.960893854748603,0.029585798816568,0,0,0,0,0.037243947858473,0.939349112426035,1,0.204301075268817,0,0,0,0.00443786982248521,0,0,0,0,0.00186219739292365,0.0266272189349112,0,0.795698924731183,0,0,0,0,0,0,0,TRUE
0.000965717044905843,0.413809753742154,0.465958474167069,0.00241429261226461,0.116851762433607,0,0,0.00116686114352392,0,0,0,0,1,0.953325554259043,0.0404145077720207,0,0,0,0,0.0431738623103851,0.929533678756477,1,0.107438016528926,0,0,0,0.00518134715025907,0,0,0,0,0.00233372228704784,0.0248704663212435,0,0.892561983471074,0,0,0,0,0,0,0,TRUE
0.000609384521633151,0.449725776965265,0.445460085313833,0.0024375380865326,0.101767215112736,0,0,0,0,0,0,0,1,0.953929539295393,0.0452054794520548,0,0,0,0,0.046070460704607,0.915068493150685,1,0.149700598802395,0,0,0,0.00410958904109589,0,0.00598802395209581,0,0,0,0.0356164383561644,0,0.844311377245509,0,0,0,0,0,0,0,TRUE
0.000436490615451768,0.388040157136622,0.51113051069402,0.00174596246180707,0.0986468790920995,0,0,0,0,0,0,0,1,0.941507311586052,0.0435897435897436,0,0,0,0,0.0584926884139483,0.931623931623932,1,0.110619469026549,0,0,0,0.00256410256410256,0,0.00442477876106195,0,0,0,0.0222222222222222,0,0.884955752212389,0,0,0,0,0,0,0,TRUE
0.000908265213442325,0.369663941871026,0.489554950045413,0.00272479564032698,0.136239782016349,0.000908265213442325,0,0,0,0,0,0,1,0.933660933660934,0.0464684014869888,0,0,1,0,0.0638820638820639,0.910780669144981,1,0.133333333333333,0,0,0,0.00557620817843866,0,0,0,0,0.00245700245700246,0.0371747211895911,0,0.86,0,0,0,0,0,0.00666666666666667,0,TRUE
0.00110987791342952,0.392896781354051,0.480577136514983,0.00221975582685905,0.123196448390677,0,0,0,0,0,0,0,1,0.937853107344633,0.0486111111111111,0,0,0,0,0.0621468926553672,0.921296296296296,1,0.0990990990990991,0,0,0,0.00462962962962963,0,0,0,0,0,0.025462962962963,0,0.900900900900901,0,0,0,0,0,0,0,TRUE
0.000546149645002731,0.323320589841617,0.56198798470781,0.00327689787001638,0.110868377935554,0,0,0,0,0,0,0,1,0.952702702702703,0.0262645914396887,0,0,0,0,0.0472972972972973,0.943579766536965,1,0.123152709359606,0,0,0,0.00583657587548638,0,0,0,0,0,0.0243190661478599,0,0.876847290640394,0,0,0,0,0,0,0,TRUE
0.000193012931866435,0.253812005404362,0.605674580196873,0.00270218104613009,0.137039181625169,0.000579038795599305,0,0,0,0,0,0,1,0.930798479087453,0.027733503347147,0,0,1,0,0.067680608365019,0.941664010200829,1,0.114084507042254,0,0,0,0.00446286260758687,0,0,0,0,0.00152091254752852,0.0261396238444374,0,0.88169014084507,0,0,0,0,0,0.00422535211267606,0,TRUE
0.0014265335235378,0.289586305278174,0.487874465049929,0.00998573466476462,0.211126961483595,0,0,0,0,0,0,0,1,0.960591133004926,0.0204678362573099,0,0,0,0,0.0394088669950739,0.921052631578947,1,0.0816326530612245,0,0,0,0.0204678362573099,0,0,0,0,0,0.0380116959064327,0,0.918367346938776,0,0,0,0,0,0,0,TRUE
0.00161030595813205,0.289855072463768,0.610305958132045,0.0112721417069243,0.0869565217391304,0,0,0,0,0,0,0,1,0.927777777777778,0.0317460317460317,0,0,0,0,0.0722222222222222,0.923280423280423,1,0.185185185185185,0,0,0,0.0185185185185185,0,0,0,0,0,0.0264550264550265,0,0.814814814814815,0,0,0,0,0,0,0,TRUE
0.00153727901614143,0.252113758647194,0.507302075326672,0.00845503458877786,0.230591852421214,0,0,0.00304878048780488,0,0,0,0,1,0.917682926829268,0.0393939393939394,0,0,0,0,0.0731707317073171,0.909090909090909,1,0.0833333333333333,0,0,0,0.0151515151515152,0,0.00333333333333333,0,0,0.00609756097560976,0.0363636363636364,0,0.913333333333333,0,0,0,0,0,0,0,TRUE
0.0013869625520111,0.29126213592233,0.563106796116505,0.00970873786407767,0.134535367545076,0,0,0,0,0,0,0,1,0.904761904761905,0.0467980295566502,0,0,0,0,0.0904761904761905,0.908866995073892,1,0.114583333333333,0,0,0.00476190476190476,0.0147783251231527,0,0,0,0,0,0.0295566502463054,0,0.885416666666667,0,0,0,0,0,0,0,TRUE
0.000774593338497289,0.315259488768397,0.469403563129357,0.00852052672347018,0.204492641363284,0.00154918667699458,0,0,0,0,0,0,1,0.926289926289926,0.0445544554455446,0,0,1,0,0.0663390663390663,0.900990099009901,1,0.0836501901140684,0,0,0,0.0181518151815182,0,0,0,0,0.00737100737100737,0.0363036303630363,0,0.908745247148289,0,0,0,0,0,0.00760456273764259,0,TRUE
0.000745712155108128,0.206562266964952,0.511558538404176,0.00745712155108128,0.273676360924683,0,0,0,0,0,0,0,1,0.92057761732852,0.0306569343065693,0,0,0,0,0.075812274368231,0.915328467153285,0.9,0.0790190735694823,0,0,0,0.0131386861313869,0.1,0,0,0,0.0036101083032491,0.0408759124087591,0,0.920980926430518,0,0,0,0,0,0,0,TRUE
0.000825763831544178,0.207266721717589,0.64822460776218,0.00660611065235343,0.137076796036334,0,0,0,0,0,0,0,1,0.912350597609562,0.0267857142857143,0,0,0,0,0.0876494023904383,0.933673469387755,1,0.13855421686747,0,0,0,0.0102040816326531,0,0,0,0,0,0.0293367346938776,0,0.86144578313253,0,0,0,0,0,0,0,TRUE
0.000969932104752667,0.206595538312318,0.589718719689622,0.00484966052376334,0.197866149369544,0,0,0,0,0,0,0,1,0.929577464788732,0.0230642504118616,0,0,0,0,0.0657276995305164,0.934102141680395,1,0.107843137254902,0,0,0,0.00823723228995058,0,0,0,0,0.00469483568075117,0.0345963756177924,0,0.892156862745098,0,0,0,0,0,0,0,TRUE
0.000745712155108128,0.256524981357196,0.58165548098434,0.00447427293064877,0.156599552572707,0,0,0,0,0,0,0,1,0.927325581395349,0.030808729139923,0,0,0,0,0.0726744186046512,0.93196405648267,1,0.10952380952381,0,0,0,0.00770218228498074,0,0,0,0,0,0.0295250320924262,0,0.89047619047619,0,0,0,0,0,0,0,TRUE
0.00116144018583043,0.207897793263647,0.584204413472706,0.016260162601626,0.19047619047619,0,0,0,0,0,0,0,1,0.932960893854749,0.0218687872763419,0,0,0,0,0.0670391061452514,0.912524850894632,1,0.110429447852761,0,0,0,0.0278330019880716,0,0,0,0,0,0.0377733598409543,0,0.889570552147239,0,0,0,0,0,0,0,TRUE
0.000531632110579479,0.264221158958001,0.558213716108453,0.00956937799043062,0.167464114832536,0,0,0,0,0,0,0,1,0.915492957746479,0.0390848427073403,0,0,0,0,0.0804828973843058,0.914204003813155,1,0.104761904761905,0,0,0.00402414486921529,0.0142993326978074,0,0.00317460317460317,0,0,0,0.0324118207816969,0,0.892063492063492,0,0,0,0,0,0,0,FALSE
0.00181488203266788,0.223230490018149,0.524500907441016,0.00544464609800363,0.245009074410163,0,0,0,0,0,0,0,1,0.902439024390244,0.0380622837370242,0,0,0,0,0.0894308943089431,0.916955017301038,1,0.0746268656716418,0,0,0,0.0103806228373702,0,0,0,0,0.00813008130081301,0.0346020761245675,0,0.925373134328358,0,0,0,0,0,0,0,TRUE
0.00376647834274953,0.258003766478343,0.55743879472693,0.00941619585687382,0.171374764595104,0,0,0.0072992700729927,0,0,0,0,1,0.905109489051095,0.0405405405405405,0,0,0,0,0.0875912408759124,0.908783783783784,1,0.10989010989011,0,0,0,0.0168918918918919,0,0,0,0,0,0.0337837837837838,0,0.89010989010989,0,0,0,0,0,0,0,FALSE
0.000616903146206046,0.127698951264651,0.621221468229488,0.00863664404688464,0.24182603331277,0,0,0,0,0,0,0,1,0.893719806763285,0.0208540218470705,0,0,0,0,0.101449275362319,0.931479642502483,1,0.0869565217391304,0,0,0.00483091787439614,0.0119165839126117,0,0.00255754475703325,0,0,0,0.0357497517378352,0,0.910485933503836,0,0,0,0,0,0,0,TRUE
0.000237473284255521,0.141534077416291,0.558774637853242,0.00546188553787699,0.293991925908335,0,0,0,0,0,0,0,1,0.916107382550336,0.0208333333333333,0,0,0,0,0.0822147651006711,0.932397959183674,1,0.0710823909531502,0,0,0,0.00977891156462585,0,0,0,0,0.00167785234899329,0.0369897959183673,0,0.92891760904685,0,0,0,0,0,0,0,TRUE
0.00475059382422803,0.306413301662708,0.608076009501188,0.0118764845605701,0.0688836104513064,0,0,0.00775193798449612,0,0,0,0,1,0.906976744186046,0.04296875,0,0,0,0,0.0852713178294574,0.91796875,1,0.172413793103448,0,0,0,0.01953125,0,0,0,0,0,0.01953125,0,0.827586206896552,0,0,0,0,0,0,0,TRUE
0.00107411385606874,0.284640171858217,0.583243823845328,0.0118152524167562,0.119226638023631,0,0,0,0,0,0,0,1,0.939622641509434,0.0276752767527675,0,0,0,0,0.060377358490566,0.940959409594096,1,0.0540540540540541,0,0,0,0.018450184501845,0,0.00900900900900901,0,0,0,0.0129151291512915,0,0.936936936936937,0,0,0,0,0,0,0,TRUE
0.0013869625520111,0.259361997226075,0.574202496532594,0.00970873786407767,0.155339805825243,0,0,0,0,0,0,0,1,0.914438502673797,0.036319612590799,0,0,0,0,0.0855614973262032,0.929782082324455,1,0.0625,0,0,0,0.0169491525423729,0,0,0,0,0,0.0169491525423729,0,0.9375,0,0,0,0,0,0,0,TRUE
0.00181653042688465,0.217983651226158,0.53496821071753,0.0108991825613079,0.23433242506812,0,0,0.00416666666666667,0,0,0,0,1,0.920833333333333,0.0305602716468591,0,0,0,0,0.075,0.920203735144312,1,0.0658914728682171,0,0,0,0.0203735144312394,0,0,0,0,0,0.0288624787775891,0,0.934108527131783,0,0,0,0,0,0,0,FALSE
0.00181488203266788,0.281306715063521,0.52994555353902,0.00181488203266788,0.185117967332123,0,0,0,0,0,0,0,1,0.929032258064516,0.0343642611683849,0,0,0,0,0.0709677419354839,0.924398625429553,1,0.107843137254902,0,0,0,0.00343642611683849,0,0,0,0,0,0.0378006872852234,0,0.892156862745098,0,0,0,0,0,0,0,TRUE
0.00118906064209275,0.282996432818074,0.52794292508918,0.00832342449464923,0.179548156956005,0,0,0,0,0,0,0,1,0.920168067226891,0.0406320541760722,0,0,0,0,0.0798319327731092,0.90744920993228,1,0.105960264900662,0,0,0,0.0158013544018059,0,0,0,0,0,0.036117381489842,0,0.894039735099338,0,0,0,0,0,0,0,TRUE
0.0009000900090009,0.380738073807381,0.54995499549955,0.0045004500450045,0.0639063906390639,0,0,0,0,0,0,0,1,0.957446808510638,0.0278688524590164,0,0,0,0,0.0425531914893617,0.950819672131147,1,0.112676056338028,0,0,0,0.00819672131147541,0,0,0,0,0,0.0131147540983607,0,0.887323943661972,0,0,0,0,0,0,0,TRUE
0.000531632110579479,0.260499734183945,0.604997341839447,0.00691121743753323,0.127060074428495,0,0,0,0,0,0,0,1,0.928571428571429,0.0299032541776605,0,0,0,0,0.0714285714285714,0.939313984168865,1,0.0920502092050209,0,0,0,0.0105540897097625,0,0.00418410041841004,0,0,0,0.0202286719437115,0,0.903765690376569,0,0,0,0,0,0,0,FALSE
0.000624609618988132,0.165521549031855,0.748282323547783,0.00624609618988132,0.0793254216114928,0,0,0,0,0,0,0,1,0.90188679245283,0.0208855472013367,0,0,0,0,0.0867924528301887,0.959899749373434,1,0.125984251968504,0,0,0.00754716981132075,0.00668337510442774,0,0,0,0,0.00377358490566038,0.012531328320802,0,0.874015748031496,0,0,0,0,0,0,0,TRUE
0.0013869625520111,0.356449375866852,0.597780859916782,0.00693481276005548,0.0374479889042996,0,0,0,0,0,0,0,1,0.937743190661479,0.0348837209302326,0,0,0,0,0.0622568093385214,0.944186046511628,1,0.148148148148148,0,0,0,0.0116279069767442,0,0,0,0,0,0.00930232558139535,0,0.851851851851852,0,0,0,0,0,0,0,TRUE
0.00104058272632674,0.184183142559834,0.625390218522373,0.0072840790842872,0.18210197710718,0,0,0,0,0,0,0,1,0.903954802259887,0.0266666666666667,0,0,0,0,0.096045197740113,0.935,1,0.0914285714285714,0,0,0,0.0116666666666667,0,0,0,0,0,0.0266666666666667,0,0.908571428571429,0,0,0,0,0,0,0,TRUE
0.000571102227298686,0.271273557966876,0.539691604797259,0.010850942318675,0.177612792689891,0,0,0,0,0,0,0,1,0.932631578947368,0.0328042328042328,0,0,0,0,0.0631578947368421,0.917460317460317,1,0.0935483870967742,0,0,0,0.0201058201058201,0,0,0,0,0.00421052631578947,0.0296296296296296,0,0.906451612903226,0,0,0,0,0,0,0,TRUE
0.000999000999000999,0.186813186813187,0.503496503496504,0.003996003996004,0.304695304695305,0,0,0,0,0,0,0,1,0.887700534759358,0.0397614314115308,0,0,0,0,0.106951871657754,0.910536779324056,1,0.0721311475409836,0,0,0,0.00596421471172962,0,0.00327868852459016,0,0,0.0053475935828877,0.0437375745526839,0,0.924590163934426,0,0,0,0,0,0,0,TRUE
0.00203665987780041,0.283095723014257,0.562118126272912,0.0142566191446029,0.136456211812627,0.00203665987780041,0,0,0,0,0,0,0,0.920863309352518,0.0363636363636364,0,0,1,1,0.079136690647482,0.909090909090909,1,0.104477611940299,0,0,0,0.0254545454545455,0,0,0,0,0,0.0290909090909091,0,0.880597014925373,0,0,0,0,0,0.0149253731343284,0,TRUE
0.00107411385606874,0.163265306122449,0.570354457572503,0.00429645542427497,0.261009667024705,0,0,0,0,0,0,0,1,0.940789473684211,0.0150943396226415,0,0,0,0,0.0592105263157895,0.945283018867925,1,0.0699588477366255,0,0,0,0.00566037735849057,0,0.00411522633744856,0,0,0,0.0339622641509434,0,0.925925925925926,0,0,0,0,0,0,0,TRUE
0.000644745325596389,0.120567375886525,0.631205673758865,0.00709219858156028,0.240490006447453,0,0,0,0,0,0,0,1,0.887700534759358,0.0204498977505112,0,0,0,0,0.106951871657754,0.936605316973415,1,0.0857908847184987,0,0,0.0053475935828877,0.0102249488752556,0,0,0,0,0,0.032719836400818,0,0.914209115281501,0,0,0,0,0,0,0,TRUE
