0.528571	1.746485	1
3.980726	9.678458	2
14.776190	17.281179	3
18.437868	19.885261	4
20.762585	21.770975	5
53.657823	56.152834	6
57.199773	59.375510	7
61.140816	63.715646	8
67.027438	67.816327	9
69.920862	73.663039	10
74.769841	76.666213	11
78.122222	81.934240	12
82.781633	93.517914	13
96.510431	97.299320	14
98.036961	101.878912	15
103.354875	107.017234	16
108.303628	109.072562	17
110.897732	112.824036	18
118.789796	120.187302	19
124.167574	126.622676	20
133.037415	134.265306	21
136.818821	137.358277	22
138.475057	138.795011	23
139.582540	141.987755	24
143.234240	143.584127	25
144.660998	145.649433	26
151.096372	153.152381	27
159.636961	160.126531	28
176.249206	181.308390	29
184.929478	189.419955	30
192.222902	196.763265	31
198.987528	199.317460	32
200.524036	203.557823	33
205.343084	205.922449	34
206.859637	210.751474	35
218.004308	219.491610	36
220.408844	222.065760	37
226.135828	227.094331	38
228.041497	229.069841	39
230.895011	232.122902	40
234.017914	234.806803	41
235.734014	238.039456	42
239.994331	240.863039	43
245.571655	247.019048	44
250.360771	251.598639	45
254.092290	258.303401	46
259.869161	267.432653	47
269.168027	272.570975	48
274.196599	281.001814	49
282.856916	283.745578	50
288.284580	290.121088	51
291.138095	292.405896	52
294.749887	295.708390	53
297.593424	297.933333	54
309.945351	310.714286	55
313.138095	313.857143	56
315.462812	317.389116	57
319.413832	319.833560	58
322.407029	326.179138	59
331.167120	332.903855	60
343.219728	345.235828	61
346.382540	349.486168	62
351.251474	356.739683	63
357.577098	360.131973	64
361.927211	363.204989	65
364.162132	365.090703	66
374.598413	374.908390	67
388.317234	389.225850	68
390.492290	391.021769	69
399.531746	401.517914	70
405.617914	406.416780	71
408.780726	411.076190	72
422.290023	427.079819	73
444.359864	448.700680	74
450.017007	452.512018	75
454.716327	457.450794	76
459.904535	461.890703	77
462.837868	463.706576	78
465.521769	466.170975	79
467.207937	470.022222	80
472.456009	473.903401	81
479.480045	479.790023	82
482.393424	482.713379	83
484.528571	496.382313	84
501.021088	501.331066	85
505.590703	506.738776	86
512.405215	514.570975	87
517.254195	517.853515	88
520.856009	521.814512	89
522.981179	526.304308	90
527.091837	529.497052	91
530.623810	534.435828	92
535.851927	536.211791	93
541.050113	541.998639	94
544.372562	544.692517	95
549.560771	552.155556	96
553.332200	553.662132	97
557.971655	562.352381	98
563.239683	564.607256	99
567.370295	570.154649	100
572.139456	572.449433	101
574.773469	576.939229	102
578.914059	580.291610	103
582.396145	583.843537	104
589.041043	590.049433	105
601.003855	601.613152	106
604.535828	607.260317	107
608.686395	609.116100	108
612.577551	612.887528	109
628.920408	631.944218	110
634.238322	635.256689	111
671.902721	672.541950	112
673.948073	678.368707	113
684.124943	686.200907	114
686.948526	689.623129	115
691.009297	692.556463	116
694.192063	696.068481	117
697.205215	702.453968	118
704.398866	707.751927	119
709.756689	714.855782	120
715.583447	717.010884	121
721.160771	722.717914	122
724.253741	724.853061	123
727.526304	728.534694	124
729.870975	730.340590	125
731.078231	731.398186	126
732.135828	733.443537	127
734.739909	736.287075	128
739.718594	741.345578	129
742.771655	743.570522	130
745.535374	747.132426	131
747.999773	752.041270	132
753.088209	758.007710	133
758.974830	761.739229	134
764.202948	764.722449	135
768.702721	772.155556	136
777.113605	779.419048	137
799.043764	800.670748	138
803.533560	804.332426	139
807.135374	809.520635	140
810.687302	811.775510	141
816.683673	818.051247	142
818.858730	821.553288	143
822.310884	824.177324	144
825.004762	825.314739	145
836.827891	839.602268	146
843.891837	844.800454	147
851.245125	852.043991	148
853.340363	861.642177	149
863.936281	867.389116	150
870.471429	873.195918	151
874.721769	879.890703	152
881.745805	882.055782	153
884.250113	886.236281	154
887.133560	890.127438	155
891.343991	893.918821	156
894.736281	895.185941	157
896.711791	898.638095	158
900.104082	900.434014	159
902.728118	903.806349	160
905.481859	908.884807	161
938.945805	942.049433	162
942.916780	943.615873	163
946.857823	947.197732	164
956.944898	959.749206	165
961.125397	961.974150	166
963.140816	964.338776	167
968.348980	968.658957	168
969.556236	970.195465	169
971.092744	971.582313	170
975.253288	977.678458	171
980.261905	984.722449	172
985.639683	990.818594	173
991.695918	997.892517	174
998.779819	999.309297	175
1002.511338	1002.821315	176
1007.619728	1010.384127	177
1011.251474	1012.718821	178
1017.287755	1024.422222	179
1027.085488	1027.754649	180
1028.572109	1029.101587	181
1031.256009	1037.382766	182
1038.858730	1039.687528	183
1041.093651	1041.403628	184
1044.306349	1046.422222	185
1052.068707	1053.276644	186
1056.618367	1057.876190	187
1060.389796	1060.859410	188
1085.652381	1086.301587	189
1087.019274	1091.380045	190
1095.080952	1096.129252	191
1099.740363	1100.439456	192
1105.417460	1106.036735	193
1110.964853	1112.661678	194
1114.526757	1120.074830	195
1122.847846	1123.965986	196
1125.022902	1125.781859	197
1128.225624	1128.535601	198
1131.607937	1136.287982	199
1138.372562	1138.822222	200
1179.678685	1181.624943	201
1183.709524	1184.658050	202
1186.612925	1189.936054	203
1193.896372	1198.137415	204
1199.613379	1202.816780	205
1209.880045	1214.629932	206
1215.986168	1220.137415	207
1220.944898	1222.372336	208
1226.472336	1227.370975	209
1233.476417	1234.315193	210
1238.574830	1239.184127	211
1242.036961	1242.875737	212
1243.683220	1249.021769	213
1253.051927	1254.070295	214
1257.970748	1261.064399	215
1262.460544	1262.790476	216
1264.456009	1273.376417	217
1296.802494	1298.858503	218
1333.369388	1335.784580	219
1337.699546	1338.628118	220
1342.388889	1342.698866	221
1352.735374	1354.651701	222
1356.327211	1356.996372	223
1358.312698	1358.692517	224
1361.146259	1362.004989	225
1391.686848	1392.824943	226
1400.107710	1400.667120	227
1406.303628	1407.112472	228
1421.070068	1422.437642	229
1424.562132	1426.807710	230
1431.077324	1433.093424	231
1434.349887	1435.637642	232
1437.612472	1438.261678	233
1443.658730	1446.373243	234
1447.948980	1450.533787	235
1452.408844	1452.748753	236
1454.953061	1456.520181	237
1458.415193	1459.962358	238
1460.929478	1464.152834	239
1465.658730	1475.347392	240
1482.809751	1483.119728	241
1489.564399	1492.937415	242
1493.974376	1494.613605	243
1498.254649	1500.380499	244
1505.478231	1507.155102	245
1509.898186	1510.248073	246
1515.814739	1519.956009	247
1522.070522	1523.338322	248
1531.279592	1531.589569	249
1557.859184	1559.426304	250
1564.893197	1566.759637	251
1567.607029	1568.675283	252
1571.288662	1573.025397	253
1575.359410	1576.896599	254
1585.945351	1586.255329	255
1608.573923	1608.883900	256
1620.746259	1621.096145	257
1628.528571	1629.387302	258
1631.711338	1633.029025	259
1643.055556	1644.912018	260
1654.649206	1655.677551	261
1659.478231	1661.334694	262
1663.748526	1664.587302	263
1669.555329	1670.633560	264
1712.956689	1716.170068	265
1725.019274	1725.528798	266
1727.224263	1730.976417	267
1734.547619	1740.824036	268
1741.900907	1743.328345	269
1746.530385	1747.638549	270
1748.615646	1750.212698	271
1751.958050	1756.478458	272
1758.143991	1759.551474	273
1765.547166	1770.775964	274
1771.872789	1772.192744	275
1778.966667	1779.755556	276
1782.069615	1782.768707	277
1788.804308	1791.199546	278
1792.396145	1792.795918	279
1802.992063	1803.621315	280
1808.300000	1809.627664	281
1811.363039	1811.673016	282
1812.520408	1813.957823	283
1814.845125	1816.182766	284
1821.290476	1823.107029	285
1824.483220	1825.571429	286
1827.506349	1827.816327	287
1831.796599	1833.663039	288
1835.099093	1837.175057	289
1851.960771	1854.046712	290
1856.071429	1856.820408	291
1859.144444	1862.597279	292
1865.220635	1866.069388	293
1867.854649	1868.533787	294
1871.875510	1874.160998	295
1875.088209	1876.755102	296
1879.847392	1881.464399	297
1884.616553	1885.734694	298
1886.661905	1889.496145	299
1896.878685	1898.625397	300
1899.821995	1901.818141	301
1904.970295	1910.468481	302
1913.850113	1914.160091	303
1918.409751	1918.719728	304
1920.844218	1922.680726	305
1924.086848	1924.646259	306
1927.469161	1928.956463	307
1929.873696	1930.482993	308
1933.226077	1933.546032	309
1945.368481	1946.317007	310
1948.730839	1949.679365	311
1952.312698	1954.717914	312
1955.774830	1957.042630	313
1957.800227	1960.814059	314
1963.048299	1963.747392	315
1967.448299	1969.833560	316
1971.997959	1975.949660	317
1977.964399	1979.810884	318
1980.548526	1981.995918	319
1983.571655	1983.961451	320
1985.706803	1986.535601	321
1987.472789	1991.304762	322
1992.820635	1996.532880	323
1999.126304	2000.902948	324
2005.631519	2007.936961	325
2008.804308	2011.628571	326
2012.964853	2015.400000	327
2016.716327	2017.175964	328
2018.023356	2019.510658	329
2025.785714	2026.744218	330
2029.227891	2029.597732	331
2039.235147	2039.744671	332
2042.767120	2045.292063	333
2050.399773	2051.418141	334
2060.676417	2064.638095	335
2065.555329	2065.895238	336
2066.802494	2067.371882	337
2069.326757	2072.380499	338
2074.504989	2075.663039	339
2079.044671	2079.733787	340
2081.439229	2086.478458	341
2091.436508	2093.382766	342
2113.217007	2114.784127	343
2118.285488	2118.725170	344
2120.211111	2123.773696	345
2126.027891	2126.916553	346
2128.372562	2128.712472	347
2131.236054	2141.772789	348
2143.767574	2148.597279	349
2152.637415	2155.102494	350
2156.149433	2157.586848	351
2160.888662	2163.682993	352
2168.740816	2169.789116	353
2181.162585	2181.891610	354
2184.983900	2185.413605	355
2187.687755	2197.915193	356
2199.760317	2200.070295	357
2201.835601	2202.494785	358
2205.018367	2205.328345	359
2208.829705	2209.169615	360
2220.902268	2221.910658	361
2229.313152	2230.102041	362
2231.867347	2232.616327	363
2233.812925	2235.579592	364
2237.344898	2241.795465	365
2244.259184	2246.434921	366
2248.848753	2254.865760	367
2256.571202	2260.742404	368
2263.515420	2299.634014	369
2300.421542	2306.658050	370
2311.057370	2312.804082	371
2314.140363	2316.455782	372
2322.052381	2327.859864	373
2328.707256	2329.436281	374
2330.782540	2332.140136	375
2335.002948	2347.604989	376
2357.801134	2359.388209	377
2360.724490	2362.112018	378
2373.256009	2373.955102	379
2374.842404	2375.341950	380
2381.078231	2382.046712	381
2389.369388	2392.792290	382
2396.423356	2398.758730	383
2401.272336	2403.657596	384
2405.881859	2407.299320	385
2411.309524	2411.619501	386
2441.171655	2445.582313	387
2447.128118	2448.365986	388
2453.164399	2458.772336	389
2460.966667	2462.783220	390
2464.907710	2470.326077	391
2475.254195	2479.535147	392
2482.517687	2484.244444	393
2485.071882	2486.100227	394
2487.416553	2495.638549	395
2496.625624	2497.185034	396
2498.660998	2501.305669	397
2502.143084	2505.316553	398
2507.939909	2509.127891	399
2512.599320	2513.527891	400
2514.534921	2515.413605	401
2517.787528	2518.356916	402
2522.307256	2523.495238	403
2525.250567	2527.306576	404
2539.328571	2541.155102	405
2546.442404	2550.673469	406
2553.795692	2554.105669	407
2554.963039	2558.146485	408
2561.947166	2562.935601	409
2564.062358	2564.541950	410
2567.364853	2567.774603	411
2571.395692	2572.274376	412
2573.730385	2576.584580	413
2578.110431	2579.887075	414
2581.093651	2581.852608	415
2585.304082	2588.916553	416
2589.923583	2590.622676	417
2594.293651	2595.192290	418
2596.927664	2597.237642	419
2601.098186	2605.079819	420
2606.116780	2608.372336	421
2609.399320	2610.427664	422
2611.903628	2612.213605	423
2613.559864	2615.286621	424
2618.957596	2626.920181	425
2627.987075	2632.876644	426
2634.312698	2634.632653	427
2635.689569	2643.073469	428
2644.679138	2647.912472	429
2652.361678	2653.868934	430
2657.220635	2658.139229	431
2662.997506	2664.574603	432
2670.460544	2670.800454	433
2672.585714	2677.914286	434
2681.764853	2686.923810	435
2690.085941	2694.476644	436
2695.294104	2695.983220	437
2696.870522	2698.617234	438
2699.963492	2700.273469	439
2707.197052	2708.634467	440
2709.421995	2710.420408	441
2715.987075	2717.264853	442
2720.696372	2725.366440	443
2726.533107	2727.242177	444
2734.485034	2736.421315	445
2737.308617	2743.864399	446
2746.547619	2750.818594	447
2754.240136	2757.523356	448
2758.749887	2762.332426	449
2764.456916	2765.465306	450
2768.926757	2771.341950	451
2772.059637	2773.147846	452
2774.154875	2775.622222	453
2776.529478	2777.019048	454
2778.185714	2780.341497	455
2782.046939	2790.348753	456
2797.042857	2803.319274	457
2805.842857	2814.823129	458
2817.406576	2817.965986	459
2820.010658	2823.732880	460
2825.378458	2826.446712	461
2843.986168	2846.012245	462
2852.586621	2853.165986	463
2855.599773	2857.486168	464
2858.642857	2861.975964	465
2870.166667	2875.515193	466
2878.238322	2881.282086	467
2882.269161	2887.537868	468
2889.772109	2895.509751	469
2899.988889	2901.057143	470
2907.042857	2912.860317	471
2921.250567	2921.560544	472
2922.507710	2922.947392	473
2924.213832	2924.942857	474
2925.949887	2928.714286	475
2930.190249	2942.782313	476
2944.737188	2945.476190	477
2946.822449	2947.451701	478
2948.977551	2951.113379	479
2952.818821	2953.897052	480
2958.795238	2960.272562	481
2968.563039	2969.701134	482
2974.070522	2979.369161	483
2980.795238	2981.374603	484
2984.965760	2986.353288	485
2987.799320	2989.376417	486
2990.433333	2990.803175	487
2994.963039	2995.821769	488
2999.303175	2999.613152	489
3000.390703	3000.940136	490
3003.254195	3005.210431	491
3020.564853	3023.768254	492
3024.475964	3032.508390	493
3034.712698	3040.460317	494
3043.113605	3045.917914	495
3052.801587	3056.414059	496
3058.129478	3061.452608	497
3065.772109	3067.528798	498
3069.194331	3070.132880	499
3073.354875	3075.091610	500
3078.922222	3080.539229	501
3081.626077	3084.779592	502
3089.597959	3094.876644	503
3098.996599	3102.828571	504
3104.284580	3106.111111	505
3108.155782	3114.781406	506
3115.958050	3116.487528	507
3128.040590	3129.188662	508
3130.185714	3133.748299	509
3134.635601	3137.000907	510
3140.093197	3140.662585	511
3141.519955	3142.059410	512
3143.136281	3146.818594	513
3148.833333	3149.771882	514
3157.952608	3158.262585	515
3165.455556	3166.583673	516
3167.411111	3169.646712	517
3177.438322	3178.456689	518
3179.513605	3182.228118	519
3184.841497	3185.909751	520
3186.667347	3187.575964	521
3194.230159	3199.688435	522
3200.515873	3201.494331	523
3204.766213	3214.255329	524
3215.182540	3216.420408	525
3217.646939	3225.220408	526
3227.135374	3230.967347	527
3232.952154	3236.404989	528
3244.186621	3248.736961	529
3250.691837	3255.621315	530
3256.847846	3257.826304	531
3258.583900	3263.942404	532
3274.807029	3279.826304	533
3280.843311	3284.954649	534
3285.851927	3292.437642	535
3293.684127	3300.529252	536
3303.092744	3308.112018	537
3310.196599	3321.072562	538
3321.959864	3324.584580	539
3325.491837	3327.378231	540
3328.375283	3329.214059	541
3329.961678	3334.152834	542
3338.492290	3339.809977	543
3341.265986	3351.942404	544
3354.805215	3359.006349	545
3360.901361	3363.156916	546
3364.692744	3372.675283	547
3376.485941	3377.504308	548
3378.900454	3379.988662	549
3381.724036	3382.582766	550
3394.634694	3396.012245	551
3397.518141	3398.656236	552
3401.568934	3405.909751	553
3406.976644	3409.860771	554
3412.474150	3416.176417	555
3417.412925	3419.967800	556
3426.392517	3428.418594	557
3429.505442	3431.691156	558
3433.586168	3434.534694	559
3437.168027	3441.069841	560
3442.765306	3443.723810	561
3452.223810	3454.090249	562
3456.015193	3459.857143	563
3461.113605	3466.282540	564
3467.000227	3467.679365	565
3469.125397	3470.423129	566
3473.275964	3473.835374	567
3479.491837	3481.577778	568
3485.697732	3487.843537	569
3490.446939	3493.151474	570
3495.246032	3495.865306	571
3499.905442	3506.461224	572
3509.284127	3516.089342	573
3516.966667	3518.763265	574
3520.708163	3522.145578	575
3522.883220	3523.931519	576
3528.021542	3528.610884	577
3530.156689	3533.479819	578
3534.247392	3548.785034	579
3552.545805	3553.873469	580
3559.360317	3561.057143	581
3566.953061	3568.759637	582
3570.265533	3570.884807	583
3571.941723	3580.283447	584
3581.909070	3582.229025	585
3583.545351	3587.556916	586
3588.314512	3597.125170	587
3598.441497	3610.953741	588
3614.395238	3614.904762	589
3616.739909	3619.873469	590
3622.526757	3630.429478	591
3632.075057	3635.158730	592
3637.562585	3643.360091	593
3646.163039	3646.802268	594
3648.727211	3649.855329	595
3673.171655	3675.676644	596
3679.876417	3681.403628	597
3683.069161	3683.379138	598
3686.391610	3689.435374	599
3696.937642	3698.544671	600
3700.339909	3700.699773	601
3703.382993	3703.812698	602
3708.870522	3709.459864	603
3710.257370	3712.852154	604
3713.839229	3714.907483	605
3716.582993	3716.892971	606
3718.698186	3720.804082	607
3721.591610	3723.787302	608
3725.762132	3728.077551	609
3728.924943	3735.051701	610
3736.677324	3739.591383	611
3740.498639	3748.750567	612
3749.667800	3751.823583	613
3758.417914	3758.727891	614
3764.963039	3766.679819	615
3769.083673	3769.493424	616
3780.447846	3783.930612	617
3784.648299	3785.716553	618
3786.783447	3796.192744	619
3797.139909	3797.928798	620
3799.414739	3800.981859	621
3803.465533	3807.087982	622
3808.424263	3811.717460	623
3812.614739	3813.702948	624
3814.630159	3814.940136	625
3816.096825	3819.809070	626
3820.766213	3821.106122	627
3822.103175	3822.772336	628
3826.293651	3829.177778	629
3831.771202	3834.745125	630
3835.562585	3835.872562	631
3836.610204	3844.353288	632
3845.968934	3846.618141	633
3848.413379	3849.671202	634
3850.558503	3855.487982	635
3856.674603	3857.353741	636
3858.131293	3858.441270	637
3876.998413	3877.827211	638
3878.684580	3880.471202	639
3891.365760	3893.571429	640
3894.558503	3895.167800	641
3896.294558	3897.971429	642
3901.582540	3902.511111	643
3905.074603	3912.288889	644
3915.690476	3916.848526	645
3920.280045	3922.595465	646
3923.812018	3924.271655	647
3925.029252	3925.658503	648
3926.835147	3936.583673	649
3939.955329	3940.514739	650
3945.243311	3945.912472	651
3947.198866	3947.538776	652
3949.184354	3949.494331	653
3966.115873	3966.755102	654
3974.337188	3975.225850	655
3975.973469	3976.283447	656
3981.012018	3981.321995	657
3982.408844	3983.916100	658
2.384354	2.953741	1
5.327664	5.697506	2
14.536735	16.123810	3
17.490023	19.037188	4
20.104082	20.414059	5
30.809751	31.299320	6
34.441497	34.811338	7
43.800227	44.918367	8
45.855556	47.542404	9
50.784354	51.094331	10
52.091383	55.783673	11
57.808390	61.809977	12
66.638322	67.616780	13
69.431973	70.979138	14
75.727664	77.833560	15
84.507710	84.947392	16
85.994331	86.813152	17
88.299093	89.367347	18
96.510431	96.900227	19
104.961224	105.760091	20
110.418821	112.424943	21
114.070522	114.380499	22
115.796599	117.154195	23
118.001587	118.800454	24
120.795238	123.130612	25
125.843764	127.231293	26
134.364399	136.600000	27
139.343084	139.872562	28
141.348526	147.744671	29
162.889569	163.229478	30
164.635601	165.015420	31
166.371655	168.726984	32
171.120862	172.189116	33
175.411111	176.329705	34
183.412925	184.860317	35
186.416100	187.334694	36
215.110884	218.054875	37
219.021995	219.661224	38
227.752154	229.608617	39
230.565760	236.333333	40
240.533107	244.055782	41
248.185714	249.523356	42
262.922222	263.810884	43
273.039229	273.738322	44
274.505896	274.865760	45
322.596599	323.714739	46
324.671882	325.670295	47
333.960771	335.398186	48
339.887302	342.422222	49
343.908163	344.717007	50
352.797959	353.936054	51
354.723583	355.422676	52
357.976190	358.425850	53
359.353061	359.682993	54
362.595692	363.254875	55
364.172109	364.721542	56
369.869161	371.117007	57
372.124036	372.902948	58
375.556236	377.223129	59
379.407483	380.755102	60
382.799773	384.486621	61
386.850567	388.058503	62
389.005669	389.884354	63
392.168481	392.528345	64
393.964399	394.942857	65
397.695918	400.330612	66
408.212018	410.996372	67
412.123129	412.652608	68
424.754422	427.209524	69
430.192063	430.871202	70
431.868254	432.437642	71
439.560771	442.025850	72
442.733560	446.266213	73
449.707710	451.264853	74
462.817914	464.095692	75
466.230159	467.537868	76
477.035601	478.562812	77
480.058730	483.172336	78
488.260091	489.428118	79
504.024263	504.932880	80
506.768027	507.247619	81
511.656916	513.134240	82
514.251020	514.680726	83
516.924943	517.324717	84
519.189796	521.355556	85
523.110884	528.239909	86
529.027438	533.567800	87
535.981633	540.272562	88
541.070068	543.405442	89
546.028798	549.321995	90
550.169388	550.998186	91
551.705896	553.692063	92
557.313152	557.832653	93
563.758503	565.255782	94
567.739456	570.364172	95
572.019728	572.419501	96
574.124943	575.153288	97
577.237868	579.862585	98
586.636508	587.106122	99
588.811565	589.410884	100
590.138549	590.628118	101
604.176644	607.749206	102
611.460091	616.698866	103
618.364399	620.190930	104
629.199773	633.620408	105
634.886848	635.705669	106
661.266893	663.602268	107
665.896372	666.246259	108
667.941723	669.009977	109
671.633333	672.102948	110
672.860544	675.315646	111
683.725850	684.584580	112
687.467347	688.515646	113
699.440136	703.102494	114
705.386621	705.696599	115
708.130385	709.527891	116
710.255556	711.692971	117
712.859637	713.468934	118
714.954875	715.514286	119
723.365760	727.028118	120
732.405215	733.443537	121
734.719955	735.708390	122
738.132200	740.856689	123
741.724036	742.323356	124
744.607483	746.783220	125
748.029705	748.459410	126
762.277324	762.796825	127
767.236054	768.084807	128
768.882313	769.192290	129
778.879592	780.037642	130
784.696372	786.103855	131
789.954422	790.443991	132
793.187075	794.704308	133
796.349887	796.659864	134
801.338549	802.706122	135
806.506803	807.495238	136
808.262812	811.595918	137
814.728118	815.197732	138
816.085034	818.699773	139
819.976190	820.854875	140
822.550340	823.000000	141
823.877324	824.187302	142
827.818367	828.886621	143
830.312698	832.129252	144
833.425624	833.875283	145
834.912245	836.150113	146
838.973016	840.450340	147
842.075964	842.994558	148
845.099093	845.658503	149
858.758050	861.253061	150
864.016100	868.257143	151
869.962585	870.482086	152
871.249660	879.321995	153
881.217007	881.726531	154
883.811111	884.679819	155
885.557143	888.870295	156
889.657823	894.816780	157
895.634240	897.949660	158
898.817007	903.117914	159
904.573923	905.033560	160
906.748980	908.824943	161
909.542630	910.131973	162
911.418367	914.911111	163
916.686395	918.622676	164
919.769388	921.685714	165
924.299093	925.028118	166
929.108163	929.418141	167
937.030159	937.589569	168
938.496825	940.592744	169
942.338095	942.997279	170
946.847846	948.564626	171
954.470522	957.115193	172
959.568934	960.208163	173
964.916780	966.972789	174
968.508617	969.457143	175
970.364399	973.687528	176
978.745351	979.065306	177
983.424717	983.984127	178
985.809297	986.937415	179
991.077324	992.963719	180
996.654649	997.064399	181
1000.994785	1001.504308	182
1003.888209	1005.834467	183
1007.729478	1008.189116	184
1008.996599	1009.316553	185
1010.642857	1013.147846	186
1027.195238	1027.884354	187
1034.967574	1035.956009	188
1042.071429	1043.269388	189
1044.046939	1046.033107	190
1046.790703	1047.509751	191
1048.337188	1048.687075	192
1050.332653	1050.652608	193
1051.440136	1051.750113	194
1053.395692	1055.002721	195
1056.568481	1057.526984	196
1059.272336	1060.141043	197
1061.746712	1063.453515	198
1064.819728	1068.112925	199
1071.324943	1071.914286	200
1074.577551	1075.486168	201
1076.752608	1078.559184	202
1083.846485	1084.176417	203
1086.141270	1086.560998	204
1095.549887	1097.915193	205
1102.154875	1104.370522	206
1105.926304	1112.172789	207
1112.960317	1113.270295	208
1114.397052	1115.664853	209
1119.106349	1119.446259	210
1123.226984	1124.564626	211
1125.621542	1126.121088	212
1127.437415	1128.475737	213
1130.600227	1130.960091	214
1137.853741	1138.163719	215
1138.911338	1140.538322	216
1144.518594	1145.327438	217
1151.911791	1152.431293	218
1155.423810	1157.370068	219
1159.444671	1161.740136	220
1164.493197	1167.526984	221
1168.374376	1170.889342	222
1172.814286	1179.609524	223
1182.063265	1183.869841	224
1187.610658	1195.752834	225
1196.490476	1199.554195	226
1202.995692	1207.735601	227
1209.171655	1209.731066	228
1211.805669	1215.348299	229
1218.330839	1219.828118	230
1223.070068	1223.549660	231
1228.128571	1232.639002	232
1234.464172	1234.774150	233
1238.425170	1239.423583	234
1240.969388	1242.875737	235
1243.753061	1245.370068	236
1252.004308	1252.453968	237
1254.598413	1262.092063	238
1263.727664	1264.426757	239
1265.284127	1265.993197	240
1270.891383	1272.199093	241
1274.353515	1275.062585	242
1276.678231	1280.200907	243
1281.447392	1283.154195	244
1284.879592	1285.189569	245
1295.186168	1296.902948	246
1300.354422	1304.924717	247
1306.101361	1306.541043	248
1307.348526	1307.658503	249
1310.042404	1310.352381	250
1313.694104	1316.209070	251
1318.353515	1318.932880	252
1333.648753	1334.018594	253
1340.443311	1343.666667	254
1346.499546	1346.809524	255
1357.873696	1359.041723	256
1359.998866	1361.027211	257
1384.193878	1384.603628	258
1387.895465	1389.073469	259
1390.978458	1392.455782	260
1393.552608	1395.448980	261
1396.456009	1399.000907	262
1400.536735	1400.846712	263
1404.348073	1409.447166	264
1411.821088	1416.121995	265
1417.597959	1418.087528	266
1420.042404	1420.492063	267
1421.519048	1423.894331	268
1431.187075	1431.906122	269
1433.441950	1434.290703	270
1437.273243	1439.718367	271
1440.914966	1441.384580	272
1443.958050	1445.116100	273
1446.681859	1447.191383	274
1447.968934	1449.346485	275
1468.612018	1470.019501	276
1474.109524	1474.609070	277
1476.015193	1480.904762	278
1482.650113	1482.970068	279
1486.052381	1489.076190	280
1492.467800	1493.725624	281
1494.612925	1498.474830	282
1502.036054	1502.675283	283
1508.910431	1509.250340	284
1510.127664	1514.777778	285
1516.004308	1516.952834	286
1518.498639	1518.808617	287
1522.300000	1523.029025	288
1540.458730	1540.928345	289
1555.684127	1556.123810	290
1558.976644	1559.595918	291
1564.364399	1565.921542	292
1569.462812	1572.596372	293
1573.623356	1574.122902	294
1584.827891	1590.505669	295
1608.194785	1609.352834	296
1615.578005	1620.128345	297
1621.564399	1624.638095	298
1628.159410	1629.068027	299
1630.244671	1630.903855	300
1632.559410	1633.058957	301
1640.790703	1642.866667	302
1643.614286	1646.079365	303
1648.393424	1648.703401	304
1656.275510	1657.593197	305
1658.390703	1659.448980	306
1660.595692	1663.479819	307
1665.225170	1668.378685	308
1672.279138	1673.367347	309
1675.362132	1677.587755	310
1678.644671	1679.014512	311
1680.749887	1681.099773	312
1696.025170	1696.335147	313
1715.900000	1716.509297	314
1720.290023	1724.790476	315
1726.914966	1727.833560	316
1734.836961	1735.775510	317
1738.638322	1739.746485	318
1740.863265	1741.642177	319
1745.612472	1747.209524	320
1748.585714	1752.437642	321
1753.145351	1755.211338	322
1758.193878	1759.072562	323
1764.948526	1766.026757	324
1768.749887	1770.746032	325
1789.253288	1789.563265	326
1803.031973	1809.557823	327
1814.196599	1814.716100	328
1823.675057	1824.633560	329
1827.157143	1829.891610	330
1830.908617	1832.176417	331
1835.019274	1835.359184	332
1843.889116	1846.194558	333
1847.341270	1847.880726	334
1850.803401	1851.133333	335
1858.266440	1859.643991	336
1871.306803	1871.796372	337
1885.434694	1889.945125	338
1891.201587	1893.626757	339
1896.300000	1897.128798	340
1898.115873	1898.904762	341
1900.061451	1901.778231	342
1905.080045	1905.390023	343
1906.247392	1907.545125	344
1913.780272	1914.349660	345
1916.035147	1920.665306	346
1921.792063	1923.429025	347
1926.212018	1935.471655	348
1936.299093	1937.666667	349
1938.384354	1942.425850	350
1943.363039	1946.436735	351
1947.403855	1948.990930	352
1954.946712	1957.312018	353
1963.537188	1965.752834	354
1967.428345	1969.334694	355
1974.322676	1976.119274	356
1977.335828	1978.354195	357
1980.289116	1980.848526	358
1983.481859	1991.424490	359
1992.920408	1994.996372	360
1997.849206	2002.200000	361
2003.127211	2005.731973	362
2006.439683	2007.388209	363
2011.089116	2011.708390	364
2013.094558	2014.731519	365
2015.648753	2017.465306	366
2018.212925	2019.869841	367
2024.797959	2025.517007	368
2035.952608	2036.372336	369
2037.778458	2038.088435	370
2039.604308	2040.233560	371
2052.135828	2052.445805	372
2063.899093	2064.209070	373
2065.535374	2065.875283	374
2067.031973	2069.726531	375
2070.583900	2072.639909	376
2074.325397	2074.954649	377
2087.595238	2089.152381	378
2092.224717	2092.534694	379
2110.652834	2113.736508	380
2131.864626	2133.521542	381
2134.259184	2134.569161	382
2136.274603	2139.418141	383
2144.286395	2145.364626	384
2149.783900	2150.163719	385
2163.851927	2164.650794	386
2166.246485	2166.566440	387
2171.075510	2171.465306	388
2187.298639	2193.495238	389
2194.761678	2195.790023	390
2198.742630	2201.487075	391
2203.591610	2205.168707	392
2209.917234	2210.775964	393
2217.330385	2217.939683	394
2220.782540	2221.920635	395
2227.666893	2229.832653	396
2238.502268	2239.929705	397
2247.591610	2249.587755	398
2250.604762	2251.214059	399
2257.369388	2257.709297	400
2263.714966	2264.833107	401
2267.296825	2268.285261	402
2269.571655	2269.911565	403
2271.367574	2271.976871	404
2309.770295	2310.539229	405
2311.316780	2312.933787	406
2313.651474	2313.961451	407
2315.068254	2315.936961	408
2320.146712	2321.494331	409
2322.261905	2329.725624	410
2330.592971	2331.331973	411
2336.379819	2336.689796	412
2338.904082	2340.950113	413
2342.226531	2346.567347	414
2350.298186	2350.767800	415
2353.391156	2353.780952	416
2354.927664	2359.378231	417
2361.821995	2362.630839	418
2363.777551	2364.436735	419
2372.707256	2373.506122	420
2376.199320	2376.968254	421
2381.686848	2383.593197	422
2388.471429	2389.210431	423
2389.928118	2392.702494	424
2393.450113	2394.727891	425
2399.276871	2399.836281	426
2401.731293	2402.041270	427
2403.427438	2403.737415	428
2405.961678	2406.990023	429
2414.003401	2415.440816	430
2442.199320	2444.125624	431
2445.022902	2446.400454	432
2448.764399	2451.239456	433
2452.805215	2453.893424	434
2456.486848	2460.707937	435
2463.091837	2464.828571	436
2467.701361	2468.809524	437
2471.323129	2471.882540	438
2472.969388	2474.775964	439
2475.493651	2478.337868	440
2479.474603	2481.859864	441
2484.463265	2485.092517	442
2486.498639	2487.237642	443
2488.104989	2488.524717	444
2489.332200	2490.490249	445
2493.522676	2495.768254	446
2500.476871	2503.360998	447
2507.451020	2508.040363	448
2509.496372	2511.721995	449
2512.858730	2514.884807	450
2522.327211	2523.146032	451
2524.522222	2525.690249	452
2526.607483	2526.917460	453
2535.337642	2536.096599	454
2540.346259	2541.195011	455
2541.922676	2543.689342	456
2548.178458	2549.705669	457
2553.207029	2555.183220	458
2556.689116	2559.343764	459
2560.241043	2561.299320	460
2568.661905	2571.156916	461
2575.187075	2575.497052	462
2588.067800	2590.602721	463
2592.866893	2594.064853	464
2595.510884	2595.870748	465
2599.551701	2607.643991	466
2608.780726	2609.220408	467
2610.516780	2616.803175	468
2617.580726	2619.676644	469
2621.551701	2622.310658	470
2624.205669	2624.525624	471
2626.759864	2631.310204	472
2632.706349	2633.874376	473
2634.811565	2635.800000	474
2636.557596	2637.007256	475
2637.894558	2639.461678	476
2640.498639	2641.497052	477
2644.070522	2645.009070	478
2648.121315	2651.145125	479
2652.740816	2654.557370	480
2655.714059	2660.633560	481
2661.790249	2663.038095	482
2665.741270	2666.061224	483
2666.828798	2667.138776	484
2668.664626	2671.728345	485
2672.715420	2675.090703	486
2677.803855	2678.233560	487
2683.460998	2684.080272	488
2690.065986	2694.476644	489
2695.693197	2697.429932	490
2698.327211	2698.806803	491
2700.412472	2701.450794	492
2704.024263	2706.190023	493
2708.274603	2708.614512	494
2709.691383	2710.849433	495
2713.363039	2713.692971	496
2718.451474	2720.647166	497
2721.793878	2722.363265	498
2723.879138	2726.104762	499
2727.191610	2729.716553	500
2731.122676	2731.741950	501
2739.024717	2740.681633	502
2742.646485	2742.966440	503
2744.602041	2748.803175	504
2756.435147	2757.583220	505
2758.650113	2761.873469	506
2769.365760	2770.892971	507
2773.207029	2781.179592	508
2782.026984	2782.775964	509
2787.055556	2787.545125	510
2788.841497	2790.498413	511
2800.704535	2801.992290	512
2803.468254	2805.574150	513
2806.990249	2807.300227	514
2808.915873	2809.664853	515
2813.794785	2824.062132	516
2828.870522	2830.856689	517
2831.604308	2832.423129	518
2836.822449	2838.110204	519
2840.484127	2841.931519	520
2845.702268	2846.560998	521
2849.184354	2849.544218	522
2850.521315	2852.527438	523
2854.212925	2855.161451	524
2856.168481	2859.850794	525
2861.396599	2862.035828	526
2870.805215	2871.953288	527
2872.790703	2875.575057	528
2877.490023	2878.528345	529
2879.465533	2883.068027	530
2884.384354	2885.891610	531
2887.028345	2887.687528	532
2892.665533	2893.414512	533
2894.341723	2896.547392	534
2906.693651	2910.176417	535
2920.861451	2921.440816	536
2924.034240	2925.172336	537
2925.969841	2926.768707	538
2927.685941	2929.452608	539
2930.778912	2933.393651	540
2934.739909	2935.738322	541
2937.373923	2939.779138	542
2940.596599	2940.926531	543
2943.130839	2943.969615	544
2945.265986	2952.550113	545
2953.337642	2956.840363	546
2957.617914	2958.905669	547
2960.231973	2961.180499	548
2966.637415	2966.997279	549
2968.014286	2970.629025	550
2975.517234	2977.992290	551
2979.528118	2979.838095	552
2981.633333	2982.601814	553
2990.483220	2992.748753	554
2995.990703	3002.326984	555
3003.533560	3006.238095	556
3007.554422	3010.767800	557
3011.714966	3012.563719	558
3016.104989	3016.794104	559
3020.804308	3021.144218	560
3023.049206	3023.359184	561
3024.565760	3025.165079	562
3031.240590	3031.680272	563
3036.778005	3037.447166	564
3039.132653	3040.260771	565
3041.297732	3043.373696	566
3045.268707	3046.616327	567
3048.670975	3058.369615	568
3063.916327	3066.131973	569
3071.758503	3072.567347	570
3074.472336	3074.832200	571
3077.056463	3080.728798	572
3081.606122	3083.961451	573
3086.036054	3086.405896	574
3092.052381	3092.362358	575
3093.738549	3094.367800	576
3098.248299	3102.030385	577
3105.431973	3106.659864	578
3116.676417	3117.994104	579
3129.676871	3131.503401	580
3136.780726	3138.637188	581
3141.579819	3149.861678	582
3151.038322	3151.428118	583
3155.607937	3156.506576	584
3160.307256	3160.796825	585
3161.933560	3164.179138	586
3165.046485	3165.795465	587
3166.772562	3167.790930	588
3171.990703	3172.310658	589
3175.911791	3176.501134	590
3178.026984	3180.891156	591
3181.638776	3184.403175	592
3187.714966	3190.170068	593
3194.200227	3197.164172	594
3200.725397	3201.055329	595
3207.639683	3210.244444	596
3226.407029	3226.936508	597
3234.079592	3234.509297	598
3239.597052	3244.706122	599
3245.503628	3246.801361	600
3247.908163	3250.662585	601
3253.246032	3253.565986	602
3255.421088	3257.407256	603
3261.796599	3267.454422	604
3270.556689	3271.016327	605
3272.083220	3279.237642	606
3280.723583	3281.183220	607
3282.140363	3283.019048	608
3285.003855	3285.673016	609
3286.620181	3293.614966	610
3297.146259	3297.456236	611
3298.463265	3298.773243	612
3302.524036	3304.979138	613
3305.926304	3308.820408	614
3309.578005	3310.067574	615
3319.465533	3323.766440	616
3327.577098	3329.253968	617
3331.887302	3335.390023	618
3338.372562	3338.951927	619
3339.988889	3342.434014	620
3345.187075	3347.532426	621
3351.472789	3352.680726	622
3354.266440	3357.848980	623
3360.182993	3360.622676	624
3361.470068	3362.378685	625
3367.396599	3367.746485	626
3368.823356	3371.607710	627
3372.485034	3373.573243	628
3376.256463	3381.355556	629
3382.881406	3383.839909	630
3386.453288	3387.371882	631
3392.369841	3393.048980	632
3394.524943	3396.730612	633
3399.274150	3400.013152	634
3402.995692	3404.133787	635
3416.385261	3417.154195	636
3417.861905	3420.496599	637
3430.632880	3435.063492	638
3436.998413	3438.964626	639
3443.363946	3445.150567	640
3446.107710	3446.726984	641
3451.246032	3451.595918	642
3455.646032	3456.095692	643
3456.953061	3460.066667	644
3461.253288	3461.563265	645
3473.305896	3476.489342	646
3479.172562	3479.482540	647
3482.125850	3482.695238	648
3495.295918	3495.825397	649
3502.479592	3503.158730	650
3508.396145	3508.965533	651
3509.902721	3512.048526	652
3516.876871	3517.625850	653
3525.357596	3525.747392	654
3526.614739	3527.154195	655
3531.124490	3533.809070	656
3535.145351	3536.333333	657
3537.829252	3539.476190	658
3540.363492	3543.816327	659
3544.973016	3545.292971	660
3547.118141	3552.506576	661
3553.314059	3556.397732	662
3557.714059	3559.071655	663
3560.427891	3563.002721	664
3564.498639	3565.975964	665
3567.222449	3567.751927	666
3569.128118	3578.407710	667
3581.869161	3583.067120	668
3586.917687	3588.943764	669
3589.920862	3590.889342	670
3599.419274	3600.487528	671
3602.252834	3602.562812	672
3613.926304	3618.227211	673
3619.593424	3619.933333	674
3622.436961	3626.678005	675
3632.045125	3633.063492	676
3635.796599	3636.725170	677
3638.620181	3638.930159	678
3641.473696	3642.312472	679
3644.905896	3645.415420	680
3646.771655	3647.111565	681
3649.774830	3652.728798	682
3653.556236	3654.255329	683
3654.973016	3655.352834	684
3656.290023	3657.378231	685
3659.572562	3662.676190	686
3664.601134	3665.370068	687
3666.197506	3666.786848	688
3669.679592	3671.356463	689
3679.507256	3681.293878	690
3685.054649	3686.591837	691
3687.598866	3688.956463	692
3690.392517	3693.815420	693
3695.251474	3696.788662	694
3698.833333	3699.243084	695
3701.108163	3703.792744	696
3707.403855	3709.479819	697
3711.155329	3713.400907	698
3716.303628	3716.623583	699
3718.049660	3718.529252	700
3725.532653	3727.878005	701
3728.665533	3729.554195	702
3731.588889	3731.988662	703
3734.871429	3736.328798	704
3738.373469	3739.102494	705
3739.870068	3740.180045	706
3745.347619	3746.555556	707
3758.906803	3759.256689	708
3759.994331	3760.334240	709
3761.141723	3762.319728	710
3763.845578	3764.923810	711
3774.321769	3774.881179	712
3775.748526	3776.058503	713
3777.853741	3779.640363	714
3780.397959	3781.845351	715
3787.012925	3788.220862	716
3791.502721	3792.421315	717
3794.136735	3796.192744	718
3802.926757	3803.236735	719
3806.059637	3806.369615	720
3808.583900	3811.597732	721
3813.772109	3814.411338	722
3816.535828	3817.813605	723
3821.973469	3823.151474	724
3830.583900	3830.893878	725
3840.092290	3840.412245	726
3854.928571	3855.238549	727
3860.735374	3862.781406	728
3865.255102	3867.909751	729
3869.285941	3871.032653	730
3875.711338	3886.487528	731
3887.554422	3887.914286	732
3892.084127	3895.956009	733
3898.479592	3899.737415	734
3901.193424	3901.852608	735
3905.314059	3907.589569	736
3908.736281	3910.034014	737
3911.330385	3912.239002	738
3917.336735	3918.275283	739
3919.561678	3922.525624	740
3924.350794	3925.349206	741
3929.658730	3930.996372	742
3932.432426	3936.962812	743
3938.408844	3939.097959	744
3942.629252	3943.517914	745
3947.158957	3947.858050	746
3950.481406	3952.048526	747
3966.215646	3966.884807	748
3973.139909	3974.517460	749
3980.343537	3982.180045	750
0.069615	0.449433	1
4.798866	5.687528	2
6.894104	7.712925	3
19.156236	19.546032	4
21.790249	23.965986	5
29.063719	29.702948	6
32.545805	32.865760	7
33.892744	34.202721	8
36.147619	36.497506	9
39.619728	42.064853	10
44.778005	45.307483	11
51.642404	52.680726	12
55.473696	61.430839	13
65.431066	65.741043	14
66.927664	70.160998	15
73.772109	74.321542	16
78.850567	81.405442	17
84.946712	87.212245	18
88.718141	89.776417	19
90.703628	91.043537	20
95.782086	96.311565	21
104.113152	104.423129	22
105.420181	105.909751	23
107.914512	111.437188	24
112.653741	115.378231	25
116.085941	118.451247	26
122.601134	123.619501	27
125.843764	126.722449	28
128.946712	129.356463	29
134.454195	137.348299	30
141.657823	142.277098	31
143.254195	144.472109	32
145.219728	150.029478	33
151.256009	154.040363	34
154.917687	159.637642	35
160.425170	161.623129	36
164.825170	165.135147	37
168.836054	169.864399	38
177.526304	177.965986	39
179.012925	179.452608	40
181.477324	181.837188	41
186.286395	186.985488	42
192.661905	194.867574	43
195.605215	195.995011	44
199.516327	201.163265	45
206.101361	208.187302	46
210.301814	210.611791	47
212.466893	212.776871	48
213.993424	214.742404	49
216.188435	221.686621	50
222.593878	224.629932	51
227.043764	231.793651	52
244.833333	251.399093	53
254.411565	258.642630	54
259.450113	260.458503	55
266.374376	268.170975	56
272.729932	273.478912	57
284.283673	302.852154	58
303.579819	307.651247	59
310.334467	318.616327	60
321.738549	323.185941	61
325.011111	330.219955	62
331.057370	344.527438	63
345.394785	348.179138	64
354.304535	354.614512	65
355.611565	356.390476	66
359.213379	361.778231	67
363.613379	365.360091	68
372.812472	375.556916	69
389.015646	390.951927	70
396.897732	398.315193	71
400.180272	401.019048	72
402.325397	403.194104	73
404.640136	405.339229	74
407.064626	408.970975	75
409.788435	411.854422	76
415.814739	416.414059	77
417.251474	418.718821	78
428.017007	437.256689	79
438.074150	440.249887	80
441.995238	442.834014	81
449.478231	450.536508	82
460.892290	461.222222	83
465.082766	465.602268	84
474.351701	474.671655	85
476.955782	477.335601	86
478.432426	480.767800	87
482.922222	483.671202	88
488.609297	489.278458	89
491.512698	491.892517	90
503.265986	506.409524	91
513.851927	514.650794	92
523.001134	530.484807	93
532.798866	533.817234	94
538.406122	546.348753	95
549.850113	559.828118	96
561.902721	562.721542	97
565.055556	565.724717	98
566.741723	568.049433	99
570.553061	575.422676	100
577.098186	577.887075	101
585.279592	588.792290	102
589.539909	599.408163	103
600.275510	603.209524	104
604.974830	605.963265	105
607.139909	611.061678	106
611.879138	615.122449	107
615.969841	620.071202	108
621.387528	625.299320	109
626.186621	627.943311	110
629.169841	629.719274	111
634.447846	634.877551	112
635.814739	637.182313	113
638.269161	643.617687	114
645.762132	648.366893	115
649.304082	651.699320	116
652.586621	654.782313	117
656.008844	658.274376	118
659.411111	660.209977	119
661.665986	662.414966	120
663.631519	664.699773	121
666.325397	666.874830	122
668.151247	671.254875	123
672.720862	673.599546	124
683.037415	684.724263	125
687.866440	688.745125	126
692.465986	694.182766	127
696.197506	705.327438	128
710.105896	710.705215	129
711.432880	714.476644	130
715.264172	716.292517	131
718.407029	720.453061	132
722.368027	722.807710	133
726.398866	731.697506	134
732.604762	734.491156	135
740.287302	741.435374	136
743.939002	744.628118	137
745.974376	748.229932	138
751.092744	753.118821	139
761.638776	764.642630	140
765.529932	765.839909	141
766.707256	767.506122	142
776.534921	776.844898	143
777.622449	779.029932	144
779.937188	789.446259	145
790.513152	799.283900	146
800.480499	803.504308	147
804.291837	804.891156	148
812.203855	815.726531	149
818.130385	820.445805	150
822.530385	827.190476	151
827.978005	828.946485	152
829.724036	831.021769	153
834.273696	834.892971	154
835.780272	836.918367	155
838.623810	839.003628	156
854.467800	855.007256	157
858.368934	861.821769	158
863.676871	865.643084	159
866.400680	869.504308	160
870.421542	871.360091	161
872.686395	876.428571	162
877.774830	881.078005	163
881.895465	884.041270	164
884.938549	887.014512	165
890.196599	892.990930	166
897.051020	898.039456	167
905.332200	906.729705	168
907.517234	908.186395	169
909.083673	909.393651	170
910.410658	912.326984	171
914.990249	916.647166	172
932.430612	932.950113	173
936.491383	939.046259	174
939.903628	941.999546	175
943.904535	944.473923	176
950.369841	951.128798	177
954.340816	957.294785	178
958.800680	961.395465	179
966.692744	968.249887	180
970.254649	971.432653	181
973.756689	975.712925	182
981.209751	981.569615	183
991.326757	992.185488	184
1012.219274	1013.826304	185
1019.113605	1019.423583	186
1022.875057	1023.214966	187
1027.175283	1027.555102	188
1032.084127	1032.394104	189
1043.937188	1045.065306	190
1045.872789	1046.651701	191
1056.418821	1062.026757	192
1062.854195	1065.369161	193
1067.663265	1068.581859	194
1071.484580	1072.822222	195
1075.385714	1077.381859	196
1080.803401	1082.719728	197
1083.696825	1085.283900	198
1087.448299	1087.868027	199
1092.207483	1093.285714	200
1103.701361	1104.400454	201
1105.118141	1106.066667	202
1107.323129	1108.201814	203
1109.308617	1113.819048	204
1119.814739	1120.354195	205
1122.967574	1125.183220	206
1158.157596	1162.777778	207
1164.074150	1167.227664	208
1169.551701	1170.041270	209
1172.644671	1173.982313	210
1175.268707	1176.017687	211
1176.795238	1182.562812	212
1183.410204	1187.132426	213
1188.368934	1188.718821	214
1192.200227	1197.369161	215
1202.686395	1209.511565	216
1210.239229	1211.277551	217
1222.491383	1223.170522	218
1224.426984	1226.253515	219
1227.360317	1234.474830	220
1237.547166	1239.273923	221
1240.749887	1242.376871	222
1253.690476	1254.200000	223
1257.192517	1258.041270	224
1261.043764	1261.543311	225
1264.875057	1265.344671	226
1266.700907	1267.250340	227
1268.985714	1270.802268	228
1282.125850	1283.483447	229
1286.276417	1286.905669	230
1290.117687	1290.427664	231
1291.255102	1295.556009	232
1298.109524	1301.791837	233
1303.108163	1307.778231	234
1309.074603	1310.951020	235
1311.968027	1314.612698	236
1316.707256	1319.022676	237
1322.623810	1326.336054	238
1327.183447	1333.160544	239
1336.053288	1337.440816	240
1338.208390	1338.857596	241
1342.728118	1343.536961	242
1344.334467	1346.789569	243
1348.365306	1352.536508	244
1353.653288	1355.928798	245
1357.185261	1361.945125	246
1363.949887	1366.843991	247
1369.108163	1373.608617	248
1374.485941	1382.807710	249
1385.012018	1388.953741	250
1390.788889	1391.936961	251
1392.963946	1393.952381	252
1399.788435	1400.497506	253
1402.013379	1405.047166	254
1406.573016	1407.122449	255
1410.015193	1411.692063	256
1413.836508	1414.864853	257
1417.268707	1417.578685	258
1419.144444	1419.783673	259
1421.040136	1421.350113	260
1430.069615	1435.058957	261
1436.225624	1438.331519	262
1439.298639	1441.983220	263
1443.519048	1447.859864	264
1453.207029	1456.649887	265
1457.357596	1458.485714	266
1459.981633	1460.680726	267
1464.690930	1465.370068	268
1477.092744	1477.981406	269
1509.888209	1510.587302	270
1512.402494	1513.730159	271
1515.635147	1516.563719	272
1518.269161	1522.899320	273
1523.906349	1536.598186	274
1537.465533	1538.703401	275
1541.246939	1542.165533	276
1542.913152	1549.458957	277
1550.426077	1553.469841	278
1555.075510	1559.057143	279
1559.854649	1560.873016	280
1562.648299	1564.863946	281
1570.859637	1571.389116	282
1573.044671	1576.627211	283
1577.893651	1585.806349	284
1586.833333	1594.716100	285
1595.473696	1600.393197	286
1603.315873	1605.950567	287
1606.718141	1614.231746	288
1616.166667	1616.955556	289
1618.591156	1621.545125	290
1623.839229	1626.004989	291
1629.606122	1632.580045	292
1644.442404	1646.179138	293
1647.176190	1649.321995	294
1652.164853	1652.614512	295
1660.446032	1661.035374	296
1664.965760	1665.714739	297
1666.911338	1667.680272	298
1677.367574	1678.106576	299
1719.112698	1719.692063	300
1731.374830	1734.588209	301
1741.581633	1742.590023	302
1745.792063	1747.179592	303
1750.002494	1753.165986	304
1762.743537	1768.720635	305
1771.234240	1775.525170	306
1778.228345	1788.495692	307
1789.263265	1789.573243	308
1802.992063	1803.501587	309
1805.256916	1808.510204	310
1810.195692	1811.792744	311
1812.999320	1813.688435	312
1814.645578	1815.793651	313
1819.105442	1820.582766	314
1821.340363	1822.049433	315
1830.270068	1830.619955	316
1846.692744	1847.611338	317
1861.299546	1866.797732	318
1869.131746	1873.083447	319
1876.644671	1877.204082	320
1882.700907	1885.445351	321
1886.711791	1889.356463	322
1895.781179	1898.365986	323
1902.246485	1903.175057	324
1906.057823	1906.567347	325
1916.923129	1917.602268	326
1921.532653	1924.985488	327
1928.317234	1928.886621	328
1930.392517	1932.638095	329
1952.023356	1952.921995	330
1955.854649	1960.434921	331
1963.587075	1971.260317	332
1972.267347	1973.834467	333
1976.577551	1979.062585	334
1982.055102	1984.061224	335
1985.527211	1990.556463	336
1991.294104	1993.599546	337
1994.955782	1997.001814	338
2003.047392	2004.554649	339
2008.056009	2008.884807	340
2011.957143	2012.506576	341
2014.790703	2016.248073	342
2017.145351	2020.039456	343
2021.016553	2023.820862	344
2024.807937	2025.457143	345
2035.773016	2036.152834	346
2039.245125	2040.283447	347
2053.582540	2055.000000	348
2060.596599	2061.345578	349
2071.551701	2073.867120	350
2075.093651	2079.185034	351
2087.106349	2092.145578	352
2093.711338	2098.610884	353
2099.568027	2106.642630	354
2107.749433	2108.059410	355
2109.126304	2110.902948	356
2123.563492	2124.951020	357
2125.728571	2126.148299	358
2127.943537	2129.929705	359
2132.932200	2134.928345	360
2135.646032	2138.310658	361
2139.068254	2139.378231	362
2142.520408	2143.917914	363
2147.060091	2147.539683	364
2153.655102	2154.114739	365
2155.720408	2156.170068	366
2157.705896	2158.534694	367
2160.699093	2162.166440	368
2166.266440	2167.723810	369
2168.660998	2174.159184	370
2175.206122	2181.382766	371
2182.150340	2186.221769	372
2188.256463	2195.111565	373
2198.692744	2200.319728	374
2201.476417	2202.115646	375
2203.681406	2204.190930	376
2204.928571	2205.857143	377
2207.173469	2237.305669	378
2242.333560	2245.736508	379
2248.479592	2250.615420	380
2251.572562	2252.002268	381
2253.298639	2254.406803	382
2257.738549	2258.108390	383
2261.859184	2262.498413	384
2264.473243	2266.329705	385
2309.500907	2312.963719	386
2319.578005	2322.472109	387
2324.137642	2325.744671	388
2326.472336	2344.182766	389
2345.090023	2351.565986	390
2353.421088	2358.460317	391
2359.347619	2360.146485	392
2363.448299	2380.769615	393
2381.477324	2382.795011	394
2384.061451	2384.371429	395
2388.102268	2389.220408	396
2392.661905	2393.919728	397
2396.173923	2396.553741	398
2406.789796	2407.199546	399
2408.056916	2438.757823	400
2442.029705	2445.023583	401
2450.829705	2455.489796	402
2461.864626	2467.003628	403
2468.369841	2469.208617	404
2473.418367	2473.728345	405
2474.795238	2475.135147	406
2476.261905	2476.571882	407
2477.718594	2483.526077	408
2484.443311	2486.060317	409
2487.296825	2488.195465	410
2494.121315	2494.800454	411
2501.504535	2502.453061	412
2522.207483	2524.083900	413
2524.791610	2526.538322	414
2527.515420	2532.085714	415
2551.291383	2553.536961	416
2554.444218	2556.290703	417
2557.018367	2560.790476	418
2561.627891	2568.692517	419
2569.759410	2570.278912	420
2571.226077	2573.501587	421
2580.953968	2581.333787	422
2586.890476	2587.250340	423
2589.534467	2590.133787	424
2600.000680	2606.925624	425
2608.321769	2609.988662	426
2613.619728	2614.438549	427
2615.475510	2620.175510	428
2623.577098	2624.854875	429
2629.343991	2630.432200	430
2633.394785	2636.328798	431
2638.223810	2639.391837	432
2641.995238	2643.781859	433
2644.579365	2646.715193	434
2647.891837	2648.580952	435
2651.463719	2652.252608	436
2655.334921	2656.163719	437
2657.080952	2659.785488	438
2662.458730	2668.495692	439
2670.051474	2673.214966	440
2674.760771	2676.936508	441
2678.691837	2680.967347	442
2682.413379	2686.175510	443
2688.300000	2690.435828	444
2693.238776	2696.023129	445
2698.586621	2703.885261	446
2704.812472	2706.289796	447
2707.286848	2708.654422	448
2709.950794	2714.850340	449
2719.030159	2721.974150	450
2723.390249	2734.665306	451
2735.522676	2740.192744	452
2742.436961	2748.533787	453
2755.028345	2758.211791	454
2762.930385	2764.377778	455
2766.592063	2767.181406	456
2768.188435	2772.738776	457
2774.344444	2776.889342	458
2777.916327	2782.566440	459
2784.591156	2785.719274	460
2786.905896	2787.714739	461
2788.991156	2795.147846	462
2796.853288	2798.300680	463
2799.297732	2801.224036	464
2802.231066	2803.568707	465
2804.875057	2805.953288	466
2809.414739	2809.924263	467
2813.585261	2815.232200	468
2817.207029	2817.995918	469
2818.783447	2827.284807	470
2828.221995	2829.419955	471
2833.430159	2835.336508	472
2841.880952	2842.679819	473
2843.547166	2851.220408	474
2853.195238	2856.588209	475
2858.084127	2859.192290	476
2861.217007	2861.626757	477
2864.709070	2865.088889	478
2865.846485	2866.605442	479
2867.752154	2868.830385	480
2870.036961	2871.165079	481
2871.922676	2877.650340	482
2880.443311	2880.902948	483
2883.256916	2889.373696	484
2895.648753	2896.577324	485
2901.096372	2904.439456	486
2905.336735	2917.699320	487
2918.696372	2926.589116	488
2929.441950	2930.101134	489
2931.756689	2937.863492	490
2938.700907	2939.180499	491
2940.616553	2941.225850	492
2942.502268	2948.938322	493
2954.604762	2956.151927	494
2957.268707	2959.224943	495
2959.932653	2961.499773	496
2968.293651	2972.444898	497
2977.662358	2980.297052	498
2994.943084	2996.081179	499
2998.135828	2999.563265	500
3000.929478	3007.395465	501
3011.435601	3016.165533	502
3017.382086	3019.507937	503
3023.228798	3024.845805	504
3031.140816	3031.660317	505
3034.752608	3035.940590	506
3037.715873	3038.644444	507
3040.878685	3042.056689	508
3043.851927	3047.683900	509
3049.289569	3051.066213	510
3052.362585	3058.758730	511
3061.162585	3063.338322	512
3076.437868	3077.546032	513
3079.470975	3080.140136	514
3083.322222	3084.141043	515
3084.958503	3091.783673	516
3092.750794	3093.060771	517
3096.292744	3098.548299	518
3103.097279	3103.776417	519
3106.230159	3106.749660	520
3109.911791	3112.865760	521
3115.000227	3116.028571	522
3125.356689	3126.774150	523
3128.329932	3128.669841	524
3129.886395	3131.732880	525
3133.518141	3133.828118	526
3139.883673	3142.658050	527
3144.203855	3148.973696	528
3151.816553	3153.453515	529
3156.276417	3159.080726	530
3160.197506	3160.726984	531
3161.903628	3163.380952	532
3164.577551	3165.346485	533
3166.592971	3166.972789	534
3168.558503	3169.796372	535
3172.758957	3173.068934	536
3178.815193	3179.594104	537
3192.224717	3193.542404	538
3200.605669	3201.434467	539
3210.602948	3212.060317	540
3213.865533	3215.492517	541
3224.591156	3225.729252	542
3232.912245	3233.441723	543
3244.136735	3245.145125	544
3247.738549	3252.727891	545
3287.657823	3287.967800	546
3288.755329	3290.112925	547
3293.913605	3294.981859	548
3297.645125	3298.972789	549
3300.558503	3303.652154	550
3305.976190	3306.984580	551
3309.358503	3311.793651	552
3317.619728	3319.795465	553
3321.091837	3323.596825	554
3327.337642	3328.685261	555
3329.472789	3331.359184	556
3335.678685	3341.396372	557
3344.518594	3345.277551	558
3346.504082	3347.043537	559
3355.244218	3357.609524	560
3358.895918	3364.144671	561
3369.581633	3369.891610	562
3373.821995	3374.231746	563
3376.226531	3376.656236	564
3379.439229	3379.918821	565
3381.334921	3381.694785	566
3383.749433	3384.628118	567
3386.822449	3387.132426	568
3392.030612	3392.530159	569
3393.257823	3393.637642	570
3396.021542	3396.331519	571
3398.904989	3400.332426	572
3401.997959	3403.175964	573
3404.113152	3406.588209	574
3407.625170	3409.621315	575
3410.348980	3411.277551	576
3413.651474	3414.400454	577
3419.438322	3419.808163	578
3421.044671	3423.539683	579
3433.097279	3434.035828	580
3441.218821	3442.606349	581
3457.441950	3457.971429	582
3481.068254	3482.785034	583
3484.590249	3485.478912	584
3495.395692	3495.925170	585
3496.712698	3497.631293	586
3500.873243	3501.253061	587
3502.270068	3505.343764	588
3506.081406	3508.097506	589
3509.453741	3510.402268	590
3511.249660	3511.779138	591
3514.073243	3515.450794	592
3516.198413	3517.506122	593
3521.077324	3522.554649	594
3523.960771	3526.565533	595
3527.422902	3527.842630	596
3529.448299	3531.993197	597
3534.267347	3539.595918	598
3540.363492	3544.255329	599
3546.489569	3547.468027	600
3553.832880	3555.190476	601
3559.480045	3561.027211	602
3572.101361	3576.412245	603
3577.229705	3577.958730	604
3582.028798	3582.847619	605
3583.814739	3585.341950	606
3588.324490	3590.270748	607
3591.437415	3592.126531	608
3598.391610	3602.363265	609
3613.487302	3618.157370	610
3622.945805	3624.552834	611
3625.829252	3626.997279	612
3627.884580	3632.774150	613
3640.655556	3650.972789	614
3651.840136	3652.728798	615
3657.597052	3659.004535	616
3661.368481	3673.601361	617
3679.686848	3681.653061	618
3683.617914	3686.561905	619
3687.309524	3690.762358	620
3693.695011	3694.653515	621
3697.656009	3700.190930	622
3705.278685	3707.624036	623
3713.978912	3714.488435	624
3722.669161	3723.048980	625
3725.562585	3733.764626	626
3735.170748	3737.276644	627
3738.353515	3739.092517	628
3739.939909	3740.768707	629
3743.870975	3744.949206	630
3751.214286	3754.826757	631
3763.665986	3764.285261	632
3765.202494	3765.901587	633
3767.118141	3767.787302	634
3777.344898	3777.784580	635
3784.229252	3787.911565	636
3789.537188	3790.126531	637
3792.739909	3797.210431	638
3802.936735	3805.312018	639
3807.077324	3807.407256	640
3813.103628	3813.982313	641
3815.059184	3816.516553	642
3817.842857	3821.515193	643
3822.741723	3823.919728	644
3828.758050	3835.303855	645
3836.410658	3837.748299	646
3838.934921	3840.921088	647
3841.918141	3842.577324	648
3844.372562	3847.206803	649
3853.132653	3854.160998	650
3876.579365	3877.078912	651
3879.482766	3879.792744	652
3890.707256	3891.346485	653
3893.371202	3893.850794	654
3895.356689	3897.332880	655
3898.469615	3901.533333	656
3912.437868	3913.266667	657
3919.202494	3919.712018	658
3920.868707	3921.547846	659
3924.510431	3926.576417	660
3928.042404	3928.621769	661
3933.579819	3934.318821	662
3936.802494	3937.351927	663
3947.188889	3947.498866	664
3965.547166	3968.570975	665
3970.256463	3970.566440	666
3978.467800	3978.797732	667
3979.595238	3982.439456	668
3986.220181	3986.609524	669
