problem, problem start, problem end, moi start, moi end, tts, correct, person initiating answer, person explaining
1A:, 0:12, 0:54, 0:45, 0:54, (42), Y, S17, No
2A:, 0:55, 2:28, 1:53, 2:02, (67), Y, S17, S18
3A:, 2:29, 3:41, 3:18, 3:33, (64), Y, S17, No
4A:, 3:42, 5:32, 4:04, 4:20, (38), N, S18, No
1B:, 6:56, 7:51, 7:31, 7:38, (42), Y, S18, No
2B:, 7:52, 9:16, 8:46, 9:08, (76), Y, S18, No
3B:, 9:17, 11:08, 10:36, 11:03, (106), Y, S18, No
4B:, 11:09, 14:17, 12:33, 12:57, (108), N, S18, S17
1C:, 15:16, 17:56,  16:24 , 17:05, (109), Y, S17, S16 
2C:, 17:57, 19:09,  18:37, 18:43, (46), Y, S17, S18
3C:, 19:10, 20:46,  20:02, 20:35, (85), Y, S18, No
4C:, 20:47, 23:42,  23:05, 23:36, (169), Y, S16, No
1D:, 24:18, 25:58, 25:28, 25:44, (86), Y, S16, No
2D:, 25:59, 26:48, 26:31, 26:42, (43), Y, S17, No
3D:, 26:49, 28:22, 27:35, 27:46, (57), Y, S17, S16
4D:, 28:23, 30:58, 29:58, 30:18, (115), Y, S17, S17, 
