9.727664	10.396825	1
26.748980	28.306122	2
36.127664	36.687075	3
41.665079	43.122449	4
44.748073	46.714286	5
50.036054	50.525624	6
54.934921	55.713832	7
57.179819	59.854422	8
100.491383	102.357823	9
106.407937	108.064853	10
110.718141	111.975964	11
116.534921	117.692971	12
141.348526	141.658503	13
147.135374	152.314286	14
153.650567	154.708844	15
158.030612	158.390476	16
159.108163	160.395918	17
175.580726	176.289796	18
204.415193	204.755102	19
207.597959	207.947846	20
241.081859	241.401814	21
248.026077	248.375964	22
299.928118	301.824490	23
305.934467	318.366893	24
319.244218	322.966440	25
324.641950	327.077098	26
337.602494	339.239456	27
341.104535	341.803628	28
343.100000	343.579592	29
344.566667	345.026304	30
383.198866	384.406803	31
389.424717	390.522902	32
395.411111	395.800907	33
397.466440	404.191837	34
407.254195	410.996372	35
412.651927	413.321088	36
421.152608	422.609977	37
424.854195	429.394558	38
431.389342	431.749206	39
434.502268	435.969615	40
438.143991	439.451701	41
442.573923	443.562358	42
445.996145	446.365986	43
449.977098	451.484354	44
505.490930	509.811791	45
511.008390	515.798186	46
517.094558	519.370068	47
523.480045	525.256689	48
530.095011	530.684354	49
531.841043	532.779592	50
533.966213	534.984580	51
538.795238	539.125170	52
541.858277	542.697052	53
544.771655	546.678005	54
547.675057	548.104762	55
549.271429	549.591383	56
550.598413	550.908390	57
557.522676	557.912472	58
559.518141	559.897959	59
563.239683	568.777778	60
570.153968	573.187755	61
615.281406	615.880726	62
618.534014	619.083447	63
621.806576	622.136508	64
627.633333	629.190476	65
630.985714	631.455329	66
635.804762	636.244444	67
640.334467	642.340590	68
646.231066	648.586395	69
649.952608	650.531973	70
652.656463	653.874376	71
655.021088	656.009524	72
659.770295	664.450340	73
666.345351	668.261678	74
671.244218	671.813605	75
673.828345	675.555102	76
679.864626	680.972789	77
682.289116	682.619048	78
687.736735	691.668481	79
692.525850	692.865760	80
695.987982	697.964172	81
701.904535	702.224490	82
718.037868	718.906576	83
724.293651	724.912925	84
725.999773	727.696599	85
729.521769	729.851701	86
732.824263	736.007710	87
746.582993	747.770975	88
748.708163	749.576871	89
754.993878	755.802721	90
757.458277	758.117460	91
761.688662	763.175964	92
766.657370	767.156916	93
783.987982	784.996372	94
786.801587	787.889796	95
804.651020	808.921995	96
810.088662	812.793197	97
815.217007	816.345125	98
818.938549	820.375964	99
823.438322	826.442177	100
830.043311	830.762358	101
833.525397	834.394104	102
835.111791	839.273016	103
860.025170	860.684354	104
865.203401	867.688435	105
868.725397	877.446259	106
884.529478	885.677551	107
918.931293	920.248980	108
921.046485	921.825397	109
926.484127	930.196372	110
939.763946	940.463039	111
943.385714	943.965079	112
945.580726	945.960544	113
953.851927	954.451247	114
964.198413	965.595918	115
972.878685	974.775057	116
976.739909	977.259410	117
978.216553	981.350113	118
982.307256	982.617234	119
983.454649	983.974150	120
988.622902	989.910658	121
991.336735	993.542404	122
1008.178458	1008.488435	123
1025.568934	1026.577324	124
1037.312245	1038.330612	125
1039.716780	1040.356009	126
1058.124943	1058.504762	127
1071.504535	1075.067120	128
1076.343537	1076.693424	129
1077.929932	1078.868481	130
1082.918594	1083.517914	131
1086.709977	1087.149660	132
1096.866893	1098.463946	133
1108.460544	1110.237188	134
1115.185261	1115.654875	135
1116.621995	1119.067120	136
1121.131746	1121.651247	137
1127.357596	1129.034467	138
1134.212018	1134.960998	139
1138.542177	1138.951927	140
1146.743537	1148.170975	141
1160.173016	1160.991837	142
1168.953061	1169.392744	143
1173.582540	1173.892517	144
1175.468254	1176.785941	145
1179.100000	1180.726984	146
1181.434694	1183.490703	147
1184.577551	1185.236735	148
1187.969841	1188.529252	149
1191.202494	1192.849433	150
1193.597052	1202.048526	151
1203.105442	1205.191383	152
1206.328118	1206.648073	153
1211.306803	1213.372789	154
1216.385261	1217.852608	155
1219.777551	1220.366893	156
1224.965760	1230.354195	157
1237.187982	1238.146485	158
1239.273243	1240.391383	159
1241.238776	1241.897959	160
1245.878231	1246.347846	161
1260.016100	1261.353741	162
1271.978912	1276.269841	163
1279.661451	1281.408163	164
1283.602494	1284.511111	165
1286.725397	1287.923356	166
1295.884580	1296.374150	167
1298.568481	1299.018141	168
1301.920862	1302.310658	169
1309.064626	1309.564172	170
1316.417914	1319.731066	171
1320.598413	1320.908390	172
1321.636054	1323.771882	173
1324.569388	1334.447619	174
1335.394785	1338.248980	175
1340.822449	1341.212245	176
1342.658277	1347.009070	177
1350.280952	1352.157370	178
1356.117687	1357.944218	179
1360.497732	1362.284354	180
1363.261451	1363.601361	181
1364.598413	1366.225397	182
1369.058277	1370.575510	183
1375.184354	1375.653968	184
1378.626531	1380.034014	185
1381.889116	1382.907483	186
1384.193878	1387.746485	187
1390.170295	1390.769615	188
1394.829705	1395.139683	189
1399.259637	1399.739229	190
1403.240590	1404.398639	191
1406.642857	1407.830839	192
1413.367574	1414.216327	193
1415.233333	1415.982313	194
1419.872789	1420.222676	195
1421.808390	1424.173696	196
1426.108617	1427.156916	197
1432.015193	1432.564626	198
1440.007029	1440.536508	199
1444.706349	1448.727891	200
1455.412018	1456.091156	201
1456.978458	1459.343764	202
1460.690023	1462.177324	203
1472.273696	1479.298413	204
1483.039229	1483.359184	205
1492.487755	1493.575964	206
1494.293651	1494.853061	207
1496.289116	1498.175510	208
1501.118141	1501.487982	209
1504.081406	1505.139683	210
1507.733107	1511.485261	211
1514.836961	1515.585941	212
1520.833333	1521.173243	213
1522.988435	1523.458050	214
1527.807483	1529.514286	215
1533.205215	1544.101134	216
1544.858730	1550.686168	217
1553.638776	1554.048526	218
1557.060998	1559.875283	219
1560.732653	1561.132426	220
1569.163492	1570.950113	221
1578.961224	1579.780045	222
1603.455556	1607.766440	223
1609.851020	1611.887075	224
1613.392971	1613.772789	225
1616.156689	1616.486621	226
1623.400227	1625.216780	227
1626.573016	1627.321995	228
1650.169388	1652.255329	229
1654.978458	1667.859864	230
1668.697279	1670.892971	231
1673.276871	1674.534694	232
1675.811111	1677.368254	233
1681.148980	1681.598639	234
1684.002494	1685.290249	235
1686.167574	1688.433107	236
1696.484127	1696.883900	237
1698.479592	1698.939229	238
1722.355329	1723.024490	239
1754.202948	1754.622676	240
1759.600680	1762.345125	241
1764.828798	1765.318367	242
1779.106349	1781.451701	243
1801.525397	1801.995011	244
1804.099546	1805.157823	245
1808.160317	1810.914739	246
1811.841950	1817.968707	247
1819.215193	1819.614966	248
1824.443311	1825.042630	249
1826.249206	1826.868481	250
1827.805669	1833.383673	251
1834.101361	1838.452154	252
1839.249660	1840.946485	253
1846.812472	1847.401814	254
1855.532653	1856.121995	255
1865.021088	1865.770068	256
1875.427438	1875.917007	257
1923.258730	1926.272562	258
1927.309524	1928.726984	259
1948.950340	1950.287982	260
1960.743537	1963.857143	261
1965.592517	1967.109751	262
1967.857370	1968.207256	263
1970.251927	1970.721542	264
1972.646485	1973.425397	265
1974.891383	1975.241270	266
1975.978912	1977.595918	267
1984.280045	1985.348299	268
1992.940363	1995.974150	269
2000.732653	2002.778685	270
2004.075057	2005.183220	271
2007.517234	2007.827211	272
2009.622449	2011.209524	273
2015.499093	2015.858957	274
2018.392517	2018.702494	275
2021.305896	2025.347392	276
2030.135828	2031.712925	277
2035.962585	2039.116100	278
2043.994331	2045.102494	279
2050.619274	2051.048980	280
2056.076871	2056.506576	281
2057.294104	2057.624036	282
2069.885488	2070.534694	283
2080.511338	2081.998639	284
2104.706349	2105.076190	285
2108.278231	2108.937415	286
2112.139456	2112.469388	287
2135.436508	2137.203175	288
2140.205669	2141.762812	289
2143.528118	2144.586395	290
2147.818367	2150.263492	291
2152.936735	2158.694331	292
2159.591610	2160.091156	293
2160.938549	2162.994558	294
2164.310884	2168.372336	295
2170.207483	2173.929705	296
2174.996599	2176.463946	297
2178.209297	2180.913832	298
2182.429705	2183.657596	299
2185.452834	2187.448980	300
2195.789342	2197.565986	301
2198.473243	2199.072562	302
2201.675964	2204.450340	303
2218.936735	2220.932880	304
2222.827891	2223.357370	305
2228.365306	2228.705215	306
2232.984807	2233.354649	307
2235.319501	2235.639456	308
2247.831066	2248.390476	309
2250.664626	2251.433560	310
2269.012925	2269.402721	311
2272.864172	2274.141950	312
2274.969388	2276.756009	313
2277.842857	2278.222676	314
2291.062812	2291.881633	315
2292.589342	2293.208617	316
2302.117687	2302.796825	317
2305.679592	2308.234467	318
2309.261451	2319.169615	319
2321.373923	2324.517460	320
2333.476417	2335.053515	321
2340.061451	2342.137415	322
2346.157596	2346.726984	323
2352.263719	2352.743311	324
2356.264626	2359.567800	325
2363.388435	2363.897959	326
2385.837415	2386.426757	327
2387.773016	2388.771429	328
2407.528118	2408.017687	329
2416.667347	2416.977324	330
2447.786621	2449.533333	331
2450.370748	2452.007710	332
2458.891383	2459.750113	333
2462.173923	2463.282086	334
2465.626077	2466.504762	335
2467.980726	2470.755102	336
2473.937188	2480.253515	337
2481.340363	2481.989569	338
2484.992063	2486.160091	339
2489.112698	2489.632200	340
2492.993878	2493.792744	341
2503.060998	2503.400907	342
2508.348980	2508.718821	343
2513.706803	2515.702948	344
2519.244218	2519.853515	345
2521.718594	2522.218141	346
2534.220181	2537.343764	347
2542.940363	2544.507483	348
2545.324943	2546.862132	349
2551.101814	2554.185488	350
2557.068254	2559.333787	351
2562.974830	2563.913379	352
2565.768481	2566.178231	353
2568.422449	2569.121542	354
2572.373469	2577.462585	355
2578.319955	2578.629932	356
2581.821995	2583.039909	357
2592.986621	2596.529252	358
2605.079138	2605.578685	359
2606.406122	2606.905669	360
2609.299546	2610.427664	361
2617.002041	2617.461678	362
2627.468254	2628.317007	363
2633.973469	2641.417234	364
2642.274603	2652.282540	365
2654.546712	2660.154649	366
2684.209297	2685.437188	367
2687.172562	2688.689796	368
2699.155329	2700.353288	369
2701.539909	2702.747846	370
2705.091837	2706.209977	371
2708.793424	2709.412698	372
2711.427438	2711.867120	373
2713.642404	2714.331519	374
2723.380272	2724.658050	375
2728.269161	2728.908390	376
2741.968027	2742.278005	377
2764.546712	2765.106122	378
2765.823810	2766.143764	379
2770.064172	2771.172336	380
2772.877778	2773.706576	381
2774.524036	2774.853968	382
2777.038322	2777.637642	383
2784.730839	2786.078458	384
2790.607483	2791.506122	385
2793.141723	2793.691156	386
2803.717687	2806.102948	387
2810.302721	2811.241270	388
2813.525397	2815.032653	389
2818.075057	2819.123356	390
2820.359864	2821.338322	391
2848.296372	2849.634014	392
2859.600680	2861.546939	393
2862.543991	2864.031293	394
2865.148073	2865.537868	395
2866.884127	2867.922449	396
2870.944898	2871.753741	397
2883.735828	2886.111111	398
2901.744898	2902.354195	399
2903.361224	2904.918367	400
2915.643311	2916.601814	401
2924.393424	2926.100227	402
2941.993424	2942.672562	403
2947.670522	2948.998186	404
2950.334467	2950.973696	405
2957.498186	2958.317007	406
2961.479138	2963.275737	407
2977.203401	2977.792744	408
2979.548073	2979.917914	409
2984.556689	2985.495238	410
2986.761678	2987.750113	411
2989.076417	2989.835374	412
2995.851020	2997.029025	413
3001.228798	3002.317007	414
3004.102268	3004.960998	415
3006.766213	3007.315646	416
3009.200680	3017.622222	417
3019.816553	3021.673016	418
3034.692744	3035.671202	419
3048.391610	3049.409977	420
3060.903175	3062.220862	421
3063.636961	3064.116553	422
3067.707710	3068.057596	423
3069.902721	3071.260317	424
3106.808844	3133.648526	425
3134.984807	3135.803628	426
3145.520862	3146.100227	427
3147.147166	3150.270748	428
3160.337188	3162.463039	429
3164.597506	3165.097052	430
3166.104082	3166.434014	431
3171.202494	3171.771882	432
3172.719048	3173.627664	433
3188.423356	3188.743311	434
3189.600680	3192.644444	435
3197.841950	3198.401361	436
3199.837415	3202.412245	437
8.979365	10.656236	1
12.870522	16.542857	2
23.197052	23.546939	3
24.583900	25.263039	4
28.175737	28.675283	5
32.914966	35.709297	6
43.780272	44.499320	7
45.336735	45.866213	8
49.776644	50.485714	9
55.064626	55.723810	10
56.760771	57.130612	11
59.205215	59.704762	12
66.807937	67.217687	13
79.938095	80.417687	14
87.012018	87.471655	15
101.399320	102.078458	16
104.063265	105.969615	17
107.315873	113.063492	18
114.479592	115.976871	19
126.053288	126.363265	20
138.834240	140.361451	21
144.521315	144.831293	22
151.824717	152.244444	23
156.773469	157.193197	24
160.973923	162.231746	25
163.178912	163.578685	26
175.919955	176.349660	27
220.438776	220.748753	28
235.544444	236.273469	29
247.567120	251.389116	30
256.456916	257.435374	31
262.263719	262.703401	32
300.117687	303.021769	33
314.874150	315.293878	34
324.232880	326.258957	35
327.645125	328.224490	36
329.091837	333.811791	37
336.844218	339.558730	38
340.625624	342.462132	39
343.289569	344.447619	40
345.504535	347.510658	41
383.089116	383.728345	42
388.666440	392.029478	43
393.954422	395.731066	44
398.184807	398.504762	45
403.462812	404.471202	46
405.867347	407.454422	47
408.910431	413.460771	48
418.817914	421.143311	49
431.040136	431.659410	50
432.746259	433.954195	51
438.812472	439.501587	52
445.866440	451.145125	53
453.628798	459.456236	54
460.333560	469.044444	55
474.531293	504.234467	56
505.830159	510.170975	57
511.148073	512.894785	58
516.286395	518.013152	59
519.030159	519.659410	60
520.417007	521.674830	61
522.542177	566.303401	62
567.320408	572.020408	63
573.606122	579.383673	64
584.491383	585.789116	65
605.393878	607.519728	66
613.246032	617.297506	67
620.080499	623.503401	68
627.463719	631.644898	69
633.749433	634.199093	70
635.625170	636.054875	71
637.031973	639.876190	72
643.527211	644.036735	73
646.879592	652.906576	74
655.420181	656.418594	75
665.607029	665.946939	76
675.524490	677.071655	77
677.849206	682.808617	78
686.479592	688.904762	79
693.902721	695.330159	80
696.047846	696.357823	81
697.384807	698.113832	82
699.210658	699.540590	83
704.768027	713.019955	84
721.519955	724.763265	85
729.771202	734.970068	86
739.309524	742.772336	87
747.520862	748.738776	88
754.953968	756.740590	89
762.756236	763.585034	90
765.011111	765.730159	91
767.734921	770.279819	92
774.329932	775.378231	93
781.892744	783.360091	94
787.440136	793.596825	95
827.439229	832.658050	96
833.874603	834.513832	97
835.969841	836.319728	98
839.860998	850.198186	99
856.173923	859.187755	100
861.601587	861.951474	101
864.185714	865.613152	102
867.787528	868.107483	103
870.192063	870.502041	104
874.691837	877.905215	105
879.860091	880.229932	106
881.556236	882.305215	107
884.389796	887.962358	108
890.406122	890.765986	109
894.377098	894.756916	110
896.761678	897.460771	111
898.916780	900.204535	112
903.246939	903.566893	113
907.786621	908.435828	114
909.223356	912.975510	115
920.976644	921.296599	116
928.120408	929.418141	117
930.973923	931.283900	118
932.500454	933.518821	119
935.782993	936.122902	120
939.404762	940.433107	121
941.400227	943.575964	122
945.151701	950.230839	123
955.508163	958.322449	124
962.751701	963.979592	125
965.026531	966.583673	126
977.378458	978.386848	127
980.960317	981.619501	128
985.031066	985.630385	129
988.313605	988.623583	130
991.167120	991.995918	131
993.392063	999.578685	132
1000.855102	1005.006349	133
1013.496372	1013.806349	134
1014.793424	1019.144218	135
1033.341270	1033.751020	136
1034.498639	1038.769615	137
1040.415193	1044.486621	138
1046.172109	1046.831293	139
1052.577551	1053.795465	140
1056.508617	1057.457143	141
1058.903175	1062.954649	142
1068.830612	1069.140590	143
1087.079138	1088.307029	144
1089.673243	1105.657596	145
1115.424717	1116.034014	146
1117.140816	1118.668027	147
1122.388889	1126.101134	148
1131.578005	1131.887982	149
1135.718594	1139.400907	150
1140.407937	1142.922902	151
1152.041497	1152.880272	152
1158.456916	1159.016327	153
1161.410204	1162.089342	154
1179.568934	1180.048526	155
1187.261451	1190.913832	156
1222.930385	1224.886621	157
1232.718141	1234.804082	158
1240.580272	1247.455329	159
1248.761678	1257.153288	160
1259.776644	1261.184127	161
1262.241043	1267.419955	162
1271.270522	1272.438549	163
1274.463265	1275.701134	164
1277.386621	1277.806349	165
1287.773016	1288.092971	166
1298.149433	1300.165533	167
1305.861905	1308.865760	168
1312.367120	1314.203628	169
1316.916780	1317.865306	170
1332.221995	1335.285714	171
1336.182993	1340.463946	172
1352.226531	1353.155102	173
1356.027891	1356.487528	174
1359.899093	1363.032653	175
1370.824263	1379.954195	176
1381.659637	1382.099320	177
1383.455556	1385.441723	178
1386.638322	1387.596825	179
1388.474150	1391.597732	180
1397.184354	1400.307937	181
1403.759410	1404.199093	182
1433.531746	1434.669841	183
1435.417460	1437.533333	184
1441.603401	1446.014059	185
1451.311338	1452.678912	186
1454.284580	1455.083447	187
1456.150340	1457.976871	188
1462.555782	1464.102948	189
1464.810658	1465.469841	190
1475.765760	1479.547846	191
1481.003855	1481.493424	192
1492.447846	1495.242177	193
1495.989796	1504.950113	194
1506.076871	1508.611791	195
1510.417007	1527.508844	196
1531.269615	1531.629478	197
1551.154422	1551.853515	198
1552.880499	1553.809070	199
1557.519955	1558.528345	200
1561.810204	1564.604535	201
1567.577098	1568.715193	202
1570.280952	1571.039909	203
1572.286395	1573.374603	204
1578.173016	1578.482993	205
1583.580726	1584.000454	206
1597.179819	1598.327891	207
1599.075510	1599.954195	208
1604.692744	1607.786395	209
1609.990703	1611.637642	210
1613.722222	1614.032200	211
1621.574376	1622.652608	212
1623.450113	1623.760091	213
1625.355782	1628.838549	214
1646.477778	1647.256689	215
1650.748073	1651.636735	216
1652.573923	1653.971429	217
1666.422449	1667.001814	218
1680.470522	1685.250340	219
1686.716327	1689.251247	220
1690.248299	1695.796372	221
1697.920862	1698.320635	222
1710.761678	1711.590476	223
1722.365306	1723.054422	224
1724.091383	1726.197279	225
1751.898186	1752.208163	226
1753.763946	1757.825397	227
1759.041950	1760.299773	228
1761.047392	1761.916100	229
1763.142630	1766.455782	230
1767.253288	1769.369161	231
1775.055556	1775.764626	232
1781.780272	1784.315193	233
1821.400227	1822.638095	234
1823.764853	1824.912925	235
1825.710431	1826.040363	236
1828.035147	1828.345125	237
1829.721315	1830.260771	238
1832.395238	1833.872562	239
1842.093197	1847.192290	240
1848.618367	1855.044444	241
1856.779819	1861.589569	242
1865.390249	1870.349660	243
1875.517234	1877.014512	244
1878.131293	1901.868027	245
1902.785261	1918.889342	246
1922.809751	1923.119728	247
1925.124490	1927.190476	248
1928.247392	1930.552834	249
1944.969388	1945.309297	250
1946.416100	1949.270295	251
1957.560771	1959.078005	252
1960.553968	1963.827211	253
1965.552608	1969.923356	254
1973.564399	1979.331973	255
1980.797959	1983.761905	256
1984.489569	1985.917007	257
1988.520408	1992.013152	258
1993.479138	1994.018594	259
1995.304989	1996.632653	260
1998.387982	1999.705669	261
2003.755782	2009.263946	262
2010.141270	2010.471202	263
2011.867347	2014.901134	264
2023.041950	2024.938322	265
2025.865533	2026.923810	266
2027.731293	2030.545578	267
2040.362585	2041.141497	268
2049.092744	2050.081179	269
2052.345351	2058.901134	270
2060.626531	2064.079365	271
2064.826984	2065.156916	272
2072.010658	2075.044444	273
2101.513605	2102.482086	274
2109.066440	2115.312925	275
2141.013832	2141.423583	276
2142.241043	2143.738322	277
2147.578912	2147.888889	278
2149.544444	2151.271202	279
2165.198866	2165.518821	280
2185.632426	2185.942404	281
2188.515873	2191.240363	282
2192.047846	2195.680272	283
2199.101814	2204.170975	284
2204.918594	2217.750113	285
2222.119501	2223.197732	286
2224.434240	2226.350567	287
2230.001587	2230.311565	288
2231.238776	2232.596372	289
2235.838322	2238.802268	290
2242.114059	2242.434014	291
2243.580726	2243.890703	292
2244.977551	2245.556916	293
2249.138095	2252.002268	294
2257.568934	2261.460771	295
2262.817007	2263.506122	296
2271.287755	2273.712925	297
2286.114059	2286.483900	298
2291.132653	2296.451247	299
2301.000227	2303.475283	300
2306.447846	2310.339683	301
2319.617914	2319.927891	302
2324.027891	2324.347846	303
2327.240590	2328.318821	304
2333.795692	2334.105669	305
2343.304082	2345.549660	306
2347.125397	2349.231293	307
2350.387982	2352.114739	308
2353.949887	2356.095692	309
2360.544898	2360.854875	310
2362.460544	2368.976417	311
2371.070975	2375.042630	312
2378.294558	2379.063492	313
2381.896372	2384.042177	314
2390.526757	2391.944218	315
2409.723129	2410.112925	316
2411.269615	2411.749206	317
2419.939909	2421.536961	318
2422.274603	2423.233107	319
2427.003855	2430.626304	320
2433.928118	2434.617234	321
2435.853741	2439.396372	322
2440.722676	2443.706576	323
2445.801134	2446.160998	324
2448.804308	2450.301587	325
2451.029252	2455.918821	326
2457.634240	2458.203628	327
2459.440136	2462.843084	328
2464.867800	2465.197732	329
2480.711791	2482.458503	330
2483.864626	2489.372789	331
2490.389796	2492.984580	332
2494.161224	2502.353288	333
2504.577551	2506.863039	334
2509.286848	2510.215420	335
2511.022902	2511.672109	336
2513.996145	2515.144218	337
2516.021542	2522.497506	338
2523.265079	2526.508390	339
2534.848753	2537.862585	340
2544.836054	2545.824490	341
2546.851474	2547.430839	342
2552.578458	2556.280726	343
2559.313152	2559.992290	344
2560.700000	2563.514286	345
2570.657370	2572.284354	346
2579.826531	2582.471202	347
2583.378458	2585.035374	348
2586.820635	2589.165986	349
2590.302721	2590.682540	350
2594.303628	2595.541497	351
2599.062812	2603.044444	352
2603.802041	2606.336961	353
2609.199773	2610.008617	354
2618.498639	2621.971429	355
2626.769841	2627.079819	356
2629.114512	2629.923356	357
2630.750794	2632.188209	358
2635.869161	2636.209070	359
2642.344444	2642.674376	360
2645.786621	2646.485714	361
2649.578005	2650.157370	362
2651.782993	2652.122902	363
2654.596599	2656.572789	364
2660.253741	2660.783220	365
2664.653741	2665.103401	366
2666.250113	2666.560091	367
2668.734467	2679.690249	368
2683.211565	2683.521542	369
2686.603855	2698.168254	370
2698.985714	2700.103855	371
2701.619728	2708.424943	372
2711.028345	2711.607710	373
2712.594785	2718.422222	374
2720.696372	2732.909297	375
2735.263265	2738.307029	376
2739.413832	2740.312472	377
2741.698639	2742.048526	378
2759.029252	2759.907937	379
2763.259637	2764.487528	380
2767.948980	2769.037188	381
2770.722676	2774.444898	382
2775.930839	2776.240816	383
2777.267800	2779.423583	384
2781.787528	2782.107483	385
2784.551247	2787.295692	386
2790.617460	2793.481633	387
2797.272336	2797.582313	388
2799.148073	2799.468027	389
2806.381633	2806.691610	390
2813.984354	2815.092517	391
2821.696825	2826.336961	392
2827.463719	2829.090703	393
2830.097732	2835.186848	394
2837.301361	2843.737415	395
2850.251927	2851.380045	396
2852.456916	2857.027211	397
2859.311338	2860.708844	398
2868.510431	2877.849887	399
2883.656009	2886.480272	400
2888.065986	2890.241723	401
2893.334014	2893.643991	402
2894.541270	2895.699320	403
2900.218367	2903.222222	404
2904.269161	2904.898413	405
2913.687755	2914.436735	406
2916.920408	2918.766893	407
2921.250567	2922.707937	408
2927.027438	2933.553288	409
2941.285034	2947.940590	410
2949.476417	2953.278458	411
2954.604762	2955.064399	412
2957.009297	2957.628571	413
2958.545805	2959.494331	414
2961.020181	2969.940590	415
2974.040590	2974.530159	416
2978.091383	2978.650794	417
2980.036961	2980.346939	418
2986.542177	2987.410884	419
3002.356236	3009.939683	420
3012.273696	3012.793197	421
3015.975283	3020.984580	422
3025.074603	3026.701587	423
3031.649660	3034.224490	424
3035.610658	3036.050340	425
3037.606122	3038.744218	426
3040.848753	3043.453515	427
3044.989342	3046.017687	428
3058.678231	3058.988209	429
3064.065986	3066.062132	430
3066.929478	3077.665760	431
3078.782540	3085.308390	432
3090.266440	3101.052608	433
3105.392063	3105.751927	434
3128.489569	3128.799546	435
3137.349433	3137.749206	436
3139.753968	3141.520635	437
3144.523129	3144.843084	438
3145.710431	3146.020408	439
3148.773469	3150.679819	440
3151.656916	3152.296145	441
3154.181179	3154.521088	442
3157.533560	3157.873469	443
3159.389342	3159.699320	444
3164.577551	3166.843084	445
3167.570748	3168.928345	446
3171.222449	3172.410431	447
3173.178005	3173.877098	448
3175.692290	3176.002268	449
3179.872789	3186.258957	450
3187.824717	3190.629025	451
3194.270068	3195.657596	452
3197.253288	3197.563265	453
3202.800680	3203.609070	454
0.029705	1.766440	1
3.192517	4.340590	2
5.078231	6.874830	3
8.729932	9.099773	4
11.194331	11.763719	5
16.841497	17.819955	6
18.836961	19.945125	7
20.842404	24.863946	8
28.415193	30.171882	9
32.196599	36.078458	10
38.123129	40.917460	11
43.361224	43.810884	12
47.222449	50.575510	13
51.313152	54.616327	14
56.142177	60.892063	15
62.946712	63.755556	16
64.972109	65.571429	17
86.143991	86.932880	18
95.143537	95.453515	19
102.377098	105.390930	20
106.098639	114.560091	21
115.387528	116.346032	22
117.333107	117.942404	23
144.002494	144.502041	24
145.968027	146.287982	25
149.669615	150.448526	26
151.166213	152.074830	27
175.570748	176.060317	28
196.373469	196.683447	29
224.150340	224.510204	30
234.536735	238.847619	31
239.844671	240.214512	32
247.726757	248.685261	33
260.826984	262.194558	34
267.980726	268.340590	35
274.565760	276.033107	36
277.608844	279.585034	37
280.981179	281.660317	38
285.321315	286.549206	39
290.200227	290.679819	40
300.407029	301.585034	41
326.617460	328.154649	42
337.373016	339.339229	43
340.126757	341.703855	44
344.506803	344.946485	45
359.552608	359.862585	46
361.627891	362.376871	47
379.467347	379.917007	48
380.874150	383.209524	49
384.106803	384.875737	50
385.753061	386.472109	51
388.895918	390.343311	52
395.002041	395.331973	53
396.728118	397.287528	54
403.183447	405.868027	55
406.835147	408.801361	56
412.572109	417.930612	57
421.162585	423.727438	58
424.794331	427.259410	59
434.133107	434.832200	60
435.779365	437.865306	61
440.049660	442.454875	62
444.150340	445.747392	63
448.410658	449.478912	64
452.132200	454.697052	65
455.424717	455.794558	66
465.232426	465.881633	67
505.281406	516.756009	68
520.666440	521.175964	69
523.210658	525.466213	70
526.273696	531.482540	71
532.469615	534.834921	72
538.116780	539.683900	73
540.591156	547.067120	74
550.857823	553.193197	75
554.439683	555.458050	76
557.542630	558.062132	77
559.009297	559.349206	78
560.565760	560.895692	79
564.676417	566.193651	80
569.964399	574.454875	81
575.631519	576.600000	82
577.686848	578.515646	83
581.148980	583.504308	84
585.199773	586.746939	85
588.711791	589.261224	86
590.886848	593.930612	87
604.555782	604.935601	88
611.120862	612.747846	89
614.982086	615.501587	90
616.628345	617.147846	91
621.118141	622.435828	92
627.343991	627.653968	93
629.279592	637.411791	94
641.172562	641.492517	95
644.175737	645.892517	96
646.799773	648.356916	97
649.134467	651.280272	98
653.354875	657.625850	99
660.079592	660.778685	100
665.028345	666.824943	101
668.061451	669.000000	102
671.094558	675.215873	103
676.083220	676.682540	104
681.411111	681.880726	105
683.157143	685.971429	106
688.135828	689.184127	107
694.531293	695.360091	108
696.157596	696.836735	109
698.163039	700.897506	110
702.173923	702.593651	111
716.690930	718.397732	112
719.324943	721.859864	113
724.223810	726.070295	114
727.286848	729.652154	115
732.874150	735.878005	116
736.865079	737.524263	117
738.900454	739.330159	118
745.844671	747.820862	119
748.678231	757.009977	120
759.184354	760.901134	121
763.295011	765.091610	122
766.188435	767.675737	123
769.081859	769.461678	124
770.718141	772.395011	125
775.387528	776.695238	126
778.909524	781.384580	127
783.738549	786.672562	128
787.619728	789.356463	129
796.230159	798.405896	130
799.702268	800.022222	131
804.062358	804.541950	132
807.714059	809.351020	133
810.248299	811.975057	134
812.772562	815.018141	135
817.481859	818.560091	136
820.524943	821.174150	137
823.238776	826.003175	138
827.289569	827.779138	139
831.889116	833.785488	140
837.556236	839.921542	141
844.799773	845.119728	142
852.133107	852.453061	143
856.343537	856.902948	144
858.209297	858.848526	145
861.202494	861.512472	146
863.756689	865.663039	147
866.989342	869.863492	148
871.199773	874.961905	149
875.819274	879.870748	150
881.057370	884.380499	151
885.108163	886.076644	152
887.812018	889.000000	153
889.927211	891.055329	154
891.832880	892.462132	155
896.452381	896.892063	156
901.281406	901.691156	157
909.772109	910.850340	158
913.124490	913.933333	159
915.938095	916.457596	160
919.350340	923.651247	161
924.837868	925.377324	162
928.469615	931.702948	163
933.478231	946.379592	164
947.755782	948.075737	165
950.180272	951.098866	166
953.712245	955.239456	167
955.997052	956.716100	168
958.092290	961.924263	169
962.751701	964.777778	170
965.585261	968.299773	171
970.174830	971.402721	172
973.078231	973.966893	173
975.093651	976.740590	174
978.036961	978.496599	175
981.100000	981.419955	176
983.684127	985.610431	177
991.007483	993.841723	178
995.068254	995.936961	179
1005.893651	1006.463039	180
1015.641497	1015.991383	181
1019.183447	1020.690703	182
1021.817460	1025.380045	183
1026.327211	1029.121542	184
1030.397959	1032.503855	185
1034.309070	1034.998186	186
1045.194331	1047.968707	187
1049.105442	1049.425397	188
1050.811565	1051.510658	189
1057.815646	1058.514739	190
1062.495011	1063.633107	191
1067.593424	1068.023129	192
1069.529025	1069.928798	193
1071.275057	1072.303401	194
1074.856916	1075.825397	195
1078.478685	1079.676644	196
1080.573923	1081.702041	197
1083.237868	1085.004535	198
1087.597959	1088.436735	199
1089.852834	1092.627211	200
1099.211565	1099.780952	201
1106.504989	1107.593197	202
1109.528118	1111.653968	203
1113.020181	1114.986395	204
1116.053288	1118.687982	205
1119.415646	1122.289796	206
1123.606122	1124.175510	207
1125.172562	1127.019048	208
1130.680045	1133.554195	209
1134.611111	1140.498413	210
1141.914512	1142.254422	211
1144.388889	1145.646712	212
1153.857370	1155.065306	213
1159.205215	1159.614966	214
1161.190703	1161.839909	215
1167.167120	1169.103401	216
1170.689116	1171.368254	217
1178.012472	1179.090703	218
1180.776190	1181.664853	219
1182.961224	1185.286621	220
1189.606122	1190.784127	221
1191.910884	1194.276190	222
1195.093651	1196.261678	223
1197.019274	1197.409070	224
1199.084580	1200.132880	225
1204.661905	1205.490703	226
1207.146259	1207.635828	227
1208.443311	1209.032653	228
1215.168027	1217.653061	229
1218.859637	1219.878005	230
1226.342630	1227.061678	231
1227.779365	1228.219048	232
1230.483220	1231.840816	233
1233.506349	1234.943764	234
1259.527211	1261.892517	235
1267.289569	1267.888889	236
1272.088662	1276.619048	237
1278.603855	1279.791837	238
1281.257823	1283.912472	239
1285.408390	1286.566440	240
1288.441497	1289.709297	241
1290.706349	1296.543764	242
1300.454195	1301.003628	243
1304.385261	1304.765079	244
1306.181179	1306.990023	245
1308.765306	1309.324717	246
1315.819274	1316.209070	247
1317.156236	1317.585941	248
1322.344444	1323.033560	249
1335.983447	1339.436281	250
1340.802494	1342.389569	251
1343.536281	1345.482540	252
1350.600227	1352.636281	253
1354.002494	1355.888889	254
1358.572109	1363.741043	255
1367.691383	1369.108844	256
1370.804308	1371.293878	257
1378.816100	1379.884354	258
1381.909070	1383.206803	259
1384.692744	1387.766440	260
1389.501814	1389.991383	261
1391.567120	1392.106576	262
1394.420635	1395.917914	263
1400.257370	1402.123810	264
1403.021088	1404.568254	265
1407.979819	1408.329705	266
1409.226984	1411.751927	267
1412.549433	1413.617687	268
1415.642404	1420.980952	269
1424.971202	1425.700227	270
1427.006576	1427.356463	271
1428.084127	1429.162358	272
1430.608390	1432.045805	273
1434.300000	1434.769615	274
1436.295465	1436.605442	275
1441.882766	1442.851247	276
1443.888209	1446.203628	277
1448.657370	1449.536054	278
1450.892290	1451.681179	279
1453.506349	1454.644444	280
1458.305442	1458.814966	281
1461.747619	1462.127438	282
1465.249660	1465.968707	283
1471.355782	1471.845351	284
1476.354422	1477.552381	285
1478.280045	1480.854875	286
1481.572562	1483.808163	287
1485.194331	1486.551927	288
1487.289569	1488.517460	289
1490.671882	1491.999546	290
1493.485488	1496.140136	291
1497.695918	1498.724263	292
1499.721315	1500.180952	293
1504.330839	1504.970068	294
1505.837415	1506.147392	295
1507.583447	1509.908844	296
1512.352608	1513.121542	297
1513.869161	1514.817687	298
1516.782540	1517.122449	299
1522.050567	1522.769615	300
1532.367120	1532.816780	301
1534.173016	1534.482993	302
1540.728118	1541.038095	303
1555.793878	1560.024943	304
1566.619274	1575.250340	305
1598.566667	1599.096145	306
1603.295918	1603.995011	307
1605.580726	1608.385034	308
1610.359864	1611.677551	309
1614.789796	1615.748299	310
1618.281859	1619.799093	311
1623.330385	1624.658050	312
1626.094104	1626.583673	313
1632.739002	1637.488889	314
1639.294104	1639.793651	315
1640.541270	1640.861224	316
1642.147619	1642.567347	317
1644.771655	1645.480726	318
1648.273696	1648.912925	319
1651.346712	1652.834014	320
1654.090476	1654.829478	321
1656.245578	1658.121995	322
1662.182086	1664.008617	323
1665.923583	1668.478458	324
1670.453288	1672.010431	325
1675.870975	1676.380499	326
1678.165760	1678.475737	327
1679.303175	1679.663039	328
1682.196599	1682.756009	329
1684.032426	1688.652608	330
1690.298186	1690.967347	331
1697.661451	1698.011338	332
1700.425170	1718.584580	333
1721.836508	1722.595465	334
1724.031519	1726.227211	335
1727.433787	1728.063039	336
1729.399320	1731.595011	337
1732.661905	1735.795465	338
1738.847846	1739.337415	339
1740.304535	1741.263039	340
1742.469615	1744.356009	341
1745.612472	1745.922449	342
1748.326304	1759.681179	343
1779.515420	1779.915193	344
1786.000680	1787.328345	345
1789.911791	1790.720635	346
1792.156689	1793.304762	347
1795.379365	1795.948753	348
1797.464626	1798.433107	349
1799.460091	1801.885261	350
1803.031973	1804.369615	351
1806.055102	1807.941497	352
1808.878685	1809.188662	353
1812.570295	1813.079819	354
1813.887302	1814.835828	355
1820.522222	1820.941950	356
1821.948980	1822.628118	357
1823.585261	1826.309751	358
1827.955329	1828.963719	359
1829.831066	1830.350567	360
1847.071882	1847.651247	361
1853.916327	1855.982313	362
1872.853288	1873.163265	363
1874.270068	1875.837188	364
1878.969388	1879.399093	365
1925.603401	1926.202721	366
1929.185261	1929.495238	367
1933.425624	1936.339683	368
1937.217007	1943.802721	369
1945.518141	1946.307029	370
1947.094558	1947.763719	371
1949.339456	1951.764626	372
1952.621995	1953.251247	373
1958.957596	1959.267574	374
1961.262358	1965.952381	375
1972.706349	1973.385488	376
1974.173016	1977.995011	377
1981.087302	1982.195465	378
1983.950794	1985.647619	379
2004.304535	2009.234014	380
2010.071429	2011.089796	381
2014.730839	2015.140590	382
2018.093197	2021.825397	383
2025.296825	2026.325170	384
2027.152608	2027.881633	385
2033.967120	2035.504308	386
2040.502268	2041.610431	387
2047.915420	2048.265306	388
2050.838776	2052.076644	389
2061.225170	2061.764626	390
2063.739456	2064.049433	391
2066.932200	2067.431746	392
2068.748073	2069.407256	393
2075.353061	2075.762812	394
2078.984807	2079.304762	395
2080.820635	2081.549660	396
2083.285034	2084.672562	397
2087.415646	2088.104762	398
2090.428798	2091.048073	399
2092.743537	2095.138776	400
2098.729932	2103.110658	401
2104.676417	2107.470748	402
2108.487755	2109.346485	403
2110.862358	2113.507029	404
2119.373016	2122.057596	405
2122.825170	2124.731519	406
2127.394785	2128.213605	407
2130.787075	2131.136961	408
2145.383900	2145.883447	409
2151.130839	2152.388662	410
2157.396599	2157.846259	411
2158.773469	2160.739683	412
2161.716780	2163.732880	413
2165.897279	2167.584127	414
2174.188435	2174.558277	415
2184.744444	2185.094331	416
2186.520408	2186.920181	417
2191.389342	2191.918821	418
2194.113152	2194.453061	419
2195.330385	2196.219048	420
2198.712698	2200.748753	421
2201.506349	2203.412698	422
2219.585261	2220.573696	423
2221.999773	2222.469388	424
2223.187075	2223.706576	425
2225.352154	2227.278458	426
2229.991610	2235.619501	427
2236.426984	2236.886621	428
2240.298186	2240.787755	429
2241.834694	2243.331973	430
2245.715873	2247.352834	431
2249.158050	2252.311565	432
2254.376190	2255.274830	433
2256.231973	2257.599546	434
2261.210658	2262.598186	435
2264.413379	2265.581406	436
2266.398866	2268.983673	437
2270.549433	2274.620862	438
2276.326304	2280.756916	439
2282.711791	2285.565986	440
2287.959864	2288.329705	441
2292.260091	2292.600000	442
2295.313152	2296.710658	443
2298.545805	2301.160544	444
2302.905896	2303.435374	445
2306.298186	2308.214512	446
2309.441043	2309.900680	447
2310.797959	2311.167800	448
2318.011565	2319.329252	449
2323.090023	2327.091610	450
2328.378005	2329.705669	451
2331.121769	2332.050340	452
2332.967574	2333.556916	453
2336.040590	2336.929252	454
2342.585714	2348.383220	455
2349.380272	2349.760091	456
2351.854649	2352.693424	457
2354.279138	2354.629025	458
2357.142630	2358.629932	459
2361.143537	2361.802721	460
2363.408390	2363.967800	461
2379.402041	2380.061224	462
2381.946259	2382.914739	463
2383.712245	2385.189569	464
2389.858277	2390.607256	465
2391.704082	2403.458050	466
2404.195692	2406.072109	467
2406.859637	2408.706122	468
2410.321769	2412.627211	469
2414.013379	2416.668027	470
2417.375737	2418.134694	471
2420.408844	2422.195465	472
2423.671429	2424.380499	473
2425.297732	2425.787302	474
2427.263265	2428.231746	475
2440.094104	2441.002721	476
2441.909977	2442.698866	477
2444.124943	2446.949206	478
2447.986168	2449.004535	479
2449.931746	2450.810431	480
2452.396145	2455.180499	481
2458.073243	2461.735601	482
2462.573016	2465.087982	483
2465.825624	2467.652154	484
2468.689116	2469.478005	485
2470.445125	2470.795011	486
2474.076871	2474.486621	487
2480.701814	2484.014966	488
2485.241497	2487.267574	489
2489.451927	2491.807256	490
2492.654649	2493.732880	491
2506.493197	2508.738776	492
2509.815646	2512.619955	493
2513.946259	2514.346032	494
2515.622449	2517.199546	495
2518.146712	2519.444444	496
2520.291837	2522.627211	497
2526.567574	2526.957370	498
2528.074150	2528.813152	499
2530.518594	2534.001361	500
2534.709070	2538.141950	501
2538.889569	2539.598639	502
2541.044671	2545.006349	503
2548.547619	2550.962812	504
2552.628345	2553.427211	505
2556.399773	2556.889342	506
2560.620181	2561.079819	507
2566.237415	2568.991837	508
2574.907710	2576.694331	509
2577.402041	2577.741950	510
2579.347619	2580.465760	511
2582.660091	2583.339229	512
2591.460091	2592.049433	513
2593.864626	2595.860771	514
2596.568481	2597.107937	515
2605.937188	2607.903401	516
2610.137642	2612.083900	517
2617.760317	2618.269841	518
2621.042857	2621.382766	519
2622.319955	2622.629932	520
2623.836508	2631.559637	521
2635.879138	2636.209070	522
2638.044218	2640.140136	523
2641.366667	2643.552381	524
2644.429705	2644.739683	525
2660.752608	2668.785034	526
2673.353968	2674.122902	527
2675.429252	2675.819048	528
2677.913605	2681.905215	529
2683.221542	2683.531519	530
2685.506349	2695.364626	531
2696.700907	2700.303401	532
2701.021088	2701.790023	533
2704.253741	2705.900680	534
2708.643764	2709.462585	535
2710.270068	2714.361451	536
2715.538095	2716.107483	537
2718.241950	2720.796825	538
2721.873696	2723.650340	539
2725.265986	2726.573696	540
2729.276871	2729.786395	541
2734.145805	2734.465760	542
2737.248753	2737.698413	543
2738.795238	2764.527438	544
2766.961224	2767.440816	545
2768.926757	2772.319728	546
2773.695918	2776.709751	547
2781.747619	2783.733787	548
2785.159864	2787.714739	549
2788.791610	2789.760091	550
2794.348980	2798.081179	551
2800.375283	2808.317914	552
2810.532200	2813.376417	553
2814.972109	2817.716553	554
2818.633787	2819.712018	555
2824.829705	2825.478912	556
2826.705442	2830.637188	557
2831.424717	2832.233560	558
2833.729478	2837.262132	559
2837.969841	2838.289796	560
2839.456463	2840.385034	561
2844.784354	2846.810431	562
2853.883673	2857.675737	563
2860.129478	2861.826304	564
2863.122676	2863.522449	565
2864.270068	2864.719728	566
2865.666893	2872.262585	567
2873.399320	2873.878912	568
2875.913605	2876.562812	569
2883.117234	2888.385941	570
2890.111338	2891.887982	571
2894.231973	2897.275737	572
2897.993424	2898.941950	573
2901.445578	2916.980952	574
2918.846032	2919.754649	575
2921.500000	2924.713379	576
2926.059637	2926.888435	577
2931.916327	2939.529705	578
2941.614286	2945.536054	579
2946.922222	2951.362812	580
2955.013832	2956.281633	581
2958.176644	2959.693878	582
2961.169841	2964.822222	583
2967.026531	2973.223129	584
2974.579365	2977.214059	585
2978.380726	3001.468934	586
3002.655556	3004.232653	587
3005.548980	3006.677098	588
3007.704082	3008.223583	589
3009.679592	3011.266667	590
3012.034240	3012.972789	591
3015.915420	3017.432653	592
3019.277778	3022.341497	593
3023.508163	3025.025397	594
3028.137642	3028.497506	595
3029.344898	3035.082540	596
3035.840136	3036.209977	597
3037.236961	3042.186395	598
3045.857370	3051.854422	599
3052.971202	3057.840816	600
3059.017460	3060.943764	601
3065.013832	3066.371429	602
3069.174376	3069.514286	603
3073.584354	3074.233560	604
3081.526304	3081.836281	605
3144.513152	3151.887075	606
3155.907256	3156.486621	607
3159.449206	3160.078458	608
3161.654195	3163.490703	609
3166.503175	3167.511565	610
3169.616100	3170.325170	611
3174.485034	3182.058503	612
3186.008844	3187.785488	613
3191.067347	3191.427211	614
3196.225624	3197.593197	615
3201.064626	3202.112925	616
