problem, problem start, problem end, moi start, moi end, tts, correct, person initiating answer, person explaining,
1A:, 0:34, 1:44, 1:31, 1:41, (67), Y, S16, No,
2A:, 1:45, 2:47, 2:08, 2:29, (44), Y, S18, S18,
3A:, 2:48, 4:58, 4:06, 4:43, (115), Y, S16 & S17, No, 
4A:, 4:59, 7:00,6:18,7:00, (115), Y, S16 & S17, No, 
1B:, 7:36,  8:48, 7:58, 8:40, (64), Y, S18, No,
2B:, 8:49,  10:58, 10:43, 10:52, (123), Y, S17, No,
3B:, 10:59, 13:13, 12:34, 13: 07, (128), Y, S17, No,
4B:, 13:14, 15:15, 14:14, 14:37, (83), Y, S17, S17,
1C:, 16:04, 17:47,  17:09, 17:21, (77), Y, S16, S16,
2C:, 17:48, 20:02,  19:14, 19:36, (108), Y, S18, S18,
3C:, 20:03, 21:29,  20:50, 21:22, (79), Y, S18, No,
4C:, 21:30, 24:38,  23:47, 24:04, (154), N, S18, No,
1D:, 25:18, 26:13, 26:01, 26:12, (54), Y, S18, No,
2D:, 26:14, 27:07, 26:45, 26:52, (38), N, S16, No,
3D:, 27:08, 29:50, 28:52, 29:04, (116), Y, S18, S16,
4D:, 29:51, 36:52, 33:01, 35:29, (338), Y, S17, S17,
