3.461905	4.200907	1
7.273243	10.107483	2
13.618821	14.846712	3
15.614286	15.984127	4
21.061905	21.461678	5
23.546259	27.348299	6
31.767574	34.003175	7
39.729478	41.765533	8
44.618367	48.430385	9
50.006122	52.211791	10
53.647846	54.596372	11
55.523583	61.570522	12
64.353515	66.239909	13
69.092744	74.710658	14
75.498186	77.703855	15
79.648753	80.687075	16
82.322676	89.397279	17
93.367574	99.464399	18
100.212018	103.195918	19
105.460091	110.858503	20
116.973923	117.323810	21
120.007029	121.244898	22
122.042404	123.579592	23
124.656463	125.275737	24
126.412472	130.503855	25
134.035147	134.883900	26
137.347619	138.226304	27
139.253288	140.990023	28
142.216553	142.736054	29
146.756236	153.282086	30
154.598413	157.811791	31
160.115873	163.868027	32
166.830612	169.205896	33
169.953515	170.263492	34
172.238322	174.294331	35
177.995238	184.271655	36
187.473696	188.053061	37
188.880499	189.968707	38
190.856009	192.083900	39
192.861451	193.171429	40
196.114059	196.473923	41
199.895465	202.809524	42
203.557143	203.946939	43
205.113605	207.369161	44
208.366213	209.903401	45
210.770748	217.416327	46
219.241497	222.135601	47
223.362132	225.039002	48
227.123583	229.508844	49
230.216553	231.394558	50
234.027891	234.417687	51
235.304989	236.163719	52
238.417914	239.615873	53
243.695918	244.335147	54
246.679138	248.156463	55
249.093651	249.842630	56
250.670068	254.102948	57
256.885941	257.195918	58
258.242857	259.879819	59
261.874603	262.533787	60
263.391156	267.731973	61
268.519501	271.832653	62
273.059184	275.175057	63
275.882766	276.382313	64
278.786168	280.343311	65
285.590703	287.187755	66
288.075057	290.250794	67
291.197959	296.277098	68
297.324036	299.220408	69
300.566667	301.515193	70
303.639683	304.947392	71
306.034240	310.654422	72
311.372109	312.709751	73
316.201134	316.720635	74
323.285034	324.692517	75
328.303628	329.102494	76
330.987528	331.387302	77
335.307710	336.196372	78
346.163039	346.473016	79
347.609751	348.458503	80
349.994331	354.265306	81
358.016100	366.707029	82
368.192971	368.642630	83
369.809297	372.074830	84
374.548526	376.414966	85
377.920862	379.597732	86
381.323129	383.149660	87
384.066893	384.436735	88
385.264172	387.060771	89
389.324943	391.301134	90
395.770295	403.064399	91
404.131293	405.099773	92
406.266440	406.576417	93
407.284127	407.643991	94
408.451474	411.395465	95
412.382540	412.951927	96
413.919048	418.469388	97
421.741270	423.288435	98
424.026077	426.112018	99
429.294104	431.569615	100
433.275057	433.654875	101
438.094104	438.593651	102
439.411111	441.956009	103
443.212472	443.652154	104
445.477324	448.341497	105
449.258730	449.688435	106
450.865079	451.234921	107
452.521315	453.310204	108
455.035601	456.103855	109
459.305896	460.074830	110
461.510884	461.940590	111
463.167120	464.045805	112
464.943084	472.287075	113
473.024717	475.300227	114
476.656463	477.415420	115
478.452381	479.770068	116
481.814739	488.749660	117
490.205669	490.824943	118
491.722222	492.032200	119
493.757596	497.769161	120
498.706349	502.338776	121
504.273696	504.763265	122
508.474150	516.077551	123
518.351701	519.110658	124
524.537642	526.603628	125
530.623810	532.669841	126
535.632426	553.013605	127
553.721315	554.440363	128
555.926304	563.699320	129
567.340363	568.807710	130
569.984354	571.641270	131
572.368934	572.778685	132
574.982993	575.392744	133
578.125850	582.257143	134
583.473696	585.180499	135
587.095465	589.919728	136
591.006576	593.062585	137
593.770295	609.165986	138
612.836961	613.825397	139
618.543991	622.026757	140
626.875057	627.803628	141
628.890476	629.858957	142
631.853741	632.662585	143
633.380272	633.800000	144
634.537642	636.054875	145
638.807937	642.709751	146
645.951701	649.105215	147
650.531293	651.709297	148
652.915873	655.640363	149
656.926757	663.921542	150
665.696825	670.925624	151
672.501361	675.834467	152
679.086395	679.695692	153
680.473243	681.780952	154
684.444218	687.238549	155
689.602494	697.954195	156
699.190703	705.566893	157
709.287755	712.451247	158
713.168934	715.614059	159
717.040136	719.894331	160
724.263719	726.110204	161
728.065079	733.094331	162
736.296372	737.035374	163
737.763039	743.171429	164
746.114059	758.915646	165
760.032426	760.990930	166
761.928118	762.248073	167
764.761678	765.849887	168
767.365760	771.447166	169
772.254649	772.774150	170
775.317687	776.555556	171
778.430612	782.591837	172
783.578912	784.906576	173
789.345805	791.411791	174
792.947619	793.926077	175
794.833333	801.478912	176
802.316327	802.855782	177
805.050113	809.630385	178
813.261451	819.797279	179
820.924036	826.292517	180
827.997959	828.936508	181
831.909070	833.396372	182
834.273696	838.554649	183
848.301814	848.691610	184
850.776190	854.538322	185
855.246032	856.793197	186
857.890023	859.956009	187
861.212472	863.298413	188
864.824263	865.852608	189
866.570295	867.887982	190
868.615646	872.407710	191
873.155329	873.754649	192
875.130839	878.703401	193
880.089569	880.399546	194
883.212472	891.015420	195
893.638776	894.347846	196
896.242857	896.712472	197
898.717234	901.691156	198
903.945351	904.255329	199
911.328571	912.646259	200
916.267347	919.819955	201
922.463265	924.678912	202
927.382086	934.536508	203
935.952608	940.862132	204
944.912245	947.317460	205
951.866440	952.415873	206
953.313152	954.940136	207
956.236508	958.871202	208
963.849206	964.209070	209
973.118141	973.867120	210
976.670068	982.268027	211
983.644218	983.964172	212
985.200680	990.469388	213
991.685941	992.005896	214
994.389796	998.640816	215
999.937188	1009.196825	216
1011.321315	1019.573243	217
1024.052381	1024.911111	218
1025.768481	1028.902041	219
1030.427891	1032.024943	220
1032.762585	1034.170068	221
1036.703628	1037.013605	222
1040.016100	1040.425850	223
1044.296372	1046.661678	224
1052.467800	1055.092517	225
1056.937642	1061.278458	226
1063.123583	1063.912472	227
1067.683220	1069.290249	228
1071.025624	1073.241270	229
1077.331293	1077.800907	230
1078.588435	1079.058050	231
1081.322222	1081.652154	232
1085.442857	1085.762812	233
1086.869615	1092.088435	234
1094.242857	1098.014966	235
1099.490930	1112.851247	236
1114.796145	1116.502948	237
1117.310431	1118.458503	238
1119.605215	1120.384127	239
1121.121769	1121.850794	240
1125.312245	1126.300680	241
1129.971655	1130.371429	242
1131.707710	1132.057596	243
1133.822902	1136.038549	244
1137.145351	1138.024036	245
1139.579819	1139.979592	246
1141.425624	1142.024943	247
1142.772562	1143.222222	248
1146.114966	1146.554649	249
1148.409751	1148.719728	250
1155.902721	1160.912018	251
1163.874603	1164.733333	252
1165.969841	1168.444898	253
1169.741270	1170.779592	254
1171.736735	1173.653061	255
1174.480499	1180.357823	256
1184.946712	1185.406349	257
1186.942177	1190.684354	258
1194.943991	1195.273923	259
1198.186621	1198.616327	260
1199.862812	1200.970975	261
1205.440136	1206.927438	262
1209.371202	1209.840816	263
1212.005215	1219.239456	264
1225.773923	1228.508390	265
1229.246032	1233.606803	266
1235.990703	1237.707483	267
1238.415193	1240.331519	268
1241.578005	1242.596372	269
1243.373923	1246.587302	270
1247.444671	1247.874376	271
1249.300454	1251.236735	272
1252.323583	1256.993651	273
1259.796599	1263.638549	274
1264.665533	1266.282540	275
1267.818367	1269.096145	276
1272.856916	1275.331973	277
1276.548526	1279.672109	278
1280.709070	1281.098866	279
1282.026077	1286.696145	280
1287.463719	1293.011791	281
1293.869161	1294.628118	282
1295.984354	1299.068027	283
1300.085034	1303.098866	284
1303.996145	1306.002268	285
1309.952608	1310.382313	286
1312.357143	1315.091610	287
1316.677324	1318.364172	288
1319.900000	1325.707483	289
1326.874150	1327.992290	290
1328.909524	1339.675737	291
1344.055102	1346.071202	292
1347.257823	1349.373696	293
1351.168934	1352.726077	294
1353.713152	1357.425397	295
1358.332653	1369.956916	296
1372.260998	1372.690703	297
1375.373923	1382.737868	298
1384.114059	1390.470295	299
1391.786621	1396.107483	300
1397.184354	1399.000907	301
1400.337188	1400.667120	302
1402.721769	1403.710204	303
1404.627438	1407.571429	304
1411.591610	1412.859410	305
1413.726757	1414.844898	306
1417.847392	1421.839002	307
1424.073243	1427.476190	308
1428.762585	1440.486621	309
1441.962585	1442.631746	310
1445.145351	1445.644898	311
1448.048753	1448.488435	312
1449.475510	1450.424036	313
1452.319048	1453.985941	314
1454.893197	1459.523356	315
1461.647846	1462.975510	316
1464.840590	1465.240363	317
1466.287302	1468.163719	318
1471.216100	1472.972789	319
1475.356689	1476.025850	320
1477.561678	1478.440363	321
1479.467347	1480.256236	322
1482.450567	1491.181406	323
1492.358050	1510.337868	324
1511.265079	1512.113832	325
1514.886848	1520.215420	326
1521.851020	1526.321542	327
1528.535828	1533.165986	328
1536.308163	1536.937415	329
1538.433333	1539.401814	330
1540.658277	1541.586848	331
1542.803401	1551.234921	332
1553.519048	1556.203628	333
1559.076417	1559.466213	334
1561.800227	1573.055329	335
1574.481406	1580.668027	336
1584.658277	1595.374603	337
1599.923583	1619.160544	338
1622.322676	1624.767800	339
1627.600680	1628.748753	340
1629.715873	1630.175510	341
1632.559410	1639.204989	342
1640.132200	1659.538776	343
1660.465986	1661.085261	344
1663.878231	1666.043991	345
1666.921315	1671.551474	346
1674.992971	1678.206349	347
1679.083673	1679.712925	348
1680.759864	1688.123810	349
1689.549887	1691.605896	350
1693.351247	1696.454875	351
1697.751247	1706.132880	352
1708.037868	1708.347846	353
1711.250567	1715.152381	354
1717.466440	1717.776417	355
1721.656916	1723.553288	356
1725.158957	1726.466667	357
1729.279592	1729.659410	358
1731.743991	1734.548299	359
1737.570748	1747.728345	360
1748.835147	1750.092971	361
1751.239683	1752.128345	362
1753.893651	1755.800000	363
1757.325850	1760.998186	364
1761.975283	1767.573243	365
1768.480499	1769.668481	366
1770.535828	1771.304762	367
1772.361678	1772.741497	368
1775.883673	1778.278912	369
1779.365760	1787.408163	370
1789.392971	1797.425397	371
1798.452381	1798.762358	372
1800.607483	1805.058050	373
1806.783447	1807.163265	374
1809.537188	1824.443991	375
1825.670522	1828.105669	376
1832.135828	1838.292517	377
1841.005669	1841.315646	378
1847.810204	1853.567800	379
1857.308617	1860.402268	380
1861.858277	1865.341043	381
1866.807029	1874.929252	382
1876.036054	1878.760544	383
1879.927211	1880.257143	384
1881.553515	1893.606803	385
1895.182540	1896.021315	386
1896.878685	1911.645805	387
1912.622902	1914.479365	388
1915.975283	1917.302948	389
1918.509524	1922.171882	390
1923.059184	1934.763265	391
1936.568481	1938.814059	392
1939.591610	1939.901587	393
1941.148073	1942.914739	394
1943.722222	1949.629478	395
1950.746259	1951.056236	396
1951.803855	1952.453061	397
1953.270522	1955.126984	398
1956.004308	1959.427211	399
1961.791156	1963.248526	400
1964.046032	1968.087528	401
1972.127664	1979.741043	402
1980.498639	1981.187755	403
1982.514059	1983.981406	404
1985.168027	1985.687528	405
1987.901814	1988.680726	406
1989.468254	1999.017234	407
1999.814739	2000.134694	408
2000.932200	2015.330159	409
2016.367120	2016.677098	410
2017.634240	2018.921995	411
2026.154875	2030.006803	412
2031.273243	2032.351474	413
2038.915873	2040.273469	414
2042.487755	2047.586848	415
2048.713605	2053.323810	416
2054.540363	2057.763719	417
2060.417007	2060.986395	418
2064.637415	2070.165533	419
2073.507256	2075.104308	420
2076.251020	2085.211338	421
2087.166213	2089.950567	422
2093.940816	2095.807256	423
2097.682313	2097.992290	424
2105.694104	2109.625850	425
2110.742630	2111.052608	426
2112.029705	2118.405896	427
2122.665533	2123.404535	428
2124.910431	2125.220408	429
2126.776190	2127.215873	430
2130.198413	2130.508390	431
2131.295918	2133.122449	432
2134.069615	2134.838549	433
2135.566213	2136.325170	434
2137.392063	2138.649887	435
2140.155782	2141.603175	436
2144.017007	2146.641723	437
2148.207483	2148.617234	438
2154.134014	2154.453968	439
2157.865533	2158.564626	440
2160.210204	2161.358277	441
2162.125850	2172.004082	442
2172.761678	2174.937415	443
2176.183900	2177.950567	444
2181.870975	2183.697506	445
2185.861905	2188.616327	446
2192.436961	2196.967347	447
2197.724943	2201.277551	448
2202.095011	2203.292971	449
2204.200227	2204.520181	450
2205.357596	2209.409070	451
2210.146712	2212.023129	452
2214.746259	2219.685714	453
2222.388889	2222.698866	454
2225.791156	2229.523356	455
2230.849660	2231.189569	456
2231.977098	2235.649433	457
2237.065533	2242.813152	458
2243.680499	2248.041270	459
2253.777551	2264.992744	460
2265.949887	2270.729705	461
2272.085941	2286.743311	462
2287.540816	2291.103401	463
2292.110431	2292.510204	464
2294.764399	2296.221769	465
2297.358503	2297.907937	466
2298.735374	2299.424490	467
2300.910431	2304.103855	468
2305.130839	2307.995011	469
2309.820181	2311.257596	470
2312.334467	2315.029025	471
2318.510431	2321.414512	472
2322.261905	2330.443991	473
2331.191610	2338.096599	474
2339.353061	2340.441270	475
2342.326304	2349.550567	476
2353.341270	2356.843991	477
2357.561678	2358.101134	478
2359.048299	2361.742857	479
2362.570295	2363.219501	480
2364.106803	2372.169161	481
2373.704989	2374.733333	482
2375.860091	2379.223129	483
2380.649206	2384.570975	484
2387.214286	2391.116100	485
2395.166213	2404.216327	486
2407.727664	2408.037642	487
2408.805215	2413.864399	488
2414.602041	2417.665760	489
2419.470975	2421.068027	490
2423.551701	2424.949206	491
2425.756689	2427.134240	492
2428.989342	2431.025397	493
2434.596599	2435.585034	494
2437.669615	2439.376417	495
2440.582993	2465.347392	496
2466.055102	2466.744218	497
2467.791156	2474.406803	498
2479.265079	2479.904308	499
2481.559864	2483.286621	500
2484.353515	2494.600907	501
2497.044671	2499.330159	502
2500.826077	2501.914286	503
2502.631973	2504.268934	504
2506.183900	2511.362812	505
2513.307710	2520.382313	506
2523.085488	2527.097052	507
2528.323583	2529.521542	508
2530.418821	2531.985941	509
2533.441950	2533.781859	510
2534.988435	2540.546485	511
2541.373923	2544.926531	512
2546.103175	2546.772336	513
2548.527664	2550.863039	514
2551.660544	2561.249433	515
2563.134467	2567.315646	516
2568.212925	2570.129252	517
2571.126304	2573.012698	518
2575.785714	2576.404989	519
2583.568027	2583.907937	520
2584.645578	2586.063039	521
2587.648753	2608.492063	522
2610.117687	2615.286621	523
2616.124036	2622.180952	524
7.921769	8.491156	1
22.199320	22.988209	2
25.152608	27.398186	3
36.746259	40.907483	4
43.421088	45.008163	5
49.158050	50.545578	6
51.752154	55.813605	7
63.026531	63.356463	8
69.142630	75.758277	9
79.209751	88.848526	10
92.170295	94.206349	11
97.139002	99.494331	12
106.547619	108.703401	13
109.650567	109.960544	14
113.791156	115.228571	15
116.874150	117.583220	16
122.720862	123.050794	17
127.051020	128.947392	18
140.580272	141.608617	19
144.162132	145.020862	20
146.227438	147.355556	21
149.819274	150.687982	22
152.762585	156.005896	23
157.900907	158.879365	24
161.612472	162.062132	25
165.992517	166.362358	26
174.253741	175.461678	27
176.937642	178.335147	28
179.062812	184.680726	29
185.468254	188.931066	30
192.202948	197.760998	31
202.439683	207.748299	32
212.137642	212.956463	33
219.780272	221.297506	34
225.517234	226.904762	35
238.797052	239.196825	36
261.695011	264.599093	37
268.978458	270.385941	38
278.267347	279.784580	39
305.126304	307.441723	40
351.760317	352.828571	41
358.784354	361.458957	42
362.266440	364.312472	43
367.304989	369.570522	44
375.406576	378.180952	45
381.353061	381.692971	46
382.430612	387.040816	47
389.724036	390.034014	48
408.910431	409.280272	49
410.407029	411.046259	50
412.093197	412.832200	51
427.637868	430.312472	52
434.472336	437.176871	53
444.539456	446.515646	54
447.971655	448.590930	55
450.236508	451.075283	56
459.126304	461.102494	57
464.504082	468.585488	58
471.188889	471.718367	59
474.940363	476.268027	60
491.343084	492.630839	61
493.837415	495.394558	62
504.153968	505.022676	63
506.229252	506.629025	64
512.844218	515.169615	65
520.885941	524.767800	66
531.671429	534.036735	67
535.542630	535.862585	68
540.411565	548.603628	69
550.897732	551.207710	70
552.154875	552.464853	71
553.811111	558.620862	72
559.757596	562.422222	73
563.439229	564.427664	74
565.873696	567.171429	75
568.068707	571.850794	76
573.107256	573.956009	77
576.359864	576.999093	78
578.475057	580.321542	79
581.228798	581.538776	80
583.054649	583.364626	81
586.656463	592.084807	82
594.139456	594.449433	83
595.775737	599.647619	84
600.854195	601.643084	85
605.852834	607.978685	86
618.992971	619.532426	87
631.235147	633.580499	88
640.234694	640.544671	89
650.042404	650.861224	90
651.968027	652.278005	91
653.704082	654.223583	92
655.789342	656.099320	93
656.986621	659.611338	94
660.398866	660.948299	95
662.723583	663.043537	96
663.940816	664.869388	97
667.881859	670.666213	98
681.121769	681.431746	99
682.279138	683.507029	100
687.487302	688.106576	101
690.370748	694.422222	102
695.449206	696.487528	103
708.898639	710.655329	104
712.460544	713.199546	105
713.987075	715.254875	106
716.072336	718.856689	107
722.757143	724.563719	108
729.890930	732.146485	109
736.356236	737.643991	110
739.429252	742.083900	111
743.968934	745.825397	112
746.592971	749.048073	113
750.913152	752.480272	114
755.013832	757.239456	115
759.164399	761.030839	116
766.707256	767.785488	117
768.852381	770.359637	118
771.665986	772.395011	119
777.911791	784.228118	120
785.275057	786.423129	121
791.620635	792.459410	122
801.897279	804.382313	123
805.139909	807.445351	124
818.699093	819.497959	125
820.734467	821.862585	126
832.168481	851.395465	127
862.260091	862.619955	128
864.355329	869.903401	129
871.798413	877.196825	130
889.957143	890.606349	131
892.261905	893.839002	132
895.125397	896.991837	133
900.453288	901.202268	134
905.352154	915.968707	135
925.236961	926.574603	136
933.039229	935.973243	137
938.037868	938.457596	138
949.292290	951.557823	139
952.435147	961.126077	140
961.843764	964.707937	141
965.734921	976.580952	142
978.675510	980.342404	143
981.778458	982.976417	144
985.230612	986.747846	145
987.974376	989.381859	146
990.827891	991.337415	147
995.846485	996.156463	148
998.111338	999.887982	149
1004.816100	1005.904308	150
1010.094104	1011.790930	151
1015.132653	1015.911565	152
1022.535828	1024.492063	153
1025.339456	1026.976417	154
1031.894558	1050.552834	155
1061.088209	1062.824943	156
1065.548073	1066.985488	157
1072.033333	1072.492971	158
1079.336735	1081.662132	159
1085.532653	1088.287075	160
1089.782993	1090.541950	161
1099.141723	1102.275283	162
1111.573469	1115.455329	163
1117.380272	1117.730159	164
1121.091837	1122.080272	165
1124.244671	1124.893878	166
1138.542177	1141.476190	167
1148.160317	1149.976871	168
1164.303628	1167.227664	169
1172.814286	1173.214059	170
1174.540363	1175.878005	171
1183.440136	1189.078005	172
1190.873243	1192.340590	173
1193.197959	1197.458957	174
1198.366213	1198.975510	175
1199.872789	1203.624943	176
1204.452381	1212.514739	177
1214.090476	1215.058957	178
1215.886395	1216.266213	179
1217.422902	1218.351474	180
1224.875964	1227.031746	181
1228.078685	1228.588209	182
1229.385714	1231.122449	183
1235.122676	1238.326077	184
1241.737642	1242.855782	185
1245.080045	1245.400000	186
1247.105442	1248.253515	187
1250.018821	1250.997279	188
1261.742177	1263.748299	189
1266.132200	1266.631746	190
1285.438322	1286.765986	191
1287.553515	1289.330159	192
1290.516780	1292.223583	193
1296.523129	1297.202268	194
1302.050567	1306.650794	195
1316.537642	1324.959184	196
1336.222902	1336.682540	197
1375.094558	1376.222676	198
1391.716780	1392.026757	199
1393.941723	1402.193651	200
1402.901361	1419.374603	201
1423.604308	1424.063946	202
1426.447846	1426.887528	203
1434.898639	1436.655329	204
1437.742177	1439.947846	205
1450.423356	1450.803175	206
1471.974376	1473.531519	207
1482.410658	1485.055329	208
1513.200680	1514.668027	209
1524.275510	1530.571882	210
1532.666440	1538.184580	211
1558.198413	1558.837642	212
1559.565306	1560.693424	213
1561.730385	1565.492517	214
1567.467347	1568.086621	215
1571.558050	1572.127438	216
1573.543537	1575.360091	217
1576.107710	1577.066213	218
1578.891383	1581.216780	219
1583.301361	1583.960544	220
1588.998413	1590.026757	221
1590.824263	1591.194104	222
1639.842857	1640.422222	223
1644.163039	1644.682540	224
1646.098639	1647.027211	225
1649.421088	1649.731066	226
1653.182540	1653.801814	227
1655.018367	1655.328345	228
1656.335374	1656.814966	229
1663.638776	1664.347846	230
1682.685488	1684.691610	231
1685.489116	1686.487528	232
1687.704082	1688.443084	233
1692.832426	1693.840816	234
1696.783447	1697.392744	235
1699.607029	1702.580952	236
1708.436961	1709.205896	237
1739.436508	1741.672109	238
1743.247846	1743.587755	239
1744.684580	1745.024490	240
1748.595692	1750.362358	241
1751.379365	1751.729252	242
1753.125397	1753.954195	243
1759.710431	1760.928345	244
1765.217914	1770.137415	245
1775.514512	1776.203628	246
1778.278231	1778.588209	247
1779.744898	1781.312018	248
1782.089569	1785.721995	249
1786.449660	1786.789569	250
1788.345351	1789.293878	251
1816.271882	1816.711565	252
1822.627438	1824.493878	253
1831.287755	1832.196372	254
1833.053741	1834.281633	255
1844.876871	1847.441723	256
1856.440590	1858.526531	257
1864.901361	1865.351020	258
1866.358050	1866.757823	259
1867.475510	1869.172336	260
1872.853288	1873.462585	261
1875.636961	1878.321542	262
1881.753061	1885.106122	263
1888.607483	1891.651247	264
1893.147166	1895.153288	265
1902.196599	1905.170522	266
1922.650113	1926.811338	267
1937.456463	1938.404989	268
1940.689116	1941.428118	269
1945.538095	1945.858050	270
1947.144444	1947.524263	271
1954.338095	1954.927438	272
1956.323583	1957.950567	273
1970.551247	1970.901134	274
1976.906803	1978.483900	275
1980.398866	1982.045805	276
1984.719048	1985.867120	277
1993.529025	1995.734694	278
1997.400227	1998.418594	279
2000.982086	2001.292063	280
2005.262358	2006.051247	281
2007.916327	2008.226304	282
2012.845125	2013.494331	283
2016.367120	2022.194558	284
2025.047392	2027.442630	285
2028.848753	2029.388209	286
2030.265533	2030.705215	287
2031.502721	2043.645805	288
2058.291837	2058.851247	289
2066.223810	2072.001361	290
2073.547166	2075.114286	291
2077.967120	2078.895692	292
2086.677324	2087.595918	293
2088.872336	2089.341950	294
2092.484127	2094.560091	295
2097.722222	2100.476644	296
2103.459184	2109.256689	297
2111.381179	2112.678912	298
2113.765760	2115.203175	299
2117.197959	2123.803628	300
2124.511338	2140.904762	301
2148.097732	2148.407710	302
2153.375737	2159.233107	303
2159.960771	2162.296145	304
2163.482766	2164.441270	305
2165.528118	2166.825850	306
2168.970295	2169.898866	307
2193.185261	2193.874376	308
2195.978912	2199.591383	309
2201.027438	2206.006803	310
2207.921769	2211.464399	311
2213.159864	2213.958730	312
2230.879592	2231.518821	313
2232.316327	2233.195011	314
2235.289569	2239.420862	315
2241.385714	2244.190023	316
2244.997506	2246.215420	317
2255.952608	2256.801361	318
2258.037868	2259.106122	319
2267.636054	2269.392744	320
2271.966213	2272.685261	321
2273.432880	2275.039909	322
2276.356236	2276.696145	323
2280.357143	2282.213605	324
2283.939002	2285.346485	325
2291.212472	2293.408163	326
2301.449206	2302.387755	327
2306.587528	2307.855329	328
2313.940816	2318.630839	329
2319.757596	2324.068481	330
2331.351247	2331.661224	331
2333.057370	2334.045805	332
2335.042857	2340.860317	333
2341.687755	2342.815873	334
2345.339456	2345.868934	335
2346.686395	2353.751020	336
2357.980726	2361.762812	337
2362.560317	2363.209524	338
2371.789342	2373.635828	339
2374.642857	2375.172336	340
2376.129478	2377.726531	341
2378.953061	2379.292971	342
2380.469615	2382.655329	343
2384.779819	2386.267120	344
2386.994785	2387.354649	345
2403.467347	2404.286168	346
2405.442857	2406.072109	347
2406.929478	2407.688435	348
2408.865079	2412.078458	349
2413.095465	2414.642630	350
2415.410204	2434.497506	351
2443.636054	2444.145578	352
2449.612472	2453.025397	353
2455.548980	2456.138322	354
2459.180726	2460.618141	355
2461.615193	2463.990476	356
2465.815646	2470.455782	357
2472.121315	2473.019955	358
2474.475964	2482.099320	359
2483.984354	2485.611338	360
2489.621542	2501.924263	361
2502.861451	2505.376417	362
2508.488662	2509.237642	363
2512.130385	2513.108844	364
2527.076417	2528.144671	365
2529.820181	2532.235374	366
2533.781179	2534.220862	367
2536.614739	2537.094331	368
2553.356689	2556.290703	369
2558.255556	2558.615420	370
2565.808390	2583.229478	371
2584.296372	2586.222676	372
2588.367120	2588.866667	373
2591.440136	2591.829932	374
2592.657370	2592.967347	375
2593.814739	2597.477098	376
2599.412018	2600.689796	377
2601.946259	2603.962358	378
2605.587982	2605.917914	379
2607.204308	2609.519728	380
2612.262812	2619.397279	381
7.732200	8.660771	1
14.905896	15.455329	2
20.742630	21.601361	3
26.020635	26.460317	4
29.043764	31.878005	5
32.765306	37.854422	6
39.130839	43.262132	7
45.037415	51.373696	8
53.009297	53.848073	9
56.052381	59.654875	10
63.016553	65.262132	11
66.039683	68.873923	12
71.128118	73.423583	13
77.483673	78.701587	14
80.227438	82.662585	15
85.854649	86.164626	16
87.151701	87.511565	17
93.217914	97.917914	18
104.891383	106.588209	19
108.602948	112.035828	20
113.701361	126.433107	21
127.320408	128.119274	22
134.184807	135.183220	23
140.021542	140.830385	24
141.897279	144.462132	25
148.432426	149.720181	26
154.169388	155.686621	27
156.643764	158.470295	28
161.253288	162.511111	29
165.872789	166.282540	30
167.568934	170.582766	31
172.228345	173.665760	32
175.151701	176.569161	33
178.095011	179.562358	34
182.245578	184.201814	35
185.079138	186.197279	36
188.541270	191.175964	37
192.272789	193.770068	38
196.253741	202.250794	39
205.851927	214.183673	40
215.390249	216.668027	41
217.625170	219.042630	42
219.800227	220.828571	43
221.586168	222.395011	44
223.661451	225.627664	45
226.345351	226.804989	46
227.821995	228.580952	47
230.146712	230.746032	48
232.261905	238.169161	49
238.946712	241.162358	50
242.728118	249.134240	51
250.759864	253.115193	52
255.389342	257.185941	53
258.063265	259.410884	54
260.856916	261.585941	55
262.423356	263.262132	56
264.149433	270.775057	57
271.572562	273.897959	58
275.244218	277.868934	59
280.242857	283.077098	60
284.592971	285.381859	61
287.087302	287.586848	62
289.571655	291.268481	63
295.109070	296.965533	64
299.888209	300.198186	65
302.123129	303.021769	66
304.447846	306.044898	67
307.860091	308.489342	68
311.362132	311.981406	69
315.762132	334.240816	70
335.547166	336.126531	71
338.101361	344.228118	72
346.791610	349.496145	73
350.343537	354.983673	74
357.806576	358.156463	75
358.963946	359.293878	76
360.440590	367.255782	77
369.140816	377.063492	78
378.140363	382.730612	79
383.578005	384.396825	80
385.114512	395.651247	81
407.074603	409.908844	82
410.885941	411.585034	83
412.362585	413.909751	84
414.767120	415.506122	85
420.504082	420.933787	86
422.100454	422.699773	87
423.906349	427.917914	88
429.533560	429.993197	89
432.137642	435.520635	90
436.447846	438.863039	91
440.009751	441.397279	92
444.629252	447.313832	93
451.134467	461.022676	94
462.019728	465.412698	95
466.589342	474.132880	96
476.556689	481.316553	97
489.447392	491.463492	98
492.650113	496.881179	99
497.668707	499.904308	100
501.070975	506.529252	101
507.596145	513.184127	102
514.280952	531.652154	103
533.327664	536.600907	104
540.142177	543.235828	105
545.090930	546.997279	106
548.134014	549.581406	107
552.085034	553.771882	108
554.509524	554.829478	109
559.258730	562.142857	110
570.343537	573.916100	111
575.412018	576.230839	112
578.524943	579.682993	113
580.690023	587.096145	114
587.943537	590.129252	115
593.680499	594.579138	116
595.356689	596.943764	117
597.741270	600.296145	118
605.623356	608.826757	119
609.853741	610.892063	120
611.988889	615.052608	121
616.877778	620.270748	122
622.534921	625.598639	123
626.855102	627.165079	124
629.628798	630.517460	125
633.879138	634.628118	126
636.203855	638.170068	127
639.037415	639.856236	128
643.726757	650.053061	129
651.100000	651.958730	130
652.726304	655.580499	131
658.483220	662.794104	132
666.365306	668.930159	133
672.082313	672.571882	134
677.789342	679.326531	135
682.219274	682.529252	136
684.464172	684.794104	137
685.661451	687.058957	138
688.275510	689.543311	139
692.316327	693.135147	140
699.070975	700.867574	141
705.675964	706.175510	142
708.848753	719.844444	143
724.064172	727.646712	144
728.913152	729.961451	145
732.634694	733.573243	146
734.809751	735.788209	147
736.904989	739.519728	148
741.514512	741.824490	149
745.954422	750.155556	150
752.329932	753.158730	151
754.804308	758.147392	152
760.251927	760.721542	153
768.044218	768.863039	154
769.780272	773.113379	155
779.977098	782.043084	156
793.286848	796.410431	157
808.232880	809.051701	158
813.081859	824.107483	159
824.974830	826.392290	160
829.334921	830.373243	161
838.653741	839.033560	162
855.256009	858.000454	163
860.583900	863.587755	164
870.481406	872.158277	165
878.363492	882.355102	166
883.631519	893.400000	167
898.527664	900.473923	168
901.301361	904.804082	169
920.208390	920.518367	170
934.585714	935.743764	171
943.555329	944.473923	172
945.860091	951.118821	173
952.574830	953.343764	174
971.082766	971.751927	175
978.376190	978.895692	176
982.736281	985.321088	177
987.395692	987.765533	178
988.782540	995.517914	179
996.325397	998.570975	180
1002.890476	1004.158277	181
1010.463265	1013.417234	182
1035.256916	1035.586848	183
1036.603855	1037.043537	184
1051.500000	1054.114739	185
1058.324490	1060.350567	186
1061.826531	1062.356009	187
1063.103628	1064.082086	188
1067.723129	1068.033107	189
1070.766213	1072.024036	190
1072.821542	1075.575964	191
1076.972109	1077.411791	192
1079.596145	1084.156463	193
1086.570295	1088.795918	194
1089.563492	1090.531973	195
1110.436054	1112.801361	196
1114.267347	1114.896599	197
1115.843764	1121.192290	198
1123.446485	1124.704308	199
1125.601587	1126.699773	200
1128.026077	1128.505669	201
1129.552608	1133.893424	202
1137.564399	1139.790023	203
1142.283673	1142.663492	204
1143.630612	1146.654422	205
1148.260091	1150.016780	206
1151.333107	1151.673016	207
1154.186621	1154.496599	208
1155.912698	1156.541950	209
1160.352608	1163.995011	210
1167.675964	1175.229478	211
1186.902268	1191.871655	212
1195.243311	1195.682993	213
1197.268707	1199.943311	214
1200.770748	1201.100680	215
1205.500000	1206.318821	216
1212.055102	1212.963719	217
1214.529478	1216.066667	218
1221.812925	1222.122902	219
1225.604308	1227.011791	220
1233.057370	1235.522449	221
1240.221088	1240.560998	222
1241.318594	1241.917914	223
1243.443764	1244.063039	224
1245.169841	1245.579592	225
1246.776190	1247.744671	226
1248.711791	1253.760998	227
1255.157143	1255.736508	228
1256.733560	1258.520181	229
1260.205669	1265.713832	230
1266.660998	1269.634921	231
1271.390249	1272.767800	232
1275.790249	1276.868481	233
1278.643764	1279.781859	234
1280.709070	1283.762812	235
1284.989342	1285.887982	236
1288.132200	1288.442177	237
1289.539002	1290.038549	238
1290.766213	1291.465306	239
1292.242857	1295.246712	240
1304.684580	1305.732880	241
1308.426077	1317.246712	242
1319.850113	1320.629025	243
1322.224717	1322.554649	244
1323.701361	1326.286168	245
1327.472789	1334.118367	246
1335.404762	1336.103855	247
1336.911338	1337.650340	248
1338.846939	1340.922902	249
1342.139456	1352.716100	250
1353.713152	1354.521995	251
1356.516780	1358.024036	252
1372.201134	1373.738322	253
1376.271882	1378.188209	254
1382.298186	1384.104762	255
1386.069615	1386.419501	256
1394.370748	1396.117460	257
1401.285034	1402.872109	258
1408.039683	1408.409524	259
1423.843764	1424.293424	260
1427.505442	1435.797279	261
1436.894104	1437.862585	262
1440.007029	1443.250340	263
1448.537642	1449.885261	264
1450.982086	1452.259864	265
1458.455102	1461.239456	266
1462.924943	1466.497506	267
1467.614286	1470.348753	268
1474.179365	1474.998186	269
1479.247846	1481.922449	270
1483.897279	1484.526531	271
1486.900454	1489.485261	272
1491.390249	1492.638095	273
1508.960317	1510.497506	274
1513.160771	1523.577778	275
1531.409297	1532.786848	276
1537.615193	1545.817234	277
1547.622449	1558.668027	278
1559.525397	1569.283900	279
1570.440590	1572.716100	280
1575.499093	1576.078458	281
1576.985714	1577.664853	282
1581.924490	1583.062585	283
1588.988435	1589.318367	284
1590.534921	1592.092063	285
1595.473696	1596.761451	286
1599.225170	1601.231293	287
1602.318141	1603.925170	288
1604.652834	1606.000454	289
1606.957596	1607.287528	290
1608.065079	1608.953741	291
1611.537188	1611.917007	292
1613.073696	1613.383673	293
1615.248753	1616.815873	294
1627.790249	1632.839456	295
1639.882766	1640.422222	296
1641.718594	1642.258050	297
1645.539909	1645.909751	298
1657.163492	1657.752834	299
1659.967120	1663.190476	300
1666.841497	1668.019501	301
1671.810204	1672.828571	302
1673.586168	1674.095692	303
1677.846485	1680.401361	304
1681.737642	1683.175057	305
1684.182086	1686.098413	306
1687.903628	1688.732426	307
1689.659637	1690.378685	308
1691.545351	1692.424036	309
1693.351247	1696.385034	310
1698.010658	1699.617687	311
1701.382993	1702.072109	312
1703.907256	1704.995465	313
1710.791610	1719.781859	314
1720.569388	1728.232653	315
1731.853741	1735.416327	316
1738.348980	1738.778685	317
1748.036961	1749.873469	318
1754.751701	1763.392744	319
1764.928571	1767.992290	320
1769.139002	1772.162812	321
1773.080045	1773.609524	322
1776.133107	1780.673469	323
1793.992517	1796.417687	324
1799.639683	1800.009524	325
1806.304535	1806.624490	326
1810.405215	1812.231746	327
1814.416100	1815.574150	328
1848.149433	1849.197732	329
1856.500454	1856.880272	330
1860.381633	1860.871202	331
1863.494558	1864.662585	332
1865.410204	1869.292063	333
1870.079592	1879.688435	334
1881.124490	1892.609070	335
1894.643764	1895.043537	336
1897.028345	1897.707483	337
1898.754422	1902.915646	338
1904.231973	1905.549660	339
1912.563039	1914.619048	340
1918.479592	1919.238549	341
1921.033787	1921.752834	342
1925.693197	1926.671655	343
1928.716327	1929.146032	344
1937.266893	1940.310658	345
1941.477324	1947.683900	346
1951.424717	1951.994104	347
1953.080952	1953.390930	348
1954.747166	1957.721088	349
1960.224717	1961.412698	350
1963.557143	1964.735147	351
1965.532653	1966.870295	352
1968.166667	1969.324717	353
1970.860544	1972.457596	354
1973.215193	1975.580499	355
1977.146259	1977.615873	356
1980.259184	1980.619048	357
1986.295465	1987.323810	358
1988.041497	1988.900227	359
1990.366213	1994.337868	360
1995.454649	1996.822222	361
2006.539456	2008.316100	362
2009.173469	2011.957823	363
2015.808390	2017.305669	364
2020.178458	2021.506122	365
2023.161678	2026.574603	366
2029.387528	2032.690703	367
2038.865986	2039.415420	368
2041.879138	2042.239002	369
2043.216100	2043.815420	370
2046.588435	2048.165533	371
2049.491837	2050.609977	372
2052.105896	2055.129705	373
2056.465986	2057.813605	374
2063.380272	2063.740136	375
2065.944444	2069.417234	376
2072.040590	2082.387755	377
2083.484580	2085.201361	378
2087.545351	2088.144671	379
2092.843311	2098.670748	380
2099.847392	2102.352381	381
2108.148526	2111.840816	382
2116.300000	2117.787302	383
2122.575737	2123.344671	384
2134.518594	2136.035828	385
2140.225624	2151.450794	386
2152.437868	2154.284354	387
2157.486395	2160.111111	388
2163.732200	2165.578685	389
2166.865079	2168.362358	390
2177.530839	2178.609070	391
2180.873243	2181.302948	392
2184.674603	2185.074376	393
2194.432426	2197.067120	394
2198.223810	2200.938322	395
2202.853288	2208.870295	396
2218.707256	2219.705669	397
2221.460998	2222.040363	398
2224.174830	2225.821769	399
2227.008390	2231.269388	400
2238.881406	2241.166893	401
2243.989796	2245.297506	402
2248.449660	2254.177324	403
2255.942630	2257.709297	404
2262.896825	2263.905215	405
2266.518594	2267.576871	406
2269.102721	2269.412698	407
2276.575737	2277.125170	408
2281.005669	2282.602721	409
2286.303628	2287.830839	410
2291.611565	2303.485261	411
2304.202948	2304.981859	412
2305.759410	2306.638095	413
2307.455556	2312.834014	414
2325.115420	2325.804535	415
2331.201587	2336.270748	416
2337.786621	2338.096599	417
2343.164399	2347.684807	418
2348.402494	2350.219048	419
2354.668254	2357.243084	420
2360.036054	2365.404535	421
2369.045578	2369.495238	422
2375.211565	2376.748753	423
2382.205669	2383.633107	424
2394.717234	2395.695692	425
2398.758050	2402.480272	426
2403.686848	2403.996825	427
2410.102268	2410.581859	428
2411.479138	2413.215873	429
2414.103175	2415.490703	430
2419.261451	2420.249887	431
2424.230159	2424.769615	432
2426.365306	2427.862585	433
2435.943537	2441.940590	434
2444.992971	2448.804989	435
2450.141270	2451.309297	436
2452.475964	2452.985488	437
2455.269615	2460.987302	438
2461.954422	2462.324263	439
2473.997052	2475.514286	440
2478.626531	2480.383220	441
2483.475510	2484.154649	442
2485.291383	2488.395011	443
2493.363039	2494.391383	444
2498.032426	2499.250340	445
2501.125397	2502.253515	446
2505.984354	2508.698866	447
2510.204762	2512.121088	448
2513.397506	2513.807256	449
2516.241043	2517.738322	450
2519.753061	2523.904308	451
2525.110884	2530.908390	452
2533.042857	2536.934694	453
2541.104535	2543.679365	454
2544.646485	2545.355556	455
2546.163039	2549.306576	456
2556.120408	2559.034467	457
2562.017007	2562.506576	458
2563.613379	2564.302494	459
2565.289569	2568.981859	460
2569.779365	2570.199093	461
2571.036508	2571.396372	462
2577.880952	2579.926984	463
2586.072336	2591.939683	464
2592.677324	2593.855329	465
2594.772562	2601.647619	466
2602.604762	2603.702948	467
2606.695465	2611.465306	468
2612.621995	2613.231293	469
2614.807029	2617.471655	470
2618.997506	2626.421315	471
