problem, problem start, problem end, moi start, moi end, tts, correct, person initiating answer, person explaining
1A:, 0:05,  0:40,  0:27, 0:32, (27), Y, S1, No
2A:, 0:41, 1:46,  1:00, 1:24, (43), Y, S1, S2
3A:, 1:47,  2:49, 2:35, 2:38, (51), Y, S3, No
4A:, 2:52,  4:22, 3:55,  4:10, (78), Y, S1, No, 
1B:, 5:00, 7:07,  5:40, 6:37, (97), N, S3, No
2B:, 7:11, 8:26,  8:09, 8:18, (77), Y, S1, No
3B:, 8:32, 11:08,  10:30, 11:00, (148), Y, S1, No
4B:, 11:15, 12:21, 11:56, 12:00, (45), Y, S2, S1
1C:, 13:29, 14:36,  13:56, 14:03, (34), Y, S3, S3
2C:, 14:39, 16:48,  15:36, 16:02, (83), Y, S1, S2, 
3C:, 16:52, 17:45,  17:37, 17:40, (48), Y, S1, No
4C:, 17:47, 19:47, 19:26, 19:34, (107), Y, S1, No
1D:, 20:43, 21:55,  21:18,  21:41, (58), Y, S1, No
2D:, 21:59, 23:13,  22:30, 22:42, (43), Y, S1, No
3D:, 23:15, 25:13, 24:21, 24:25, (70), Y, S1, S3
4D:, 25:20, 30:08,  27:58, 28:59, (219), N, S1, S1
