problem, problem start, problem end, moi start, moi end, tts, correct, person initiating answer, person explaining
3A:, 1:13,  2:52, 2:20, 2:37, (84), Y, S7, No
4A:, 2:53,  6:18, 4:17, 4:34, (101), N, S7, No
1B, 7:22, 9:16, 8:37, 9:01, (99), Y, S8, No
2B:, 9:17,  11:51, 11:17, 11:40, (143), Y, S7, No
3B:, 11:52, 14:35, 13:42, 14:23, (158), Y, S7, No
4B:, 14:36, 19:08,  17:11, 18:14, (218), Y, S7, S7
1C:, 22:12, 26:02,  23:28, 23:44, (92), Y, S7, S9
2C:, 26:03, 29:57,  28:12, 28:47, (164), Y, S7, S8
3C:, 29:58, 34:31, 32:55, 34:18, (260), Y, S7, No
4C:, 34:32, 40:15, 36:57, 38:18, (226), Y, S7, No
1D:, 41:10, 43:05,  42:22, 42:52, (102), Y, S9, No
2D:, 43:06, 44:32,  43:59, 44:17, (71), Y, S7, No
3D:, 44:33, 46:36, 45:27, 45:56, (83), Y, S7, S9
4D:, 46:37, 49:38, 47:51,  48:41, (124), Y, S8, S7
